[dpdk-test-report] |FAILURE| pw51867[v4, 7/8] test/stack: add lock-free stack tests

sys_stv at intel.com sys_stv at intel.com
Thu Mar 28 19:08:57 CET 2019


Test-Label: Intel-compilation
Test-Status: FAILURE
http://dpdk.org/patch/51867

_Compilation issues_

Submitter: Gage Eads <gage.eads at intel.com>
Date: 2019-03-28 18:00:14
Reply_mail: 20190328180015.13878-8-gage.eads at intel.com
DPDK git baseline: Repo:dpdk-master, CommitID: efbcdaa55b9305bb3f0e799696c75a621ed60264

Build Summary: 26 Builds Done, 2 Successful, 24 Failures

Test environment and configuration as below:

OS: SUSE15
	Kernel Version: 4.12.14-lp150.12.22-default
	CPU info: Intel(R) Xeon(R) CPU E5-2699 v3 @ 2.30GHz
	GCC Version: gcc (SUSE Linux) 7.3.1 20180323 [gcc-7-branch revision 258812]
	Clang Version: 5.0.1 (tags/RELEASE_501/final 312548)
	x86_64-native-linuxapp-gcc

OS: CENTOS76
	Kernel Version: 3.10.0-957.5.1.el7.x86_64
	CPU info: Intel(R) Xeon(R) CPU E5-2699 v4 @ 2.20GHz
	GCC Version: gcc (GCC) 4.8.5 20150623 (Red Hat 4.8.5-36)
	Clang Version: 3.4.2 (tags/RELEASE_34/dot2-final)
	x86_64-native-linuxapp-gcc

OS: UBT144-32
	Kernel Version: 3.13.0-161-generic
	CPU info: Intel(R) Xeon(R) CPU E5-2699 v3 @ 2.30GHz
	GCC Version: gcc (Ubuntu 4.8.4-2ubuntu1~14.04.4) 4.8.4
	Clang Version: NA
	i686-native-linuxapp-gcc

OS: UBT164-32
	Kernel Version: 4.4.0-131-generic
	CPU info: Intel(R) Xeon(R) CPU E5-2699 v3 @ 2.30GHz
	GCC Version: gcc (Ubuntu 5.4.0-6ubuntu1~16.04.10) 5.4.0 20160609
	Clang Version: NA
	i686-native-linuxapp-gcc

OS: SUSE12
	Kernel Version: 4.4.73-5-default
	CPU info: Intel(R) Xeon(R) CPU E5-2699 v4 @ 2.20GHz
	GCC Version: gcc (SUSE Linux) 7.1.1 20170607 [gcc-7-branch revision 248970]
	Clang Version: 3.8.0 (tags/RELEASE_380/final 262553)
	x86_64-native-linuxapp-gcc

OS: FreeBSD12.0
	Kernel Version: 12.0-RC3
	CPU info: Intel(R) Xeon(R) CPU E5-2699 v3 @ 2.30GHz (2294.75-MHz K8-class CPU)
	GCC Version: gcc (FreeBSD Ports Collection) 7.3.0
	Clang Version: 6.0.1 (tags/RELEASE_601/final 335540) (based on LLVM 6.0.1)
	x86_64-native-bsdapp-clang
	x86_64-native-bsdapp-gcc

OS: UBT144-64
	Kernel Version: 4.2.0-27-generic
	CPU info: Intel(R) Xeon(R) CPU E5-2699 v3 @ 2.30GHz
	GCC Version: gcc (Ubuntu 4.8.4-2ubuntu1~14.04.4) 4.8.4
	Clang Version: 3.4-1ubuntu3 (tags/RELEASE_34/final) (based on LLVM 3.4)
	x86_64-native-linuxapp-gcc

OS: CENTOS75
	Kernel Version: 3.10.0-957.5.1.el7.x86_64
	CPU info: Intel(R) Xeon(R) CPU E5-2699 v4 @ 2.20GHz
	GCC Version: gcc (GCC) 4.8.5 20150623 (Red Hat 4.8.5-36)
	Clang Version: 3.4.2 (tags/RELEASE_34/dot2-final)
	x86_64-native-linuxapp-gcc

OS: UBT1804
	Kernel Version: 4.15.0-20-generic
	CPU info: Intel(R) Xeon(R) CPU E5-2699 v3 @ 2.30GHz
	GCC Version: gcc (Ubuntu 7.3.0-27ubuntu1~18.04) 7.3.0
	Clang Version: 6.0.0-1ubuntu2 (tags/RELEASE_600/final)
	x86_64-native-linuxapp-clang
	x86_64-native-linuxapp-gcc
	x86_64-native-linuxapp-icc

OS: UBT1810
	Kernel Version: 4.18.0-10-generic
	CPU info: Intel(R) Xeon(R) CPU E5-2699 v3 @ 2.30GHz
	GCC Version: gcc (Ubuntu 8.2.0-7ubuntu1) 8.2.0
	Clang Version: 7.0.0-3 (tags/RELEASE_700/final)
	x86_64-native-linuxapp-gcc

OS: RHEL74
	Kernel Version: 3.10.0-693.el7.x86_64
	CPU info: Intel(R) Xeon(R) CPU E5-2699 v4 @ 2.20GHz
	GCC Version: gcc (GCC) 4.8.5 20150623 (Red Hat 4.8.5-16)
	Clang Version: NA
	x86_64-native-linuxapp-gcc

OS: CENTOS74
	Kernel Version: 3.10.0-862.14.4.el7.x86_64
	CPU info: Intel(R) Xeon(R) CPU E5-2699 v4 @ 2.20GHz
	GCC Version: gcc (GCC) 4.8.5 20150623 (Red Hat 4.8.5-28)
	Clang Version: 3.4.2 (tags/RELEASE_34/dot2-final)
	x86_64-native-linuxapp-gcc

OS: FreeBSD11.2
	Kernel Version: 11.2-RELEASE
	CPU info: Intel(R) Xeon(R) CPU E5-2699 v3 @ 2.30GHz (2294.74-MHz K8-class CPU)
	GCC Version: gcc (FreeBSD Ports Collection) 6.4.0
	Clang Version: 6.0.0 (tags/RELEASE_600/final 326565) (based on LLVM 6.0.0)
	x86_64-native-bsdapp-gcc
	x86_64-native-bsdapp-clang

OS: UBT164-64
	Kernel Version: 4.4.0-47-generic
	CPU info: Intel(R) Xeon(R) CPU E5-2699 v3 @ 2.30GHz
	GCC Version: gcc (Ubuntu 5.4.0-6ubuntu1~16.04.10) 5.4.0 20160609
	Clang Version: 3.8.0-2ubuntu4 (tags/RELEASE_380/final)
	x86_64-native-linuxapp-gcc

OS: RHEL75
	Kernel Version: 3.10.0-862.el7.x86_64
	CPU info: Intel(R) Xeon(R) CPU E5-2699 v4 @ 2.20GHz
	GCC Version: gcc (GCC) 4.8.5 20150623 (Red Hat 4.8.5-28)
	Clang Version: NA
	x86_64-native-linuxapp-gcc

OS: RHEL76
	Kernel Version: 3.10.0-957.el7.x86_64
	CPU info: Intel(R) Xeon(R) CPU E5-2699 v4 @ 2.20GHz
	GCC Version: gcc (GCC) 4.8.5 20150623 (Red Hat 4.8.5-36)
	Clang Version: NA
	x86_64-native-linuxapp-gcc

OS: FC29
	Kernel Version: 4.18.16-300.fc29.x86_64
	CPU info: Intel(R) Xeon(R) CPU E5-2699 v4 @ 2.20GHz
	GCC Version: gcc (GCC) 8.2.1 20181215 (Red Hat 8.2.1-6)
	Clang Version: NA
	x86_64-native-linuxapp-gcc
	x86_64-native-linuxapp-clang
	x86_64-native-linuxapp-icc

OS: FC28
	Kernel Version: 4.16.3-301.fc28.x86_64
	CPU info: Intel(R) Xeon(R) CPU E5-2699 v4 @ 2.20GHz
	GCC Version: gcc (GCC) 8.1.1 20180712 (Red Hat 8.1.1-5)
	Clang Version: 6.0.1 (tags/RELEASE_601/final)
	x86_64-native-linuxapp-clang
	x86_64-native-linuxapp-gcc
	x86_64-native-linuxapp-icc

*Failed Build #1:
OS: UBT144-64
Target: x86_64-native-linuxapp-gcc
  SYMLINK-FILE include/generic/rte_rwlock.h
  SYMLINK-FILE include/generic/rte_ticketlock.h
  SYMLINK-FILE include/generic/rte_vect.h
  SYMLINK-FILE include/generic/rte_pause.h
  SYMLINK-FILE include/generic/rte_io.h
make[6]: warning:  Clock skew detected.  Your build may be incomplete.
== Build lib/librte_eal/linux
== Build lib/librte_eal/linux/eal
  SYMLINK-FILE include/exec-env/rte_kni_common.h
  CC eal.o
  CC eal_hugepage_info.o
--
  SYMLINK-FILE include/cmdline_rdline.h
  AR librte_ring.a
In file included from /tmp/UBT144-64_K4.2.0_GCC4.8.4/x86_64-native-linuxapp-gcc/2d534ae6c1284d209a18c3f049117219/dpdk/lib/librte_stack/rte_stack.h:97:0,
                 from /tmp/UBT144-64_K4.2.0_GCC4.8.4/x86_64-native-linuxapp-gcc/2d534ae6c1284d209a18c3f049117219/dpdk/lib/librte_stack/rte_stack.c:16:
/tmp/UBT144-64_K4.2.0_GCC4.8.4/x86_64-native-linuxapp-gcc/2d534ae6c1284d209a18c3f049117219/dpdk/lib/librte_stack/rte_stack_generic.h: In function ‘__rte_stack_lf_push’:
/tmp/UBT144-64_K4.2.0_GCC4.8.4/x86_64-native-linuxapp-gcc/2d534ae6c1284d209a18c3f049117219/dpdk/lib/librte_stack/rte_stack_generic.h:61:3: warning: implicit declaration of function ‘rte_atomic128_cmp_exchange’ [-Wimplicit-function-declaration]
   success = rte_atomic128_cmp_exchange(
   ^
/tmp/UBT144-64_K4.2.0_GCC4.8.4/x86_64-native-linuxapp-gcc/2d534ae6c1284d209a18c3f049117219/dpdk/lib/librte_stack/rte_stack_generic.h:61:3: warning: nested extern declaration of ‘rte_atomic128_cmp_exchange’ [-Wnested-externs]
/tmp/UBT144-64_K4.2.0_GCC4.8.4/x86_64-native-linuxapp-gcc/2d534ae6c1284d209a18c3f049117219/dpdk/lib/librte_stack/rte_stack_generic.h:62:6: error: ‘rte_int128_t’ undeclared (first use in this function)
     (rte_int128_t *)&list->head,
      ^
/tmp/UBT144-64_K4.2.0_GCC4.8.4/x86_64-native-linuxapp-gcc/2d534ae6c1284d209a18c3f049117219/dpdk/lib/librte_stack/rte_stack_generic.h:62:6: note: each undeclared identifier is reported only once for each function it appears in
/tmp/UBT144-64_K4.2.0_GCC4.8.4/x86_64-native-linuxapp-gcc/2d534ae6c1284d209a18c3f049117219/dpdk/lib/librte_stack/rte_stack_generic.h:62:20: error: expected expression before ‘)’ token
     (rte_int128_t *)&list->head,
                    ^
/tmp/UBT144-64_K4.2.0_GCC4.8.4/x86_64-native-linuxapp-gcc/2d534ae6c1284d209a18c3f049117219/dpdk/lib/librte_stack/rte_stack_generic.h:50:28: warning: variable ‘new_head’ set but not used [-Wunused-but-set-variable]
   struct rte_stack_lf_head new_head;
                            ^
/tmp/UBT144-64_K4.2.0_GCC4.8.4/x86_64-native-linuxapp-gcc/2d534ae6c1284d209a18c3f049117219/dpdk/lib/librte_stack/rte_stack_generic.h: In function ‘__rte_stack_lf_pop’:
/tmp/UBT144-64_K4.2.0_GCC4.8.4/x86_64-native-linuxapp-gcc/2d534ae6c1284d209a18c3f049117219/dpdk/lib/librte_stack/rte_stack_generic.h:140:6: error: ‘rte_int128_t’ undeclared (first use in this function)
     (rte_int128_t *)&list->head,
      ^
/tmp/UBT144-64_K4.2.0_GCC4.8.4/x86_64-native-linuxapp-gcc/2d534ae6c1284d209a18c3f049117219/dpdk/lib/librte_stack/rte_stack_generic.h:140:20: error: expected expression before ‘)’ token
     (rte_int128_t *)&list->head,
                    ^
/tmp/UBT144-64_K4.2.0_GCC4.8.4/x86_64-native-linuxapp-gcc/2d534ae6c1284d209a18c3f049117219/dpdk/lib/librte_stack/rte_stack_generic.h:107:28: warning: variable ‘new_head’ set but not used [-Wunused-but-set-variable]
   struct rte_stack_lf_head new_head;
                            ^
make[5]: *** [rte_stack.o] Error 1
make[4]: *** [librte_stack] Error 2
make[4]: *** Waiting for unfinished jobs....

*Failed Build #2:
OS: UBT164-64
Target: x86_64-native-linuxapp-gcc
  SYMLINK-FILE include/generic/rte_rwlock.h
  SYMLINK-FILE include/generic/rte_ticketlock.h
  SYMLINK-FILE include/generic/rte_vect.h
  SYMLINK-FILE include/generic/rte_pause.h
  SYMLINK-FILE include/generic/rte_io.h
make[6]: warning:  Clock skew detected.  Your build may be incomplete.
== Build lib/librte_eal/linux
== Build lib/librte_eal/linux/eal
  SYMLINK-FILE include/exec-env/rte_kni_common.h
  CC eal.o
  CC eal_hugepage_info.o
--
  CC rte_ring.o
  CC rte_jobstats.o
In file included from /tmp/UBT164-64_K4.4.0_GCC5.4.0/x86_64-native-linuxapp-gcc/2d534ae6c1284d209a18c3f049117219/dpdk/lib/librte_stack/rte_stack.h:97:0,
                 from /tmp/UBT164-64_K4.4.0_GCC5.4.0/x86_64-native-linuxapp-gcc/2d534ae6c1284d209a18c3f049117219/dpdk/lib/librte_stack/rte_stack.c:16:
/tmp/UBT164-64_K4.4.0_GCC5.4.0/x86_64-native-linuxapp-gcc/2d534ae6c1284d209a18c3f049117219/dpdk/lib/librte_stack/rte_stack_generic.h: In function ‘__rte_stack_lf_push’:
/tmp/UBT164-64_K4.4.0_GCC5.4.0/x86_64-native-linuxapp-gcc/2d534ae6c1284d209a18c3f049117219/dpdk/lib/librte_stack/rte_stack_generic.h:61:13: warning: implicit declaration of function ‘rte_atomic128_cmp_exchange’ [-Wimplicit-function-declaration]
   success = rte_atomic128_cmp_exchange(
             ^
/tmp/UBT164-64_K4.4.0_GCC5.4.0/x86_64-native-linuxapp-gcc/2d534ae6c1284d209a18c3f049117219/dpdk/lib/librte_stack/rte_stack_generic.h:61:3: warning: nested extern declaration of ‘rte_atomic128_cmp_exchange’ [-Wnested-externs]
   success = rte_atomic128_cmp_exchange(
   ^
/tmp/UBT164-64_K4.4.0_GCC5.4.0/x86_64-native-linuxapp-gcc/2d534ae6c1284d209a18c3f049117219/dpdk/lib/librte_stack/rte_stack_generic.h:62:6: error: ‘rte_int128_t’ undeclared (first use in this function)
     (rte_int128_t *)&list->head,
      ^
/tmp/UBT164-64_K4.4.0_GCC5.4.0/x86_64-native-linuxapp-gcc/2d534ae6c1284d209a18c3f049117219/dpdk/lib/librte_stack/rte_stack_generic.h:62:6: note: each undeclared identifier is reported only once for each function it appears in
/tmp/UBT164-64_K4.4.0_GCC5.4.0/x86_64-native-linuxapp-gcc/2d534ae6c1284d209a18c3f049117219/dpdk/lib/librte_stack/rte_stack_generic.h:62:20: error: expected expression before ‘)’ token
     (rte_int128_t *)&list->head,
                    ^
/tmp/UBT164-64_K4.4.0_GCC5.4.0/x86_64-native-linuxapp-gcc/2d534ae6c1284d209a18c3f049117219/dpdk/lib/librte_stack/rte_stack_generic.h:50:28: warning: variable ‘new_head’ set but not used [-Wunused-but-set-variable]
   struct rte_stack_lf_head new_head;
                            ^
/tmp/UBT164-64_K4.4.0_GCC5.4.0/x86_64-native-linuxapp-gcc/2d534ae6c1284d209a18c3f049117219/dpdk/lib/librte_stack/rte_stack_generic.h: In function ‘__rte_stack_lf_pop’:
/tmp/UBT164-64_K4.4.0_GCC5.4.0/x86_64-native-linuxapp-gcc/2d534ae6c1284d209a18c3f049117219/dpdk/lib/librte_stack/rte_stack_generic.h:140:6: error: ‘rte_int128_t’ undeclared (first use in this function)
     (rte_int128_t *)&list->head,
      ^
/tmp/UBT164-64_K4.4.0_GCC5.4.0/x86_64-native-linuxapp-gcc/2d534ae6c1284d209a18c3f049117219/dpdk/lib/librte_stack/rte_stack_generic.h:140:20: error: expected expression before ‘)’ token
     (rte_int128_t *)&list->head,
                    ^
/tmp/UBT164-64_K4.4.0_GCC5.4.0/x86_64-native-linuxapp-gcc/2d534ae6c1284d209a18c3f049117219/dpdk/lib/librte_stack/rte_stack_generic.h:107:28: warning: variable ‘new_head’ set but not used [-Wunused-but-set-variable]
   struct rte_stack_lf_head new_head;
                            ^
/tmp/UBT164-64_K4.4.0_GCC5.4.0/x86_64-native-linuxapp-gcc/2d534ae6c1284d209a18c3f049117219/dpdk/mk/internal/rte.compile-pre.mk:114: recipe for target 'rte_stack.o' failed
make[5]: *** [rte_stack.o] Error 1
/tmp/UBT164-64_K4.4.0_GCC5.4.0/x86_64-native-linuxapp-gcc/2d534ae6c1284d209a18c3f049117219/dpdk/mk/rte.subdir.mk:35: recipe for target 'librte_stack' failed
make[4]: *** [librte_stack] Error 2
make[4]: *** Waiting for unfinished jobs....
  CC rte_meter.o
  SYMLINK-FILE include/rte_acl_osdep.h
  SYMLINK-FILE include/cmdline_parse_num.h
--
  INSTALL-LIB librte_jobstats.a
  AR librte_cmdline.a
  INSTALL-LIB librte_cmdline.a
  AR librte_acl.a
  INSTALL-LIB librte_acl.a
/tmp/UBT164-64_K4.4.0_GCC5.4.0/x86_64-native-linuxapp-gcc/2d534ae6c1284d209a18c3f049117219/dpdk/mk/rte.sdkbuild.mk:46: recipe for target 'lib' failed
make[3]: *** [lib] Error 2
/tmp/UBT164-64_K4.4.0_GCC5.4.0/x86_64-native-linuxapp-gcc/2d534ae6c1284d209a18c3f049117219/dpdk/mk/rte.sdkroot.mk:98: recipe for target 'all' failed
make[2]: *** [all] Error 2
/tmp/UBT164-64_K4.4.0_GCC5.4.0/x86_64-native-linuxapp-gcc/2d534ae6c1284d209a18c3f049117219/dpdk/mk/rte.sdkinstall.mk:60: recipe for target 'pre_install' failed
make[1]: *** [pre_install] Error 2
/tmp/UBT164-64_K4.4.0_GCC5.4.0/x86_64-native-linuxapp-gcc/2d534ae6c1284d209a18c3f049117219/dpdk/mk/rte.sdkroot.mk:77: recipe for target 'install' failed
make: *** [install] Error 2

*Failed Build #3:
OS: UBT1804
Target: x86_64-native-linuxapp-clang
  SYMLINK-FILE include/generic/rte_rwlock.h
  SYMLINK-FILE include/generic/rte_ticketlock.h
  SYMLINK-FILE include/generic/rte_pause.h
  SYMLINK-FILE include/generic/rte_vect.h
  SYMLINK-FILE include/generic/rte_io.h
make[6]: warning:  Clock skew detected.  Your build may be incomplete.
== Build lib/librte_eal/linux
== Build lib/librte_eal/linux/eal
  SYMLINK-FILE include/exec-env/rte_kni_common.h
  CC eal.o
  CC eal_cpuflags.o
--
  SYMLINK-FILE include/rte_acl.h
  CC rte_pci.o
  SYMLINK-FILE include/cmdline_parse_num.h
In file included from /tmp/UBT1804_K4.15.0_Clang6.0.0/x86_64-native-linuxapp-clang/2d534ae6c1284d209a18c3f049117219/dpdk/lib/librte_stack/rte_stack.c:16:
In file included from /tmp/UBT1804_K4.15.0_Clang6.0.0/x86_64-native-linuxapp-clang/2d534ae6c1284d209a18c3f049117219/dpdk/lib/librte_stack/rte_stack.h:97:
/tmp/UBT1804_K4.15.0_Clang6.0.0/x86_64-native-linuxapp-clang/2d534ae6c1284d209a18c3f049117219/dpdk/lib/librte_stack/rte_stack_generic.h:61:13: warning: implicit declaration of function 'rte_atomic128_cmp_exchange' is invalid in C99 [-Wimplicit-function-declaration]
                success = rte_atomic128_cmp_exchange(
                          ^
/tmp/UBT1804_K4.15.0_Clang6.0.0/x86_64-native-linuxapp-clang/2d534ae6c1284d209a18c3f049117219/dpdk/lib/librte_stack/rte_stack_generic.h:61:13: warning: this function declaration is not a prototype [-Wstrict-prototypes]
/tmp/UBT1804_K4.15.0_Clang6.0.0/x86_64-native-linuxapp-clang/2d534ae6c1284d209a18c3f049117219/dpdk/lib/librte_stack/rte_stack_generic.h:62:20: error: expected expression
                                (rte_int128_t *)&list->head,
                                               ^
/tmp/UBT1804_K4.15.0_Clang6.0.0/x86_64-native-linuxapp-clang/2d534ae6c1284d209a18c3f049117219/dpdk/lib/librte_stack/rte_stack_generic.h:62:6: error: use of undeclared identifier 'rte_int128_t'
                                (rte_int128_t *)&list->head,
                                 ^
  CC tb_mem.o
  CC rte_jobstats.o
/tmp/UBT1804_K4.15.0_Clang6.0.0/x86_64-native-linuxapp-clang/2d534ae6c1284d209a18c3f049117219/dpdk/lib/librte_stack/rte_stack_generic.h:63:20: error: expected expression
                                (rte_int128_t *)&old_head,
                                               ^
/tmp/UBT1804_K4.15.0_Clang6.0.0/x86_64-native-linuxapp-clang/2d534ae6c1284d209a18c3f049117219/dpdk/lib/librte_stack/rte_stack_generic.h:63:6: error: use of undeclared identifier 'rte_int128_t'
                                (rte_int128_t *)&old_head,
                                 ^
/tmp/UBT1804_K4.15.0_Clang6.0.0/x86_64-native-linuxapp-clang/2d534ae6c1284d209a18c3f049117219/dpdk/lib/librte_stack/rte_stack_generic.h:64:20: error: expected expression
                                (rte_int128_t *)&new_head,
                                               ^
/tmp/UBT1804_K4.15.0_Clang6.0.0/x86_64-native-linuxapp-clang/2d534ae6c1284d209a18c3f049117219/dpdk/lib/librte_stack/rte_stack_generic.h:64:6: error: use of undeclared identifier 'rte_int128_t'
                                (rte_int128_t *)&new_head,
                                 ^
/tmp/UBT1804_K4.15.0_Clang6.0.0/x86_64-native-linuxapp-clang/2d534ae6c1284d209a18c3f049117219/dpdk/lib/librte_stack/rte_stack_generic.h:139:13: warning: implicit declaration of function 'rte_atomic128_cmp_exchange' is invalid in C99 [-Wimplicit-function-declaration]
                success = rte_atomic128_cmp_exchange(
                          ^
/tmp/UBT1804_K4.15.0_Clang6.0.0/x86_64-native-linuxapp-clang/2d534ae6c1284d209a18c3f049117219/dpdk/lib/librte_stack/rte_stack_generic.h:140:20: error: expected expression
                                (rte_int128_t *)&list->head,
                                               ^
/tmp/UBT1804_K4.15.0_Clang6.0.0/x86_64-native-linuxapp-clang/2d534ae6c1284d209a18c3f049117219/dpdk/lib/librte_stack/rte_stack_generic.h:140:6: error: use of undeclared identifier 'rte_int128_t'
                                (rte_int128_t *)&list->head,
                                 ^
/tmp/UBT1804_K4.15.0_Clang6.0.0/x86_64-native-linuxapp-clang/2d534ae6c1284d209a18c3f049117219/dpdk/lib/librte_stack/rte_stack_generic.h:141:20: error: expected expression
                                (rte_int128_t *)&old_head,
                                               ^
/tmp/UBT1804_K4.15.0_Clang6.0.0/x86_64-native-linuxapp-clang/2d534ae6c1284d209a18c3f049117219/dpdk/lib/librte_stack/rte_stack_generic.h:141:6: error: use of undeclared identifier 'rte_int128_t'
                                (rte_int128_t *)&old_head,
                                 ^
/tmp/UBT1804_K4.15.0_Clang6.0.0/x86_64-native-linuxapp-clang/2d534ae6c1284d209a18c3f049117219/dpdk/lib/librte_stack/rte_stack_generic.h:142:20: error: expected expression
                                (rte_int128_t *)&new_head,
                                               ^
/tmp/UBT1804_K4.15.0_Clang6.0.0/x86_64-native-linuxapp-clang/2d534ae6c1284d209a18c3f049117219/dpdk/lib/librte_stack/rte_stack_generic.h:142:6: error: use of undeclared identifier 'rte_int128_t'
                                (rte_int128_t *)&new_head,
                                 ^
3 warnings and 12 errors generated.
/tmp/UBT1804_K4.15.0_Clang6.0.0/x86_64-native-linuxapp-clang/2d534ae6c1284d209a18c3f049117219/dpdk/mk/internal/rte.compile-pre.mk:114: recipe for target 'rte_stack.o' failed
make[5]: *** [rte_stack.o] Error 1
/tmp/UBT1804_K4.15.0_Clang6.0.0/x86_64-native-linuxapp-clang/2d534ae6c1284d209a18c3f049117219/dpdk/mk/rte.subdir.mk:35: recipe for target 'librte_stack' failed
make[4]: *** [librte_stack] Error 2
make[4]: *** Waiting for unfinished jobs....
  SYMLINK-FILE include/cmdline_parse_ipaddr.h
  CC rte_ring.o
  CC rte_acl.o
--
  CC cmdline_parse_portlist.o
  AR librte_cmdline.a
  INSTALL-LIB librte_cmdline.a
  AR librte_acl.a
  INSTALL-LIB librte_acl.a
/tmp/UBT1804_K4.15.0_Clang6.0.0/x86_64-native-linuxapp-clang/2d534ae6c1284d209a18c3f049117219/dpdk/mk/rte.sdkbuild.mk:46: recipe for target 'lib' failed
make[3]: *** [lib] Error 2
/tmp/UBT1804_K4.15.0_Clang6.0.0/x86_64-native-linuxapp-clang/2d534ae6c1284d209a18c3f049117219/dpdk/mk/rte.sdkroot.mk:98: recipe for target 'all' failed
make[2]: *** [all] Error 2
/tmp/UBT1804_K4.15.0_Clang6.0.0/x86_64-native-linuxapp-clang/2d534ae6c1284d209a18c3f049117219/dpdk/mk/rte.sdkinstall.mk:60: recipe for target 'pre_install' failed
make[1]: *** [pre_install] Error 2
/tmp/UBT1804_K4.15.0_Clang6.0.0/x86_64-native-linuxapp-clang/2d534ae6c1284d209a18c3f049117219/dpdk/mk/rte.sdkroot.mk:77: recipe for target 'install' failed
make: *** [install] Error 2

*Failed Build #4:
OS: UBT1804
Target: x86_64-native-linuxapp-gcc
  SYMLINK-FILE include/generic/rte_rwlock.h
  SYMLINK-FILE include/generic/rte_ticketlock.h
  SYMLINK-FILE include/generic/rte_vect.h
  SYMLINK-FILE include/generic/rte_pause.h
  SYMLINK-FILE include/generic/rte_io.h
make[6]: warning:  Clock skew detected.  Your build may be incomplete.
== Build lib/librte_eal/linux
== Build lib/librte_eal/linux/eal
  SYMLINK-FILE include/exec-env/rte_kni_common.h
  CC eal.o
  CC eal_cpuflags.o
--
In file included from /tmp/UBT1804_K4.15.0_GCC7.3.0/x86_64-native-linuxapp-gcc/2d534ae6c1284d209a18c3f049117219/dpdk/lib/librte_stack/rte_stack.h:97:0,
                 from /tmp/UBT1804_K4.15.0_GCC7.3.0/x86_64-native-linuxapp-gcc/2d534ae6c1284d209a18c3f049117219/dpdk/lib/librte_stack/rte_stack.c:16:
/tmp/UBT1804_K4.15.0_GCC7.3.0/x86_64-native-linuxapp-gcc/2d534ae6c1284d209a18c3f049117219/dpdk/lib/librte_stack/rte_stack_generic.h: In function ‘__rte_stack_lf_push’:
  AR librte_jobstats.a
  INSTALL-LIB librte_timer.a
/tmp/UBT1804_K4.15.0_GCC7.3.0/x86_64-native-linuxapp-gcc/2d534ae6c1284d209a18c3f049117219/dpdk/lib/librte_stack/rte_stack_generic.h:61:13: warning: implicit declaration of function ‘rte_atomic128_cmp_exchange’; did you mean ‘rte_atomic32_exchange’? [-Wimplicit-function-declaration]
   success = rte_atomic128_cmp_exchange(
             ^~~~~~~~~~~~~~~~~~~~~~~~~~
             rte_atomic32_exchange
/tmp/UBT1804_K4.15.0_GCC7.3.0/x86_64-native-linuxapp-gcc/2d534ae6c1284d209a18c3f049117219/dpdk/lib/librte_stack/rte_stack_generic.h:61:13: warning: nested extern declaration of ‘rte_atomic128_cmp_exchange’ [-Wnested-externs]
/tmp/UBT1804_K4.15.0_GCC7.3.0/x86_64-native-linuxapp-gcc/2d534ae6c1284d209a18c3f049117219/dpdk/lib/librte_stack/rte_stack_generic.h:62:6: error: ‘rte_int128_t’ undeclared (first use in this function); did you mean ‘__int128_t’?
     (rte_int128_t *)&list->head,
      ^~~~~~~~~~~~
      __int128_t
/tmp/UBT1804_K4.15.0_GCC7.3.0/x86_64-native-linuxapp-gcc/2d534ae6c1284d209a18c3f049117219/dpdk/lib/librte_stack/rte_stack_generic.h:62:6: note: each undeclared identifier is reported only once for each function it appears in
/tmp/UBT1804_K4.15.0_GCC7.3.0/x86_64-native-linuxapp-gcc/2d534ae6c1284d209a18c3f049117219/dpdk/lib/librte_stack/rte_stack_generic.h:62:20: error: expected expression before ‘)’ token
     (rte_int128_t *)&list->head,
                    ^
/tmp/UBT1804_K4.15.0_GCC7.3.0/x86_64-native-linuxapp-gcc/2d534ae6c1284d209a18c3f049117219/dpdk/lib/librte_stack/rte_stack_generic.h:50:28: warning: variable ‘new_head’ set but not used [-Wunused-but-set-variable]
   struct rte_stack_lf_head new_head;
                            ^~~~~~~~
/tmp/UBT1804_K4.15.0_GCC7.3.0/x86_64-native-linuxapp-gcc/2d534ae6c1284d209a18c3f049117219/dpdk/lib/librte_stack/rte_stack_generic.h: In function ‘__rte_stack_lf_pop’:
/tmp/UBT1804_K4.15.0_GCC7.3.0/x86_64-native-linuxapp-gcc/2d534ae6c1284d209a18c3f049117219/dpdk/lib/librte_stack/rte_stack_generic.h:140:6: error: ‘rte_int128_t’ undeclared (first use in this function); did you mean ‘__int128_t’?
     (rte_int128_t *)&list->head,
      ^~~~~~~~~~~~
      __int128_t
/tmp/UBT1804_K4.15.0_GCC7.3.0/x86_64-native-linuxapp-gcc/2d534ae6c1284d209a18c3f049117219/dpdk/lib/librte_stack/rte_stack_generic.h:140:20: error: expected expression before ‘)’ token
     (rte_int128_t *)&list->head,
                    ^
/tmp/UBT1804_K4.15.0_GCC7.3.0/x86_64-native-linuxapp-gcc/2d534ae6c1284d209a18c3f049117219/dpdk/lib/librte_stack/rte_stack_generic.h:107:28: warning: variable ‘new_head’ set but not used [-Wunused-but-set-variable]
   struct rte_stack_lf_head new_head;
                            ^~~~~~~~
/tmp/UBT1804_K4.15.0_GCC7.3.0/x86_64-native-linuxapp-gcc/2d534ae6c1284d209a18c3f049117219/dpdk/mk/internal/rte.compile-pre.mk:114: recipe for target 'rte_stack.o' failed
make[5]: *** [rte_stack.o] Error 1
/tmp/UBT1804_K4.15.0_GCC7.3.0/x86_64-native-linuxapp-gcc/2d534ae6c1284d209a18c3f049117219/dpdk/mk/rte.subdir.mk:35: recipe for target 'librte_stack' failed
make[4]: *** [librte_stack] Error 2
make[4]: *** Waiting for unfinished jobs....
  SYMLINK-FILE include/cmdline_socket.h
  INSTALL-LIB librte_jobstats.a
  AR librte_pci.a
--
  CC cmdline_parse_portlist.o
  AR librte_cmdline.a
  INSTALL-LIB librte_cmdline.a
  AR librte_acl.a
  INSTALL-LIB librte_acl.a
/tmp/UBT1804_K4.15.0_GCC7.3.0/x86_64-native-linuxapp-gcc/2d534ae6c1284d209a18c3f049117219/dpdk/mk/rte.sdkbuild.mk:46: recipe for target 'lib' failed
make[3]: *** [lib] Error 2
/tmp/UBT1804_K4.15.0_GCC7.3.0/x86_64-native-linuxapp-gcc/2d534ae6c1284d209a18c3f049117219/dpdk/mk/rte.sdkroot.mk:98: recipe for target 'all' failed
make[2]: *** [all] Error 2
/tmp/UBT1804_K4.15.0_GCC7.3.0/x86_64-native-linuxapp-gcc/2d534ae6c1284d209a18c3f049117219/dpdk/mk/rte.sdkinstall.mk:60: recipe for target 'pre_install' failed
make[1]: *** [pre_install] Error 2
/tmp/UBT1804_K4.15.0_GCC7.3.0/x86_64-native-linuxapp-gcc/2d534ae6c1284d209a18c3f049117219/dpdk/mk/rte.sdkroot.mk:77: recipe for target 'install' failed
make: *** [install] Error 2

*Failed Build #5:
OS: UBT1804
Target: x86_64-native-linuxapp-icc
  SYMLINK-FILE include/generic/rte_spinlock.h
  SYMLINK-FILE include/generic/rte_ticketlock.h
  SYMLINK-FILE include/generic/rte_vect.h
  SYMLINK-FILE include/generic/rte_pause.h
  SYMLINK-FILE include/generic/rte_io.h
make[6]: warning:  Clock skew detected.  Your build may be incomplete.
== Build lib/librte_eal/linux
== Build lib/librte_eal/linux/eal
  SYMLINK-FILE include/exec-env/rte_kni_common.h
  CC eal.o
  CC eal_cpuflags.o
--
  INSTALL-LIB librte_metrics.a
  INSTALL-LIB librte_pci.a
  SYMLINK-FILE include/cmdline_cirbuf.h
In file included from /tmp/UBT1804_K4.15.0_ICC19.0.0/x86_64-native-linuxapp-icc/2d534ae6c1284d209a18c3f049117219/dpdk/lib/librte_stack/rte_stack.h(97),
                 from /tmp/UBT1804_K4.15.0_ICC19.0.0/x86_64-native-linuxapp-icc/2d534ae6c1284d209a18c3f049117219/dpdk/lib/librte_stack/rte_stack.c(16):
/tmp/UBT1804_K4.15.0_ICC19.0.0/x86_64-native-linuxapp-icc/2d534ae6c1284d209a18c3f049117219/dpdk/lib/librte_stack/rte_stack_generic.h(61): warning #266: function "rte_atomic128_cmp_exchange" declared implicitly
  		success = rte_atomic128_cmp_exchange(
  		          ^

In file included from /tmp/UBT1804_K4.15.0_ICC19.0.0/x86_64-native-linuxapp-icc/2d534ae6c1284d209a18c3f049117219/dpdk/lib/librte_stack/rte_stack.h(97),
                 from /tmp/UBT1804_K4.15.0_ICC19.0.0/x86_64-native-linuxapp-icc/2d534ae6c1284d209a18c3f049117219/dpdk/lib/librte_stack/rte_stack.c(16):
/tmp/UBT1804_K4.15.0_ICC19.0.0/x86_64-native-linuxapp-icc/2d534ae6c1284d209a18c3f049117219/dpdk/lib/librte_stack/rte_stack_generic.h(62): error: identifier "rte_int128_t" is undefined
  				(rte_int128_t *)&list->head,
  				 ^

In file included from /tmp/UBT1804_K4.15.0_ICC19.0.0/x86_64-native-linuxapp-icc/2d534ae6c1284d209a18c3f049117219/dpdk/lib/librte_stack/rte_stack.h(97),
                 from /tmp/UBT1804_K4.15.0_ICC19.0.0/x86_64-native-linuxapp-icc/2d534ae6c1284d209a18c3f049117219/dpdk/lib/librte_stack/rte_stack.c(16):
/tmp/UBT1804_K4.15.0_ICC19.0.0/x86_64-native-linuxapp-icc/2d534ae6c1284d209a18c3f049117219/dpdk/lib/librte_stack/rte_stack_generic.h(62): error: expected an expression
  				(rte_int128_t *)&list->head,
  				               ^

In file included from /tmp/UBT1804_K4.15.0_ICC19.0.0/x86_64-native-linuxapp-icc/2d534ae6c1284d209a18c3f049117219/dpdk/lib/librte_stack/rte_stack.h(97),
                 from /tmp/UBT1804_K4.15.0_ICC19.0.0/x86_64-native-linuxapp-icc/2d534ae6c1284d209a18c3f049117219/dpdk/lib/librte_stack/rte_stack.c(16):
/tmp/UBT1804_K4.15.0_ICC19.0.0/x86_64-native-linuxapp-icc/2d534ae6c1284d209a18c3f049117219/dpdk/lib/librte_stack/rte_stack_generic.h(62): error: expression must have integral type
  				(rte_int128_t *)&list->head,
  				                 ^

In file included from /tmp/UBT1804_K4.15.0_ICC19.0.0/x86_64-native-linuxapp-icc/2d534ae6c1284d209a18c3f049117219/dpdk/lib/librte_stack/rte_stack.h(97),
                 from /tmp/UBT1804_K4.15.0_ICC19.0.0/x86_64-native-linuxapp-icc/2d534ae6c1284d209a18c3f049117219/dpdk/lib/librte_stack/rte_stack.c(16):
/tmp/UBT1804_K4.15.0_ICC19.0.0/x86_64-native-linuxapp-icc/2d534ae6c1284d209a18c3f049117219/dpdk/lib/librte_stack/rte_stack_generic.h(63): error: expected an expression
  				(rte_int128_t *)&old_head,
  				               ^

In file included from /tmp/UBT1804_K4.15.0_ICC19.0.0/x86_64-native-linuxapp-icc/2d534ae6c1284d209a18c3f049117219/dpdk/lib/librte_stack/rte_stack.h(97),
                 from /tmp/UBT1804_K4.15.0_ICC19.0.0/x86_64-native-linuxapp-icc/2d534ae6c1284d209a18c3f049117219/dpdk/lib/librte_stack/rte_stack.c(16):
/tmp/UBT1804_K4.15.0_ICC19.0.0/x86_64-native-linuxapp-icc/2d534ae6c1284d209a18c3f049117219/dpdk/lib/librte_stack/rte_stack_generic.h(63): error: expression must have integral type
  				(rte_int128_t *)&old_head,
  				                 ^

In file included from /tmp/UBT1804_K4.15.0_ICC19.0.0/x86_64-native-linuxapp-icc/2d534ae6c1284d209a18c3f049117219/dpdk/lib/librte_stack/rte_stack.h(97),
                 from /tmp/UBT1804_K4.15.0_ICC19.0.0/x86_64-native-linuxapp-icc/2d534ae6c1284d209a18c3f049117219/dpdk/lib/librte_stack/rte_stack.c(16):
/tmp/UBT1804_K4.15.0_ICC19.0.0/x86_64-native-linuxapp-icc/2d534ae6c1284d209a18c3f049117219/dpdk/lib/librte_stack/rte_stack_generic.h(64): error: expected an expression
  				(rte_int128_t *)&new_head,
  				               ^

In file included from /tmp/UBT1804_K4.15.0_ICC19.0.0/x86_64-native-linuxapp-icc/2d534ae6c1284d209a18c3f049117219/dpdk/lib/librte_stack/rte_stack.h(97),
                 from /tmp/UBT1804_K4.15.0_ICC19.0.0/x86_64-native-linuxapp-icc/2d534ae6c1284d209a18c3f049117219/dpdk/lib/librte_stack/rte_stack.c(16):
/tmp/UBT1804_K4.15.0_ICC19.0.0/x86_64-native-linuxapp-icc/2d534ae6c1284d209a18c3f049117219/dpdk/lib/librte_stack/rte_stack_generic.h(64): error: expression must have integral type
  				(rte_int128_t *)&new_head,
  				                 ^

In file included from /tmp/UBT1804_K4.15.0_ICC19.0.0/x86_64-native-linuxapp-icc/2d534ae6c1284d209a18c3f049117219/dpdk/lib/librte_stack/rte_stack.h(97),
                 from /tmp/UBT1804_K4.15.0_ICC19.0.0/x86_64-native-linuxapp-icc/2d534ae6c1284d209a18c3f049117219/dpdk/lib/librte_stack/rte_stack.c(16):
/tmp/UBT1804_K4.15.0_ICC19.0.0/x86_64-native-linuxapp-icc/2d534ae6c1284d209a18c3f049117219/dpdk/lib/librte_stack/rte_stack_generic.h(139): warning #266: function "rte_atomic128_cmp_exchange" declared implicitly
  		success = rte_atomic128_cmp_exchange(
  		          ^

In file included from /tmp/UBT1804_K4.15.0_ICC19.0.0/x86_64-native-linuxapp-icc/2d534ae6c1284d209a18c3f049117219/dpdk/lib/librte_stack/rte_stack.h(97),
                 from /tmp/UBT1804_K4.15.0_ICC19.0.0/x86_64-native-linuxapp-icc/2d534ae6c1284d209a18c3f049117219/dpdk/lib/librte_stack/rte_stack.c(16):
/tmp/UBT1804_K4.15.0_ICC19.0.0/x86_64-native-linuxapp-icc/2d534ae6c1284d209a18c3f049117219/dpdk/lib/librte_stack/rte_stack_generic.h(140): error: identifier "rte_int128_t" is undefined
  				(rte_int128_t *)&list->head,
  				 ^

In file included from /tmp/UBT1804_K4.15.0_ICC19.0.0/x86_64-native-linuxapp-icc/2d534ae6c1284d209a18c3f049117219/dpdk/lib/librte_stack/rte_stack.h(97),
                 from /tmp/UBT1804_K4.15.0_ICC19.0.0/x86_64-native-linuxapp-icc/2d534ae6c1284d209a18c3f049117219/dpdk/lib/librte_stack/rte_stack.c(16):
/tmp/UBT1804_K4.15.0_ICC19.0.0/x86_64-native-linuxapp-icc/2d534ae6c1284d209a18c3f049117219/dpdk/lib/librte_stack/rte_stack_generic.h(140): error: expected an expression
  				(rte_int128_t *)&list->head,
  				               ^

In file included from /tmp/UBT1804_K4.15.0_ICC19.0.0/x86_64-native-linuxapp-icc/2d534ae6c1284d209a18c3f049117219/dpdk/lib/librte_stack/rte_stack.h(97),
                 from /tmp/UBT1804_K4.15.0_ICC19.0.0/x86_64-native-linuxapp-icc/2d534ae6c1284d209a18c3f049117219/dpdk/lib/librte_stack/rte_stack.c(16):
/tmp/UBT1804_K4.15.0_ICC19.0.0/x86_64-native-linuxapp-icc/2d534ae6c1284d209a18c3f049117219/dpdk/lib/librte_stack/rte_stack_generic.h(140): error: expression must have integral type
  				(rte_int128_t *)&list->head,
  				                 ^

In file included from /tmp/UBT1804_K4.15.0_ICC19.0.0/x86_64-native-linuxapp-icc/2d534ae6c1284d209a18c3f049117219/dpdk/lib/librte_stack/rte_stack.h(97),
                 from /tmp/UBT1804_K4.15.0_ICC19.0.0/x86_64-native-linuxapp-icc/2d534ae6c1284d209a18c3f049117219/dpdk/lib/librte_stack/rte_stack.c(16):
/tmp/UBT1804_K4.15.0_ICC19.0.0/x86_64-native-linuxapp-icc/2d534ae6c1284d209a18c3f049117219/dpdk/lib/librte_stack/rte_stack_generic.h(141): error: expected an expression
  				(rte_int128_t *)&old_head,
  				               ^

In file included from /tmp/UBT1804_K4.15.0_ICC19.0.0/x86_64-native-linuxapp-icc/2d534ae6c1284d209a18c3f049117219/dpdk/lib/librte_stack/rte_stack.h(97),
                 from /tmp/UBT1804_K4.15.0_ICC19.0.0/x86_64-native-linuxapp-icc/2d534ae6c1284d209a18c3f049117219/dpdk/lib/librte_stack/rte_stack.c(16):
/tmp/UBT1804_K4.15.0_ICC19.0.0/x86_64-native-linuxapp-icc/2d534ae6c1284d209a18c3f049117219/dpdk/lib/librte_stack/rte_stack_generic.h(141): error: expression must have integral type
  				(rte_int128_t *)&old_head,
  				                 ^

In file included from /tmp/UBT1804_K4.15.0_ICC19.0.0/x86_64-native-linuxapp-icc/2d534ae6c1284d209a18c3f049117219/dpdk/lib/librte_stack/rte_stack.h(97),
                 from /tmp/UBT1804_K4.15.0_ICC19.0.0/x86_64-native-linuxapp-icc/2d534ae6c1284d209a18c3f049117219/dpdk/lib/librte_stack/rte_stack.c(16):
/tmp/UBT1804_K4.15.0_ICC19.0.0/x86_64-native-linuxapp-icc/2d534ae6c1284d209a18c3f049117219/dpdk/lib/librte_stack/rte_stack_generic.h(142): error: expected an expression
  				(rte_int128_t *)&new_head,
  				               ^

In file included from /tmp/UBT1804_K4.15.0_ICC19.0.0/x86_64-native-linuxapp-icc/2d534ae6c1284d209a18c3f049117219/dpdk/lib/librte_stack/rte_stack.h(97),
                 from /tmp/UBT1804_K4.15.0_ICC19.0.0/x86_64-native-linuxapp-icc/2d534ae6c1284d209a18c3f049117219/dpdk/lib/librte_stack/rte_stack.c(16):
/tmp/UBT1804_K4.15.0_ICC19.0.0/x86_64-native-linuxapp-icc/2d534ae6c1284d209a18c3f049117219/dpdk/lib/librte_stack/rte_stack_generic.h(142): error: expression must have integral type
  				(rte_int128_t *)&new_head,
  				                 ^

compilation aborted for /tmp/UBT1804_K4.15.0_ICC19.0.0/x86_64-native-linuxapp-icc/2d534ae6c1284d209a18c3f049117219/dpdk/lib/librte_stack/rte_stack.c (code 2)
/tmp/UBT1804_K4.15.0_ICC19.0.0/x86_64-native-linuxapp-icc/2d534ae6c1284d209a18c3f049117219/dpdk/mk/internal/rte.compile-pre.mk:114: recipe for target 'rte_stack.o' failed
make[5]: *** [rte_stack.o] Error 2
  CC acl_bld.o
/tmp/UBT1804_K4.15.0_ICC19.0.0/x86_64-native-linuxapp-icc/2d534ae6c1284d209a18c3f049117219/dpdk/mk/rte.subdir.mk:35: recipe for target 'librte_stack' failed
make[4]: *** [librte_stack] Error 2
make[4]: *** Waiting for unfinished jobs....
  SYMLINK-FILE include/cmdline_parse_portlist.h
  CC acl_gen.o
  AR librte_jobstats.a
--
  CC cmdline_parse_portlist.o
  AR librte_cmdline.a
  INSTALL-LIB librte_cmdline.a
  AR librte_acl.a
  INSTALL-LIB librte_acl.a
/tmp/UBT1804_K4.15.0_ICC19.0.0/x86_64-native-linuxapp-icc/2d534ae6c1284d209a18c3f049117219/dpdk/mk/rte.sdkbuild.mk:46: recipe for target 'lib' failed
make[3]: *** [lib] Error 2
/tmp/UBT1804_K4.15.0_ICC19.0.0/x86_64-native-linuxapp-icc/2d534ae6c1284d209a18c3f049117219/dpdk/mk/rte.sdkroot.mk:98: recipe for target 'all' failed
make[2]: *** [all] Error 2
/tmp/UBT1804_K4.15.0_ICC19.0.0/x86_64-native-linuxapp-icc/2d534ae6c1284d209a18c3f049117219/dpdk/mk/rte.sdkinstall.mk:60: recipe for target 'pre_install' failed
make[1]: *** [pre_install] Error 2
/tmp/UBT1804_K4.15.0_ICC19.0.0/x86_64-native-linuxapp-icc/2d534ae6c1284d209a18c3f049117219/dpdk/mk/rte.sdkroot.mk:77: recipe for target 'install' failed
make: *** [install] Error 2

*Failed Build #6:
OS: UBT1810
Target: x86_64-native-linuxapp-gcc
  SYMLINK-FILE include/generic/rte_rwlock.h
  SYMLINK-FILE include/generic/rte_ticketlock.h
  SYMLINK-FILE include/generic/rte_vect.h
  SYMLINK-FILE include/generic/rte_pause.h
  SYMLINK-FILE include/generic/rte_io.h
make[6]: warning:  Clock skew detected.  Your build may be incomplete.
== Build lib/librte_eal/linux
== Build lib/librte_eal/linux/eal
  SYMLINK-FILE include/exec-env/rte_kni_common.h
  CC eal_cpuflags.o
  CC eal.o
--
  SYMLINK-FILE include/cmdline_parse.h
  SYMLINK-FILE include/rte_acl.h
In file included from /tmp/UBT1810_K4.18.0_GCC8.2.0/x86_64-native-linuxapp-gcc/2d534ae6c1284d209a18c3f049117219/dpdk/lib/librte_stack/rte_stack.h:97,
                 from /tmp/UBT1810_K4.18.0_GCC8.2.0/x86_64-native-linuxapp-gcc/2d534ae6c1284d209a18c3f049117219/dpdk/lib/librte_stack/rte_stack.c:16:
/tmp/UBT1810_K4.18.0_GCC8.2.0/x86_64-native-linuxapp-gcc/2d534ae6c1284d209a18c3f049117219/dpdk/lib/librte_stack/rte_stack_generic.h: In function ‘__rte_stack_lf_push’:
/tmp/UBT1810_K4.18.0_GCC8.2.0/x86_64-native-linuxapp-gcc/2d534ae6c1284d209a18c3f049117219/dpdk/lib/librte_stack/rte_stack_generic.h:61:13: warning: implicit declaration of function ‘rte_atomic128_cmp_exchange’; did you mean ‘rte_atomic32_exchange’? [-Wimplicit-function-declaration]
   success = rte_atomic128_cmp_exchange(
             ^~~~~~~~~~~~~~~~~~~~~~~~~~
             rte_atomic32_exchange
/tmp/UBT1810_K4.18.0_GCC8.2.0/x86_64-native-linuxapp-gcc/2d534ae6c1284d209a18c3f049117219/dpdk/lib/librte_stack/rte_stack_generic.h:61:13: warning: nested extern declaration of ‘rte_atomic128_cmp_exchange’ [-Wnested-externs]
/tmp/UBT1810_K4.18.0_GCC8.2.0/x86_64-native-linuxapp-gcc/2d534ae6c1284d209a18c3f049117219/dpdk/lib/librte_stack/rte_stack_generic.h:62:6: error: ‘rte_int128_t’ undeclared (first use in this function); did you mean ‘rte_iova_t’?
     (rte_int128_t *)&list->head,
      ^~~~~~~~~~~~
      rte_iova_t
/tmp/UBT1810_K4.18.0_GCC8.2.0/x86_64-native-linuxapp-gcc/2d534ae6c1284d209a18c3f049117219/dpdk/lib/librte_stack/rte_stack_generic.h:62:6: note: each undeclared identifier is reported only once for each function it appears in
/tmp/UBT1810_K4.18.0_GCC8.2.0/x86_64-native-linuxapp-gcc/2d534ae6c1284d209a18c3f049117219/dpdk/lib/librte_stack/rte_stack_generic.h:62:20: error: expected expression before ‘)’ token
     (rte_int128_t *)&list->head,
                    ^
/tmp/UBT1810_K4.18.0_GCC8.2.0/x86_64-native-linuxapp-gcc/2d534ae6c1284d209a18c3f049117219/dpdk/lib/librte_stack/rte_stack_generic.h:50:28: warning: variable ‘new_head’ set but not used [-Wunused-but-set-variable]
   struct rte_stack_lf_head new_head;
                            ^~~~~~~~
/tmp/UBT1810_K4.18.0_GCC8.2.0/x86_64-native-linuxapp-gcc/2d534ae6c1284d209a18c3f049117219/dpdk/lib/librte_stack/rte_stack_generic.h: In function ‘__rte_stack_lf_pop’:
/tmp/UBT1810_K4.18.0_GCC8.2.0/x86_64-native-linuxapp-gcc/2d534ae6c1284d209a18c3f049117219/dpdk/lib/librte_stack/rte_stack_generic.h:140:6: error: ‘rte_int128_t’ undeclared (first use in this function); did you mean ‘rte_iova_t’?
     (rte_int128_t *)&list->head,
      ^~~~~~~~~~~~
      rte_iova_t
/tmp/UBT1810_K4.18.0_GCC8.2.0/x86_64-native-linuxapp-gcc/2d534ae6c1284d209a18c3f049117219/dpdk/lib/librte_stack/rte_stack_generic.h:140:20: error: expected expression before ‘)’ token
     (rte_int128_t *)&list->head,
                    ^
/tmp/UBT1810_K4.18.0_GCC8.2.0/x86_64-native-linuxapp-gcc/2d534ae6c1284d209a18c3f049117219/dpdk/lib/librte_stack/rte_stack_generic.h:107:28: warning: variable ‘new_head’ set but not used [-Wunused-but-set-variable]
   struct rte_stack_lf_head new_head;
                            ^~~~~~~~
make[5]: *** [/tmp/UBT1810_K4.18.0_GCC8.2.0/x86_64-native-linuxapp-gcc/2d534ae6c1284d209a18c3f049117219/dpdk/mk/internal/rte.compile-pre.mk:116: rte_stack.o] Error 1
make[4]: *** [/tmp/UBT1810_K4.18.0_GCC8.2.0/x86_64-native-linuxapp-gcc/2d534ae6c1284d209a18c3f049117219/dpdk/mk/rte.subdir.mk:37: librte_stack] Error 2
make[4]: *** Waiting for unfinished jobs....

*Failed Build #7:
OS: FC28
Target: x86_64-native-linuxapp-clang
  SYMLINK-FILE include/cmdline_cirbuf.h
  INSTALL-LIB librte_ring.a
  AR librte_jobstats.a
In file included from /tmp/FC28_K4.16.3_Clang6.0.1/x86_64-native-linuxapp-clang/2d534ae6c1284d209a18c3f049117219/dpdk/lib/librte_stack/rte_stack.c:16:
In file included from /tmp/FC28_K4.16.3_Clang6.0.1/x86_64-native-linuxapp-clang/2d534ae6c1284d209a18c3f049117219/dpdk/lib/librte_stack/rte_stack.h:97:
/tmp/FC28_K4.16.3_Clang6.0.1/x86_64-native-linuxapp-clang/2d534ae6c1284d209a18c3f049117219/dpdk/lib/librte_stack/rte_stack_generic.h:61:13: warning: implicit declaration of function 'rte_atomic128_cmp_exchange' is invalid in C99 [-Wimplicit-function-declaration]
                success = rte_atomic128_cmp_exchange(
                          ^
/tmp/FC28_K4.16.3_Clang6.0.1/x86_64-native-linuxapp-clang/2d534ae6c1284d209a18c3f049117219/dpdk/lib/librte_stack/rte_stack_generic.h:61:13: warning: this function declaration is not a prototype [-Wstrict-prototypes]
/tmp/FC28_K4.16.3_Clang6.0.1/x86_64-native-linuxapp-clang/2d534ae6c1284d209a18c3f049117219/dpdk/lib/librte_stack/rte_stack_generic.h:62:20: error: expected expression
                                (rte_int128_t *)&list->head,
                                               ^
  INSTALL-LIB librte_jobstats.a
  CC acl_gen.o
  AR librte_metrics.a
  SYMLINK-FILE include/cmdline_parse_portlist.h
  CC acl_run_scalar.o
  INSTALL-LIB librte_metrics.a
  CC acl_run_sse.o
  CC cmdline.o
/tmp/FC28_K4.16.3_Clang6.0.1/x86_64-native-linuxapp-clang/2d534ae6c1284d209a18c3f049117219/dpdk/lib/librte_stack/rte_stack_generic.h:62:6: error: use of undeclared identifier 'rte_int128_t'
                                (rte_int128_t *)&list->head,
                                 ^
/tmp/FC28_K4.16.3_Clang6.0.1/x86_64-native-linuxapp-clang/2d534ae6c1284d209a18c3f049117219/dpdk/lib/librte_stack/rte_stack_generic.h:63:20: error: expected expression
                                (rte_int128_t *)&old_head,
                                               ^
/tmp/FC28_K4.16.3_Clang6.0.1/x86_64-native-linuxapp-clang/2d534ae6c1284d209a18c3f049117219/dpdk/lib/librte_stack/rte_stack_generic.h:63:6: error: use of undeclared identifier 'rte_int128_t'
                                (rte_int128_t *)&old_head,
                                 ^
/tmp/FC28_K4.16.3_Clang6.0.1/x86_64-native-linuxapp-clang/2d534ae6c1284d209a18c3f049117219/dpdk/lib/librte_stack/rte_stack_generic.h:64:20: error: expected expression
                                (rte_int128_t *)&new_head,
                                               ^
/tmp/FC28_K4.16.3_Clang6.0.1/x86_64-native-linuxapp-clang/2d534ae6c1284d209a18c3f049117219/dpdk/lib/librte_stack/rte_stack_generic.h:64:6: error: use of undeclared identifier 'rte_int128_t'
                                (rte_int128_t *)&new_head,
                                 ^
/tmp/FC28_K4.16.3_Clang6.0.1/x86_64-native-linuxapp-clang/2d534ae6c1284d209a18c3f049117219/dpdk/lib/librte_stack/rte_stack_generic.h:139:13: warning: implicit declaration of function 'rte_atomic128_cmp_exchange' is invalid in C99 [-Wimplicit-function-declaration]
                success = rte_atomic128_cmp_exchange(
                          ^
/tmp/FC28_K4.16.3_Clang6.0.1/x86_64-native-linuxapp-clang/2d534ae6c1284d209a18c3f049117219/dpdk/lib/librte_stack/rte_stack_generic.h:140:20: error: expected expression
                                (rte_int128_t *)&list->head,
                                               ^
/tmp/FC28_K4.16.3_Clang6.0.1/x86_64-native-linuxapp-clang/2d534ae6c1284d209a18c3f049117219/dpdk/lib/librte_stack/rte_stack_generic.h:140:6: error: use of undeclared identifier 'rte_int128_t'
                                (rte_int128_t *)&list->head,
                                 ^
/tmp/FC28_K4.16.3_Clang6.0.1/x86_64-native-linuxapp-clang/2d534ae6c1284d209a18c3f049117219/dpdk/lib/librte_stack/rte_stack_generic.h:141:20: error: expected expression
                                (rte_int128_t *)&old_head,
                                               ^
/tmp/FC28_K4.16.3_Clang6.0.1/x86_64-native-linuxapp-clang/2d534ae6c1284d209a18c3f049117219/dpdk/lib/librte_stack/rte_stack_generic.h:141:6: error: use of undeclared identifier 'rte_int128_t'
                                (rte_int128_t *)&old_head,
                                 ^
/tmp/FC28_K4.16.3_Clang6.0.1/x86_64-native-linuxapp-clang/2d534ae6c1284d209a18c3f049117219/dpdk/lib/librte_stack/rte_stack_generic.h  CC acl_run_avx2.o
:142:20: error: expected expression
                                (rte_int128_t *)&new_head,
                                               ^
/tmp/FC28_K4.16.3_Clang6.0.1/x86_64-native-linuxapp-clang/2d534ae6c1284d209a18c3f049117219/dpdk/lib/librte_stack/rte_stack_generic.h:142:6: error: use of undeclared identifier 'rte_int128_t'
                                (rte_int128_t *)&new_head,
                                 ^
3 warnings and 12 errors generated.
make[5]: *** [/tmp/FC28_K4.16.3_Clang6.0.1/x86_64-native-linuxapp-clang/2d534ae6c1284d209a18c3f049117219/dpdk/mk/internal/rte.compile-pre.mk:116: rte_stack.o] Error 1
make[4]: *** [/tmp/FC28_K4.16.3_Clang6.0.1/x86_64-native-linuxapp-clang/2d534ae6c1284d209a18c3f049117219/dpdk/mk/rte.subdir.mk:35: librte_stack] Error 2
make[4]: *** Waiting for unfinished jobs....
  CC cmdline_cirbuf.o
  CC cmdline_parse.o

*Failed Build #8:
OS: FC28
Target: x86_64-native-linuxapp-gcc
  AR librte_ring.a
In file included from /tmp/FC28_K4.16.3_GCC8.0.1/x86_64-native-linuxapp-gcc/2d534ae6c1284d209a18c3f049117219/dpdk/lib/librte_stack/rte_stack.h:97,
                 from /tmp/FC28_K4.16.3_GCC8.0.1/x86_64-native-linuxapp-gcc/2d534ae6c1284d209a18c3f049117219/dpdk/lib/librte_stack/rte_stack.c:16:
/tmp/FC28_K4.16.3_GCC8.0.1/x86_64-native-linuxapp-gcc/2d534ae6c1284d209a18c3f049117219/dpdk/lib/librte_stack/rte_stack_generic.h: In function ‘__rte_stack_lf_push’:
  INSTALL-LIB librte_ring.a
/tmp/FC28_K4.16.3_GCC8.0.1/x86_64-native-linuxapp-gcc/2d534ae6c1284d209a18c3f049117219/dpdk/lib/librte_stack/rte_stack_generic.h:61:13: warning: implicit declaration of function ‘rte_atomic128_cmp_exchange’; did you mean ‘rte_atomic32_exchange’? [-Wimplicit-function-declaration]
   success = rte_atomic128_cmp_exchange(
             ^~~~~~~~~~~~~~~~~~~~~~~~~~
             rte_atomic32_exchange
/tmp/FC28_K4.16.3_GCC8.0.1/x86_64-native-linuxapp-gcc/2d534ae6c1284d209a18c3f049117219/dpdk/lib/librte_stack/rte_stack_generic.h:61:13: warning: nested extern declaration of ‘rte_atomic128_cmp_exchange’ [-Wnested-externs]
/tmp/FC28_K4.16.3_GCC8.0.1/x86_64-native-linuxapp-gcc/2d534ae6c1284d209a18c3f049117219/dpdk/lib/librte_stack/rte_stack_generic.h:62:6: error: ‘rte_int128_t’ undeclared (first use in this function); did you mean ‘rte_iova_t’?
     (rte_int128_t *)&list->head,
      ^~~~~~~~~~~~
      rte_iova_t
/tmp/FC28_K4.16.3_GCC8.0.1/x86_64-native-linuxapp-gcc/2d534ae6c1284d209a18c3f049117219/dpdk/lib/librte_stack/rte_stack_generic.h:62:6: note: each undeclared identifier is reported only once for each function it appears in
/tmp/FC28_K4.16.3_GCC8.0.1/x86_64-native-linuxapp-gcc/2d534ae6c1284d209a18c3f049117219/dpdk/lib/librte_stack/rte_stack_generic.h:62:20: error: expected expression before ‘)’ token
     (rte_int128_t *)&list->head,
                    ^
/tmp/FC28_K4.16.3_GCC8.0.1/x86_64-native-linuxapp-gcc/2d534ae6c1284d209a18c3f049117219/dpdk/lib/librte_stack/rte_stack_generic.h:50:28: warning: variable ‘new_head’ set but not used [-Wunused-but-set-variable]
   struct rte_stack_lf_head new_head;
                            ^~~~~~~~
/tmp/FC28_K4.16.3_GCC8.0.1/x86_64-native-linuxapp-gcc/2d534ae6c1284d209a18c3f049117219/dpdk/lib/librte_stack/rte_stack_generic.h: In function ‘__rte_stack_lf_pop’:
/tmp/FC28_K4.16.3_GCC8.0.1/x86_64-native-linuxapp-gcc/2d534ae6c1284d209a18c3f049117219/dpdk/lib/librte_stack/rte_stack_generic.h:140:6: error: ‘rte_int128_t’ undeclared (first use in this function); did you mean ‘rte_iova_t’?
     (rte_int128_t *)&list->head,
      ^~~~~~~~~~~~
      rte_iova_t
/tmp/FC28_K4.16.3_GCC8.0.1/x86_64-native-linuxapp-gcc/2d534ae6c1284d209a18c3f049117219/dpdk/lib/librte_stack/rte_stack_generic.h:140:20: error: expected expression before ‘)’ token
     (rte_int128_t *)&list->head,
                    ^
/tmp/FC28_K4.16.3_GCC8.0.1/x86_64-native-linuxapp-gcc/2d534ae6c1284d209a18c3f049117219/dpdk/lib/librte_stack/rte_stack_generic.h:107:28: warning: variable ‘new_head’ set but not used [-Wunused-but-set-variable]
   struct rte_stack_lf_head new_head;
                            ^~~~~~~~
make[5]: *** [/tmp/FC28_K4.16.3_GCC8.0.1/x86_64-native-linuxapp-gcc/2d534ae6c1284d209a18c3f049117219/dpdk/mk/internal/rte.compile-pre.mk:116: rte_stack.o] Error 1
make[4]: *** [/tmp/FC28_K4.16.3_GCC8.0.1/x86_64-native-linuxapp-gcc/2d534ae6c1284d209a18c3f049117219/dpdk/mk/rte.subdir.mk:35: librte_stack] Error 2
make[4]: *** Waiting for unfinished jobs....

*Failed Build #9:
OS: RHEL75
Target: x86_64-native-linuxapp-gcc
  CC acl_run_scalar.o
  AR librte_meter.a
In file included from /tmp/RHEL75_K3.10.0_GCC4.8.5/x86_64-native-linuxapp-gcc/2d534ae6c1284d209a18c3f049117219/dpdk/lib/librte_stack/rte_stack.h:97:0,
                 from /tmp/RHEL75_K3.10.0_GCC4.8.5/x86_64-native-linuxapp-gcc/2d534ae6c1284d209a18c3f049117219/dpdk/lib/librte_stack/rte_stack.c:16:
/tmp/RHEL75_K3.10.0_GCC4.8.5/x86_64-native-linuxapp-gcc/2d534ae6c1284d209a18c3f049117219/dpdk/lib/librte_stack/rte_stack_generic.h: In function ‘__rte_stack_lf_push’:
/tmp/RHEL75_K3.10.0_GCC4.8.5/x86_64-native-linuxapp-gcc/2d534ae6c1284d209a18c3f049117219/dpdk/lib/librte_stack/rte_stack_generic.h:61:3: warning: implicit declaration of function ‘rte_atomic128_cmp_exchange’ [-Wimplicit-function-declaration]
   success = rte_atomic128_cmp_exchange(
   ^
/tmp/RHEL75_K3.10.0_GCC4.8.5/x86_64-native-linuxapp-gcc/2d534ae6c1284d209a18c3f049117219/dpdk/lib/librte_stack/rte_stack_generic.h:61:3: warning: nested extern declaration of ‘rte_atomic128_cmp_exchange’ [-Wnested-externs]
/tmp/RHEL75_K3.10.0_GCC4.8.5/x86_64-native-linuxapp-gcc/2d534ae6c1284d209a18c3f049117219/dpdk/lib/librte_stack/rte_stack_generic.h:62:6: error: ‘rte_int128_t’ undeclared (first use in this function)
     (rte_int128_t *)&list->head,
      ^
/tmp/RHEL75_K3.10.0_GCC4.8.5/x86_64-native-linuxapp-gcc/2d534ae6c1284d209a18c3f049117219/dpdk/lib/librte_stack/rte_stack_generic.h:62:6: note: each undeclared identifier is reported only once for each function it appears in
/tmp/RHEL75_K3.10.0_GCC4.8.5/x86_64-native-linuxapp-gcc/2d534ae6c1284d209a18c3f049117219/dpdk/lib/librte_stack/rte_stack_generic.h:62:20: error: expected expression before ‘)’ token
     (rte_int128_t *)&list->head,
                    ^
/tmp/RHEL75_K3.10.0_GCC4.8.5/x86_64-native-linuxapp-gcc/2d534ae6c1284d209a18c3f049117219/dpdk/lib/librte_stack/rte_stack_generic.h:50:28: warning: variable ‘new_head’ set but not used [-Wunused-but-set-variable]
   struct rte_stack_lf_head new_head;
                            ^
/tmp/RHEL75_K3.10.0_GCC4.8.5/x86_64-native-linuxapp-gcc/2d534ae6c1284d209a18c3f049117219/dpdk/lib/librte_stack/rte_stack_generic.h: In function ‘__rte_stack_lf_pop’:
/tmp/RHEL75_K3.10.0_GCC4.8.5/x86_64-native-linuxapp-gcc/2d534ae6c1284d209a18c3f049117219/dpdk/lib/librte_stack/rte_stack_generic.h:140:6: error: ‘rte_int128_t’ undeclared (first use in this function)
     (rte_int128_t *)&list->head,
      ^
/tmp/RHEL75_K3.10.0_GCC4.8.5/x86_64-native-linuxapp-gcc/2d534ae6c1284d209a18c3f049117219/dpdk/lib/librte_stack/rte_stack_generic.h:140:20: error: expected expression before ‘)’ token
     (rte_int128_t *)&list->head,
                    ^
/tmp/RHEL75_K3.10.0_GCC4.8.5/x86_64-native-linuxapp-gcc/2d534ae6c1284d209a18c3f049117219/dpdk/lib/librte_stack/rte_stack_generic.h:107:28: warning: variable ‘new_head’ set but not used [-Wunused-but-set-variable]
   struct rte_stack_lf_head new_head;
                            ^
make[5]: *** [rte_stack.o] Error 1
make[4]: *** [librte_stack] Error 2
make[4]: *** Waiting for unfinished jobs....

*Failed Build #10:
OS: FreeBSD11.2
Target: x86_64-native-bsdapp-gcc
  SYMLINK-FILE include/generic/rte_rwlock.h
  SYMLINK-FILE include/generic/rte_ticketlock.h
  SYMLINK-FILE include/generic/rte_vect.h
  SYMLINK-FILE include/generic/rte_pause.h
  SYMLINK-FILE include/generic/rte_io.h
gmake[6]: warning:  Clock skew detected.  Your build may be incomplete.
== Build lib/librte_eal/freebsd
== Build lib/librte_eal/freebsd/eal
  CC eal.o
  CC eal_hugepage_info.o
  CC eal_memory.o
--
  SYMLINK-FILE include/cmdline_parse_string.h
  SYMLINK-FILE include/cmdline_parse_etheraddr.h
In file included from /tmp/FreeBSD11.2_K11.2_GCC6.4.0/x86_64-native-bsdapp-gcc/2d534ae6c1284d209a18c3f049117219/dpdk/lib/librte_stack/rte_stack.h:97:0,
                 from /tmp/FreeBSD11.2_K11.2_GCC6.4.0/x86_64-native-bsdapp-gcc/2d534ae6c1284d209a18c3f049117219/dpdk/lib/librte_stack/rte_stack.c:16:
/tmp/FreeBSD11.2_K11.2_GCC6.4.0/x86_64-native-bsdapp-gcc/2d534ae6c1284d209a18c3f049117219/dpdk/lib/librte_stack/rte_stack_generic.h: In function '__rte_stack_lf_push':
/tmp/FreeBSD11.2_K11.2_GCC6.4.0/x86_64-native-bsdapp-gcc/2d534ae6c1284d209a18c3f049117219/dpdk/lib/librte_stack/rte_stack_generic.h:61:13: warning: implicit declaration of function 'rte_atomic128_cmp_exchange' [-Wimplicit-function-declaration]
   success = rte_atomic128_cmp_exchange(
             ^~~~~~~~~~~~~~~~~~~~~~~~~~
/tmp/FreeBSD11.2_K11.2_GCC6.4.0/x86_64-native-bsdapp-gcc/2d534ae6c1284d209a18c3f049117219/dpdk/lib/librte_stack/rte_stack_generic.h:61:3: warning: nested extern declaration of 'rte_atomic128_cmp_exchange' [-Wnested-externs]
   success = rte_atomic128_cmp_exchange(
   ^~~~~~~
  SYMLINK-FILE include/cmdline_rdline.h
  AR librte_jobstats.a
  AR librte_metrics.a
  INSTALL-LIB librte_jobstats.a
  INSTALL-LIB librte_metrics.a
  SYMLINK-FILE include/cmdline_vt100.h
/tmp/FreeBSD11.2_K11.2_GCC6.4.0/x86_64-native-bsdapp-gcc/2d534ae6c1284d209a18c3f049117219/dpdk/lib/librte_stack/rte_stack_generic.h:62:6: error: 'rte_int128_t' undeclared (first use in this function)
     (rte_int128_t *)&list->head,
      ^~~~~~~~~~~~
/tmp/FreeBSD11.2_K11.2_GCC6.4.0/x86_64-native-bsdapp-gcc/2d534ae6c1284d209a18c3f049117219/dpdk/lib/librte_stack/rte_stack_generic.h:62:6: note: each undeclared identifier is reported only once for each function it appears in
/tmp/FreeBSD11.2_K11.2_GCC6.4.0/x86_64-native-bsdapp-gcc/2d534ae6c1284d209a18c3f049117219/dpdk/lib/librte_stack/rte_stack_generic.h:62:20: error: expected expression before ')' token
     (rte_int128_t *)&list->head,
                    ^
/tmp/FreeBSD11.2_K11.2_GCC6.4.0/x86_64-native-bsdapp-gcc/2d534ae6c1284d209a18c3f049117219/dpdk/lib/librte_stack/rte_stack_generic.h:50:28: warning: variable 'new_head' set but not used [-Wunused-but-set-variable]
   struct rte_stack_lf_head new_head;
                            ^~~~~~~~
/tmp/FreeBSD11.2_K11.2_GCC6.4.0/x86_64-native-bsdapp-gcc/2d534ae6c1284d209a18c3f049117219/dpdk/lib/librte_stack/rte_stack_generic.h: In function '__rte_stack_lf_pop':
/tmp/FreeBSD11.2_K11.2_GCC6.4.0/x86_64-native-bsdapp-gcc/2d534ae6c1284d209a18c3f049117219/dpdk/lib/librte_stack/rte_stack_generic.h:140:6: error: 'rte_int128_t' undeclared (first use in this function)
     (rte_int128_t *)&list->head,
      ^~~~~~~~~~~~
/tmp/FreeBSD11.2_K11.2_GCC6.4.0/x86_64-native-bsdapp-gcc/2d534ae6c1284d209a18c3f049117219/dpdk/lib/librte_stack/rte_stack_generic.h:140:20: error: expected expression before ')' token
     (rte_int128_t *)&list->head,
                    ^
/tmp/FreeBSD11.2_K11.2_GCC6.4.0/x86_64-native-bsdapp-gcc/2d534ae6c1284d209a18c3f049117219/dpdk/lib/librte_stack/rte_stack_generic.h:107:28: warning: variable 'new_head' set but not used [-Wunused-but-set-variable]
   struct rte_stack_lf_head new_head;
                            ^~~~~~~~
gmake[5]: *** [/tmp/FreeBSD11.2_K11.2_GCC6.4.0/x86_64-native-bsdapp-gcc/2d534ae6c1284d209a18c3f049117219/dpdk/mk/internal/rte.compile-pre.mk:116: rte_stack.o] Error 1
gmake[5]: *** Waiting for unfinished jobs....
  CC acl_gen.o

*Failed Build #11:
OS: FreeBSD11.2
Target: x86_64-native-bsdapp-clang
  SYMLINK-FILE include/generic/rte_ticketlock.h
  SYMLINK-FILE include/generic/rte_rwlock.h
  SYMLINK-FILE include/generic/rte_vect.h
  SYMLINK-FILE include/generic/rte_pause.h
  SYMLINK-FILE include/generic/rte_io.h
gmake[6]: warning:  Clock skew detected.  Your build may be incomplete.
== Build lib/librte_eal/freebsd
== Build lib/librte_eal/freebsd/eal
  CC eal.o
  CC eal_cpuflags.o
  CC eal_memory.o
--
  AR librte_metrics.a
  SYMLINK-FILE include/cmdline_rdline.h
  INSTALL-LIB librte_metrics.a
In file included from /tmp/FreeBSD11.2_K11.2_Clang6.0.0/x86_64-native-bsdapp-clang/2d534ae6c1284d209a18c3f049117219/dpdk/lib/librte_stack/rte_stack.c:16:
In file included from /tmp/FreeBSD11.2_K11.2_Clang6.0.0/x86_64-native-bsdapp-clang/2d534ae6c1284d209a18c3f049117219/dpdk/lib/librte_stack/rte_stack.h:97:
/tmp/FreeBSD11.2_K11.2_Clang6.0.0/x86_64-native-bsdapp-clang/2d534ae6c1284d209a18c3f049117219/dpdk/lib/librte_stack/rte_stack_generic.h:61:13: warning: implicit declaration of function 'rte_atomic128_cmp_exchange' is invalid in C99 [-Wimplicit-function-declaration]
  SYMLINK-FILE include/cmdline_vt100.h
                success = rte_atomic128_cmp_exchange(
                          ^
/tmp/FreeBSD11.2_K11.2_Clang6.0.0/x86_64-native-bsdapp-clang/2d534ae6c1284d209a18c3f049117219/dpdk/lib/librte_stack/rte_stack_generic.h:61:13: warning: this function declaration is not a prototype [-Wstrict-prototypes]
== Build lib/librte_mempool
  SYMLINK-FILE include/cmdline_socket.h
/tmp/FreeBSD11.2_K11.2_Clang6.0.0/x86_64-native-bsdapp-clang/2d534ae6c1284d209a18c3f049117219/dpdk/lib/librte_stack/rte_stack_generic.h:62:20: error: expected expression
                                (rte_int128_t *)&list->head,
                                               ^
  CC acl_gen.o
  CC acl_bld.o
== Build lib/librte_hash
/tmp/FreeBSD11.2_K11.2_Clang6.0.0/x86_64-native-bsdapp-clang/2d534ae6c1284d209a18c3f049117219/dpdk/lib/librte_stack/rte_stack_generic.h:62:6: error: use of undeclared identifier 'rte_int128_t'
                                (rte_int128_t *)&list->head,
                                 ^
/tmp/FreeBSD11.2_K11.2_Clang6.0.0/x86_64-native-bsdapp-clang/2d534ae6c1284d209a18c3f049117219/dpdk/lib/librte_stack/rte_stack_generic.h:63:20: error: expected expression
                                (rte_int128_t *)&old_head,
                                               ^
/tmp/FreeBSD11.2_K11.2_Clang6.0.0/x86_64-native-bsdapp-clang/2d534ae6c1284d209a18c3f049117219/dpdk/lib/librte_stack/rte_stack_generic.h:63:6: error: use of undeclared identifier 'rte_int128_t'
                                (rte_int128_t *)&old_head,
                                 ^
/tmp/FreeBSD11.2_K11.2_Clang6.0.0/x86_64-native-bsdapp-clang/2d534ae6c1284d209a18c3f049117219/dpdk/lib/librte_stack/rte_stack_generic.h:64:20: error: expected expression
                                (rte_int128_t *)&new_head,
                                               ^
/tmp/FreeBSD11.2_K11.2_Clang6.0.0/x86_64-native-bsdapp-clang/2d534ae6c1284d209a18c3f049117219/dpdk/lib/librte_stack/rte_stack_generic.h:64:6: error: use of undeclared identifier 'rte_int128_t'
                                (rte_int128_t *)&new_head,
                                 ^
/tmp/FreeBSD11.2_K11.2_Clang6.0.0/x86_64-native-bsdapp-clang/2d534ae6c1284d209a18c3f049117219/dpdk/lib/librte_stack/rte_stack_generic.h:139:13: warning: implicit declaration of function 'rte_atomic128_cmp_exchange' is invalid in C99 [-Wimplicit-function-declaration]
                success = rte_atomic128_cmp_exchange(
                          ^
/tmp/FreeBSD11.2_K11.2_Clang6.0.0/x86_64-native-bsdapp-clang/2d534ae6c1284d209a18c3f049117219/dpdk/lib/librte_stack/rte_stack_generic.h:140:20: error: expected expression
                                (rte_int128_t *)&list->head,
                                               ^
/tmp/FreeBSD11.2_K11.2_Clang6.0.0/x86_64-native-bsdapp-clang/2d534ae6c1284d209a18c3f049117219/dpdk/lib/librte_stack/rte_stack_generic.h:140:6: error: use of undeclared identifier 'rte_int128_t'
                                (rte_int128_t *)&list->head,
                                 ^
/tmp/FreeBSD11.2_K11.2_Clang6.0.0/x86_64-native-bsdapp-clang/2d534ae6c1284d209a18c3f049117219/dpdk/lib/librte_stack/rte_stack_generic.h:141:20: error: expected expression
                                (rte_int128_t *)&old_head,
                                               ^
/tmp/FreeBSD11.2_K11.2_Clang6.0.0/x86_64-native-bsdapp-clang/2d534ae6c1284d209a18c3f049117219/dpdk/lib/librte_stack/rte_stack_generic.h:141:6: error: use of undeclared identifier 'rte_int128_t'
                                (rte_int128_t *)&old_head,
                                 ^
  SYMLINK-FILE include/cmdline_cirbuf.h
/tmp/FreeBSD11.2_K11.2_Clang6.0.0/x86_64-native-bsdapp-clang/2d534ae6c1284d209a18c3f049117219/dpdk/lib/librte_stack/rte_stack_generic.h:142:20: error: expected expression
                                (rte_int128_t *)&new_head,
                                               ^
/tmp/FreeBSD11.2_K11.2_Clang6.0.0/x86_64-native-bsdapp-clang/2d534ae6c1284d209a18c3f049117219/dpdk/lib/librte_stack/rte_stack_generic.h:142:6: error: use of undeclared identifier 'rte_int128_t'
                                (rte_int128_t *)&new_head,
                                 ^
3 warnings and 12 errors generated.
gmake[5]: *** [/tmp/FreeBSD11.2_K11.2_Clang6.0.0/x86_64-native-bsdapp-clang/2d534ae6c1284d209a18c3f049117219/dpdk/mk/internal/rte.compile-pre.mk:116: rte_stack.o] Error 1
gmake[4]: *** [/tmp/FreeBSD11.2_K11.2_Clang6.0.0/x86_64-native-bsdapp-clang/2d534ae6c1284d209a18c3f049117219/dpdk/mk/rte.subdir.mk:37: librte_stack] Error 2
gmake[4]: *** Waiting for unfinished jobs....
  CC acl_run_scalar.o
  AR librte_meter.a

*Failed Build #12:
OS: FreeBSD12.0
Target: x86_64-native-bsdapp-clang
  SYMLINK-FILE include/generic/rte_rwlock.h
  SYMLINK-FILE include/generic/rte_ticketlock.h
  SYMLINK-FILE include/generic/rte_vect.h
  SYMLINK-FILE include/generic/rte_pause.h
  SYMLINK-FILE include/generic/rte_io.h
gmake[6]: warning:  Clock skew detected.  Your build may be incomplete.
== Build lib/librte_eal/freebsd
== Build lib/librte_eal/freebsd/eal
  CC eal.o
  CC eal_cpuflags.o
  CC eal_memory.o
--
  AR librte_meter.a
  INSTALL-LIB librte_meter.a
  SYMLINK-FILE include/cmdline_parse_portlist.h
In file included from /tmp/FreeBSD12.0_K19.02_Clang6.0.1/x86_64-native-bsdapp-clang/2d534ae6c1284d209a18c3f049117219/dpdk/lib/librte_stack/rte_stack.c:16:
In file included from /tmp/FreeBSD12.0_K19.02_Clang6.0.1/x86_64-native-bsdapp-clang/2d534ae6c1284d209a18c3f049117219/dpdk/lib/librte_stack/rte_stack.h:97:
/tmp/FreeBSD12.0_K19.02_Clang6.0.1/x86_64-native-bsdapp-clang/2d534ae6c1284d209a18c3f049117219/dpdk/lib/librte_stack/rte_stack_generic.h:61:13: warning: implicit declaration of function 'rte_atomic128_cmp_exchange' is invalid in C99 [-Wimplicit-function-declaration]
                success = rte_atomic128_cmp_exchange(
                          ^
/tmp/FreeBSD12.0_K19.02_Clang6.0.1/x86_64-native-bsdapp-clang/2d534ae6c1284d209a18c3f049117219/dpdk/lib/librte_stack/rte_stack_generic.h:61:13: warning: this function declaration is not a prototype [-Wstrict-prototypes]
  CC acl_run_sse.o
/tmp/FreeBSD12.0_K19.02_Clang6.0.1/x86_64-native-bsdapp-clang/2d534ae6c1284d209a18c3f049117219/dpdk/lib/librte_stack/rte_stack_generic.h:62:20: error: expected expression
                                (rte_int128_t *)&list->head,
                                               ^
  CC cmdline.o
  CC cmdline_cirbuf.o
/tmp/FreeBSD12.0_K19.02_Clang6.0.1/x86_64-native-bsdapp-clang/2d534ae6c1284d209a18c3f049117219/dpdk/lib/librte_stack/rte_stack_generic.h:62:6: error: use of undeclared identifier 'rte_int128_t'
                                (rte_int128_t *)&list->head,
                                 ^
/tmp/FreeBSD12.0_K19.02_Clang6.0.1/x86_64-native-bsdapp-clang/2d534ae6c1284d209a18c3f049117219/dpdk/lib/librte_stack/rte_stack_generic.h:63:20: error: expected expression
                                (rte_int128_t *)&old_head,
                                               ^
/tmp/FreeBSD12.0_K19.02_Clang6.0.1/x86_64-native-bsdapp-clang/2d534ae6c1284d209a18c3f049117219/dpdk/lib/librte_stack/rte_stack_generic.h:63:6: error: use of undeclared identifier 'rte_int128_t'
                                (rte_int128_t *)&old_head,
                                 ^
/tmp/FreeBSD12.0_K19.02_Clang6.0.1/x86_64-native-bsdapp-clang/2d534ae6c1284d209a18c3f049117219/dpdk/lib/librte_stack/rte_stack_generic.h:64:20: error: expected expression
                                (rte_int128_t *)&new_head,
                                               ^
/tmp/FreeBSD12.0_K19.02_Clang6.0.1/x86_64-native-bsdapp-clang/2d534ae6c1284d209a18c3f049117219/dpdk/lib/librte_stack/rte_stack_generic.h:64:6: error: use of undeclared identifier 'rte_int128_t'
                                (rte_int128_t *)&new_head,
                                 ^
/tmp/FreeBSD12.0_K19.02_Clang6.0.1/x86_64-native-bsdapp-clang/2d534ae6c1284d209a18c3f049117219/dpdk/lib/librte_stack/rte_stack_generic.h:139:13: warning: implicit declaration of function 'rte_atomic128_cmp_exchange' is invalid in C99 [-Wimplicit-function-declaration]
                success = rte_atomic128_cmp_exchange(
                          ^
  AR librte_jobstats.a
/tmp/FreeBSD12.0_K19.02_Clang6.0.1/x86_64-native-bsdapp-clang/2d534ae6c1284d209a18c3f049117219/dpdk/lib/librte_stack/rte_stack_generic.h:140:20: error: expected expression
                                (rte_int128_t *)&list->head,
                                               ^
/tmp/FreeBSD12.0_K19.02_Clang6.0.1/x86_64-native-bsdapp-clang/2d534ae6c1284d209a18c3f049117219/dpdk/lib/librte_stack/rte_stack_generic.h:140:6: error: use of undeclared identifier 'rte_int128_t'
                                (rte_int128_t *)&list->head,
                                 ^
/tmp/FreeBSD12.0_K19.02_Clang6.0.1/x86_64-native-bsdapp-clang/2d534ae6c1284d209a18c3f049117219/dpdk/lib/librte_stack/rte_stack_generic.h== Build lib/librte_mempool
:141:20: error: expected expression
                                (rte_int128_t *)&old_head,
                                               ^
/tmp/FreeBSD12.0_K19.02_Clang6.0.1/x86_64-native-bsdapp-clang/2d534ae6c1284d209a18c3f049117219/dpdk/lib/librte_stack/rte_stack_generic.h:141:6: error: use of undeclared identifier 'rte_int128_t'
                                (rte_int128_t *)&old_head,
                                 ^
/tmp/FreeBSD12.0_K19.02_Clang6.0.1/x86_64-native-bsdapp-clang/2d534ae6c1284d209a18c3f049117219/dpdk/lib/librte_stack/rte_stack_generic.h:142:20: error: expected expression
                                (rte_int128_t *)&new_head,
                                               ^
/tmp/FreeBSD12.0_K19.02_Clang6.0.1/x86_64-native-bsdapp-clang/2d534ae6c1284d209a18c3f049117219/dpdk/lib/librte_stack/rte_stack_generic.h:142:6: error: use of undeclared identifier 'rte_int128_t'
                                (rte_int128_t *)&new_head,
                                 ^
3 warnings and 12 errors generated.
  CC cmdline_parse.o
gmake[5]: *** [/tmp/FreeBSD12.0_K19.02_Clang6.0.1/x86_64-native-bsdapp-clang/2d534ae6c1284d209a18c3f049117219/dpdk/mk/internal/rte.compile-pre.mk:116: rte_stack.o] Error 1
gmake[4]: *** [/tmp/FreeBSD12.0_K19.02_Clang6.0.1/x86_64-native-bsdapp-clang/2d534ae6c1284d209a18c3f049117219/dpdk/mk/rte.subdir.mk:37: librte_stack] Error 2
gmake[4]: *** Waiting for unfinished jobs....
  CC acl_run_avx2.o

*Failed Build #13:
OS: FreeBSD12.0
Target: x86_64-native-bsdapp-gcc
  SYMLINK-FILE include/generic/rte_rwlock.h
  SYMLINK-FILE include/generic/rte_ticketlock.h
  SYMLINK-FILE include/generic/rte_vect.h
  SYMLINK-FILE include/generic/rte_pause.h
  SYMLINK-FILE include/generic/rte_io.h
gmake[6]: warning:  Clock skew detected.  Your build may be incomplete.
== Build lib/librte_eal/freebsd
== Build lib/librte_eal/freebsd/eal
  CC eal.o
  CC eal_cpuflags.o
  CC eal_memory.o
--
  INSTALL-LIB librte_ring.a
== Build lib/librte_mempool
In file included from /tmp/FreeBSD12.0_K19.02_GCC7.3.0/x86_64-native-bsdapp-gcc/2d534ae6c1284d209a18c3f049117219/dpdk/lib/librte_stack/rte_stack.h:97:0,
                 from /tmp/FreeBSD12.0_K19.02_GCC7.3.0/x86_64-native-bsdapp-gcc/2d534ae6c1284d209a18c3f049117219/dpdk/lib/librte_stack/rte_stack.c:16:
/tmp/FreeBSD12.0_K19.02_GCC7.3.0/x86_64-native-bsdapp-gcc/2d534ae6c1284d209a18c3f049117219/dpdk/lib/librte_stack/rte_stack_generic.h: In function '__rte_stack_lf_push':
/tmp/FreeBSD12.0_K19.02_GCC7.3.0/x86_64-native-bsdapp-gcc/2d534ae6c1284d209a18c3f049117219/dpdk/lib/librte_stack/rte_stack_generic.h:61:13: warning: implicit declaration of function 'rte_atomic128_cmp_exchange'; did you mean 'rte_atomic32_exchange'? [-Wimplicit-function-declaration]
   success = rte_atomic128_cmp_exchange(
             ^~~~~~~~~~~~~~~~~~~~~~~~~~
             rte_atomic32_exchange
/tmp/FreeBSD12.0_K19.02_GCC7.3.0/x86_64-native-bsdapp-gcc/2d534ae6c1284d209a18c3f049117219/dpdk/lib/librte_stack/rte_stack_generic.h:61:13: warning: nested extern declaration of 'rte_atomic128_cmp_exchange' [-Wnested-externs]
/tmp/FreeBSD12.0_K19.02_GCC7.3.0/x86_64-native-bsdapp-gcc/2d534ae6c1284d209a18c3f049117219/dpdk/lib/librte_stack/rte_stack_generic.h:62:6: error: 'rte_int128_t' undeclared (first use in this function); did you mean '__int128_t'?
     (rte_int128_t *)&list->head,
      ^~~~~~~~~~~~
      __int128_t
/tmp/FreeBSD12.0_K19.02_GCC7.3.0/x86_64-native-bsdapp-gcc/2d534ae6c1284d209a18c3f049117219/dpdk/lib/librte_stack/rte_stack_generic.h:62:6: note: each undeclared identifier is reported only once for each function it appears in
/tmp/FreeBSD12.0_K19.02_GCC7.3.0/x86_64-native-bsdapp-gcc/2d534ae6c1284d209a18c3f049117219/dpdk/lib/librte_stack/rte_stack_generic.h:62:20: error: expected expression before ')' token
     (rte_int128_t *)&list->head,
                    ^
/tmp/FreeBSD12.0_K19.02_GCC7.3.0/x86_64-native-bsdapp-gcc/2d534ae6c1284d209a18c3f049117219/dpdk/lib/librte_stack/rte_stack_generic.h:50:28: warning: variable 'new_head' set but not used [-Wunused-but-set-variable]
   struct rte_stack_lf_head new_head;
                            ^~~~~~~~
/tmp/FreeBSD12.0_K19.02_GCC7.3.0/x86_64-native-bsdapp-gcc/2d534ae6c1284d209a18c3f049117219/dpdk/lib/librte_stack/rte_stack_generic.h: In function '__rte_stack_lf_pop':
/tmp/FreeBSD12.0_K19.02_GCC7.3.0/x86_64-native-bsdapp-gcc/2d534ae6c1284d209a18c3f049117219/dpdk/lib/librte_stack/rte_stack_generic.h:140:6: error: 'rte_int128_t' undeclared (first use in this function); did you mean '__int128_t'?
     (rte_int128_t *)&list->head,
      ^~~~~~~~~~~~
      __int128_t
/tmp/FreeBSD12.0_K19.02_GCC7.3.0/x86_64-native-bsdapp-gcc/2d534ae6c1284d209a18c3f049117219/dpdk/lib/librte_stack/rte_stack_generic.h:140:20: error: expected expression before ')' token
     (rte_int128_t *)&list->head,
                    ^
/tmp/FreeBSD12.0_K19.02_GCC7.3.0/x86_64-native-bsdapp-gcc/2d534ae6c1284d209a18c3f049117219/dpdk/lib/librte_stack/rte_stack_generic.h:107:28: warning: variable 'new_head' set but not used [-Wunused-but-set-variable]
   struct rte_stack_lf_head new_head;
                            ^~~~~~~~
gmake[5]: *** [/tmp/FreeBSD12.0_K19.02_GCC7.3.0/x86_64-native-bsdapp-gcc/2d534ae6c1284d209a18c3f049117219/dpdk/mk/internal/rte.compile-pre.mk:116: rte_stack.o] Error 1
gmake[4]: *** [/tmp/FreeBSD12.0_K19.02_GCC7.3.0/x86_64-native-bsdapp-gcc/2d534ae6c1284d209a18c3f049117219/dpdk/mk/rte.subdir.mk:37: librte_stack] Error 2
gmake[4]: *** Waiting for unfinished jobs....

*Failed Build #14:
OS: SUSE15
Target: x86_64-native-linuxapp-gcc
  SYMLINK-FILE include/generic/rte_rwlock.h
  SYMLINK-FILE include/generic/rte_ticketlock.h
  SYMLINK-FILE include/generic/rte_vect.h
  SYMLINK-FILE include/generic/rte_pause.h
  SYMLINK-FILE include/generic/rte_io.h
make[6]: warning:  Clock skew detected.  Your build may be incomplete.
== Build lib/librte_eal/linux
== Build lib/librte_eal/linux/eal
  SYMLINK-FILE include/exec-env/rte_kni_common.h
  CC eal.o
  CC eal_cpuflags.o
--
  CC rte_metrics.o
  SYMLINK-FILE include/cmdline_socket.h
In file included from /tmp/SUSE15_K4.12.14_GCC7.3.1/x86_64-native-linuxapp-gcc/2d534ae6c1284d209a18c3f049117219/dpdk/lib/librte_stack/rte_stack.h:97:0,
                 from /tmp/SUSE15_K4.12.14_GCC7.3.1/x86_64-native-linuxapp-gcc/2d534ae6c1284d209a18c3f049117219/dpdk/lib/librte_stack/rte_stack.c:16:
/tmp/SUSE15_K4.12.14_GCC7.3.1/x86_64-native-linuxapp-gcc/2d534ae6c1284d209a18c3f049117219/dpdk/lib/librte_stack/rte_stack_generic.h: In function ‘__rte_stack_lf_push’:
/tmp/SUSE15_K4.12.14_GCC7.3.1/x86_64-native-linuxapp-gcc/2d534ae6c1284d209a18c3f049117219/dpdk/lib/librte_stack/rte_stack_generic.h:61:13: warning: implicit declaration of function ‘rte_atomic128_cmp_exchange’; did you mean ‘rte_atomic32_exchange’? [-Wimplicit-function-declaration]
   success = rte_atomic128_cmp_exchange(
             ^~~~~~~~~~~~~~~~~~~~~~~~~~
             rte_atomic32_exchange
/tmp/SUSE15_K4.12.14_GCC7.3.1/x86_64-native-linuxapp-gcc/2d534ae6c1284d209a18c3f049117219/dpdk/lib/librte_stack/rte_stack_generic.h:61:13: warning: nested extern declaration of ‘rte_atomic128_cmp_exchange’ [-Wnested-externs]
/tmp/SUSE15_K4.12.14_GCC7.3.1/x86_64-native-linuxapp-gcc/2d534ae6c1284d209a18c3f049117219/dpdk/lib/librte_stack/rte_stack_generic.h:62:6: error: ‘rte_int128_t’ undeclared (first use in this function); did you mean ‘__int128_t’?
     (rte_int128_t *)&list->head,
      ^~~~~~~~~~~~
      __int128_t
/tmp/SUSE15_K4.12.14_GCC7.3.1/x86_64-native-linuxapp-gcc/2d534ae6c1284d209a18c3f049117219/dpdk/lib/librte_stack/rte_stack_generic.h:62:6: note: each undeclared identifier is reported only once for each function it appears in
/tmp/SUSE15_K4.12.14_GCC7.3.1/x86_64-native-linuxapp-gcc/2d534ae6c1284d209a18c3f049117219/dpdk/lib/librte_stack/rte_stack_generic.h:62:20: error: expected expression before ‘)’ token
     (rte_int128_t *)&list->head,
                    ^
/tmp/SUSE15_K4.12.14_GCC7.3.1/x86_64-native-linuxapp-gcc/2d534ae6c1284d209a18c3f049117219/dpdk/lib/librte_stack/rte_stack_generic.h:50:28: warning: variable ‘new_head’ set but not used [-Wunused-but-set-variable]
   struct rte_stack_lf_head new_head;
                            ^~~~~~~~
/tmp/SUSE15_K4.12.14_GCC7.3.1/x86_64-native-linuxapp-gcc/2d534ae6c1284d209a18c3f049117219/dpdk/lib/librte_stack/rte_stack_generic.h: In function ‘__rte_stack_lf_pop’:
/tmp/SUSE15_K4.12.14_GCC7.3.1/x86_64-native-linuxapp-gcc/2d534ae6c1284d209a18c3f049117219/dpdk/lib/librte_stack/rte_stack_generic.h:140:6: error: ‘rte_int128_t’ undeclared (first use in this function); did you mean ‘__int128_t’?
     (rte_int128_t *)&list->head,
      ^~~~~~~~~~~~
      __int128_t
/tmp/SUSE15_K4.12.14_GCC7.3.1/x86_64-native-linuxapp-gcc/2d534ae6c1284d209a18c3f049117219/dpdk/lib/librte_stack/rte_stack_generic.h:140:20: error: expected expression before ‘)’ token
     (rte_int128_t *)&list->head,
                    ^
/tmp/SUSE15_K4.12.14_GCC7.3.1/x86_64-native-linuxapp-gcc/2d534ae6c1284d209a18c3f049117219/dpdk/lib/librte_stack/rte_stack_generic.h:107:28: warning: variable ‘new_head’ set but not used [-Wunused-but-set-variable]
   struct rte_stack_lf_head new_head;
                            ^~~~~~~~
make[5]: *** [/tmp/SUSE15_K4.12.14_GCC7.3.1/x86_64-native-linuxapp-gcc/2d534ae6c1284d209a18c3f049117219/dpdk/mk/internal/rte.compile-pre.mk:116: rte_stack.o] Error 1
make[4]: *** [/tmp/SUSE15_K4.12.14_GCC7.3.1/x86_64-native-linuxapp-gcc/2d534ae6c1284d209a18c3f049117219/dpdk/mk/rte.subdir.mk:37: librte_stack] Error 2
make[4]: *** Waiting for unfinished jobs....

*Failed Build #15:
OS: RHEL76
Target: x86_64-native-linuxapp-gcc
  CC rte_acl.o
  SYMLINK-FILE include/cmdline_vt100.h
In file included from /tmp/RHEL76_K3.10.0_GCC4.8.5/x86_64-native-linuxapp-gcc/2d534ae6c1284d209a18c3f049117219/dpdk/lib/librte_stack/rte_stack.h:97:0,
                 from /tmp/RHEL76_K3.10.0_GCC4.8.5/x86_64-native-linuxapp-gcc/2d534ae6c1284d209a18c3f049117219/dpdk/lib/librte_stack/rte_stack.c:16:
/tmp/RHEL76_K3.10.0_GCC4.8.5/x86_64-native-linuxapp-gcc/2d534ae6c1284d209a18c3f049117219/dpdk/lib/librte_stack/rte_stack_generic.h: In function ‘__rte_stack_lf_push’:
/tmp/RHEL76_K3.10.0_GCC4.8.5/x86_64-native-linuxapp-gcc/2d534ae6c1284d209a18c3f049117219/dpdk/lib/librte_stack/rte_stack_generic.h:61:3: warning: implicit declaration of function ‘rte_atomic128_cmp_exchange’ [-Wimplicit-function-declaration]
   success = rte_atomic128_cmp_exchange(
   ^
/tmp/RHEL76_K3.10.0_GCC4.8.5/x86_64-native-linuxapp-gcc/2d534ae6c1284d209a18c3f049117219/dpdk/lib/librte_stack/rte_stack_generic.h:61:3: warning: nested extern declaration of ‘rte_atomic128_cmp_exchange’ [-Wnested-externs]
/tmp/RHEL76_K3.10.0_GCC4.8.5/x86_64-native-linuxapp-gcc/2d534ae6c1284d209a18c3f049117219/dpdk/lib/librte_stack/rte_stack_generic.h:62:6: error: ‘rte_int128_t’ undeclared (first use in this function)
     (rte_int128_t *)&list->head,
      ^
/tmp/RHEL76_K3.10.0_GCC4.8.5/x86_64-native-linuxapp-gcc/2d534ae6c1284d209a18c3f049117219/dpdk/lib/librte_stack/rte_stack_generic.h:62:6: note: each undeclared identifier is reported only once for each function it appears in
/tmp/RHEL76_K3.10.0_GCC4.8.5/x86_64-native-linuxapp-gcc/2d534ae6c1284d209a18c3f049117219/dpdk/lib/librte_stack/rte_stack_generic.h:62:20: error: expected expression before ‘)’ token
     (rte_int128_t *)&list->head,
                    ^
/tmp/RHEL76_K3.10.0_GCC4.8.5/x86_64-native-linuxapp-gcc/2d534ae6c1284d209a18c3f049117219/dpdk/lib/librte_stack/rte_stack_generic.h:50:28: warning: variable ‘new_head’ set but not used [-Wunused-but-set-variable]
   struct rte_stack_lf_head new_head;
                            ^
/tmp/RHEL76_K3.10.0_GCC4.8.5/x86_64-native-linuxapp-gcc/2d534ae6c1284d209a18c3f049117219/dpdk/lib/librte_stack/rte_stack_generic.h: In function ‘__rte_stack_lf_pop’:
/tmp/RHEL76_K3.10.0_GCC4.8.5/x86_64-native-linuxapp-gcc/2d534ae6c1284d209a18c3f049117219/dpdk/lib/librte_stack/rte_stack_generic.h:140:6: error: ‘rte_int128_t’ undeclared (first use in this function)
     (rte_int128_t *)&list->head,
      ^
/tmp/RHEL76_K3.10.0_GCC4.8.5/x86_64-native-linuxapp-gcc/2d534ae6c1284d209a18c3f049117219/dpdk/lib/librte_stack/rte_stack_generic.h:140:20: error: expected expression before ‘)’ token
     (rte_int128_t *)&list->head,
                    ^
/tmp/RHEL76_K3.10.0_GCC4.8.5/x86_64-native-linuxapp-gcc/2d534ae6c1284d209a18c3f049117219/dpdk/lib/librte_stack/rte_stack_generic.h:107:28: warning: variable ‘new_head’ set but not used [-Wunused-but-set-variable]
   struct rte_stack_lf_head new_head;
                            ^
make[5]: *** [rte_stack.o] Error 1
make[4]: *** [librte_stack] Error 2
make[4]: *** Waiting for unfinished jobs....

*Failed Build #16:
OS: FC29
Target: x86_64-native-linuxapp-gcc
== Build lib/librte_hash
  SYMLINK-FILE include/cmdline_socket.h
In file included from /tmp/FC29_K4.20_GCC8.0.1/x86_64-native-linuxapp-gcc/2d534ae6c1284d209a18c3f049117219/dpdk/lib/librte_stack/rte_stack.h:97,
                 from /tmp/FC29_K4.20_GCC8.0.1/x86_64-native-linuxapp-gcc/2d534ae6c1284d209a18c3f049117219/dpdk/lib/librte_stack/rte_stack.c:16:
/tmp/FC29_K4.20_GCC8.0.1/x86_64-native-linuxapp-gcc/2d534ae6c1284d209a18c3f049117219/dpdk/lib/librte_stack/rte_stack_generic.h: In function ‘__rte_stack_lf_push’:
/tmp/FC29_K4.20_GCC8.0.1/x86_64-native-linuxapp-gcc/2d534ae6c1284d209a18c3f049117219/dpdk/lib/librte_stack/rte_stack_generic.h:61:13: warning: implicit declaration of function ‘rte_atomic128_cmp_exchange’; did you mean ‘rte_atomic32_exchange’? [-Wimplicit-function-declaration]
   success = rte_atomic128_cmp_exchange(
             ^~~~~~~~~~~~~~~~~~~~~~~~~~
             rte_atomic32_exchange
/tmp/FC29_K4.20_GCC8.0.1/x86_64-native-linuxapp-gcc/2d534ae6c1284d209a18c3f049117219/dpdk/lib/librte_stack/rte_stack_generic.h:61:13: warning: nested extern declaration of ‘rte_atomic128_cmp_exchange’ [-Wnested-externs]
/tmp/FC29_K4.20_GCC8.0.1/x86_64-native-linuxapp-gcc/2d534ae6c1284d209a18c3f049117219/dpdk/lib/librte_stack/rte_stack_generic.h:62:6: error: ‘rte_int128_t’ undeclared (first use in this function); did you mean ‘rte_iova_t’?
     (rte_int128_t *)&list->head,
      ^~~~~~~~~~~~
      rte_iova_t
/tmp/FC29_K4.20_GCC8.0.1/x86_64-native-linuxapp-gcc/2d534ae6c1284d209a18c3f049117219/dpdk/lib/librte_stack/rte_stack_generic.h:62:6: note: each undeclared identifier is reported only once for each function it appears in
/tmp/FC29_K4.20_GCC8.0.1/x86_64-native-linuxapp-gcc/2d534ae6c1284d209a18c3f049117219/dpdk/lib/librte_stack/rte_stack_generic.h:62:20: error: expected expression before ‘)’ token
     (rte_int128_t *)&list->head,
                    ^
/tmp/FC29_K4.20_GCC8.0.1/x86_64-native-linuxapp-gcc/2d534ae6c1284d209a18c3f049117219/dpdk/lib/librte_stack/rte_stack_generic.h:50:28: warning: variable ‘new_head’ set but not used [-Wunused-but-set-variable]
   struct rte_stack_lf_head new_head;
                            ^~~~~~~~
/tmp/FC29_K4.20_GCC8.0.1/x86_64-native-linuxapp-gcc/2d534ae6c1284d209a18c3f049117219/dpdk/lib/librte_stack/rte_stack_generic.h: In function ‘__rte_stack_lf_pop’:
/tmp/FC29_K4.20_GCC8.0.1/x86_64-native-linuxapp-gcc/2d534ae6c1284d209a18c3f049117219/dpdk/lib/librte_stack/rte_stack_generic.h:140:6: error: ‘rte_int128_t’ undeclared (first use in this function); did you mean ‘rte_iova_t’?
     (rte_int128_t *)&list->head,
      ^~~~~~~~~~~~
      rte_iova_t
/tmp/FC29_K4.20_GCC8.0.1/x86_64-native-linuxapp-gcc/2d534ae6c1284d209a18c3f049117219/dpdk/lib/librte_stack/rte_stack_generic.h:140:20: error: expected expression before ‘)’ token
     (rte_int128_t *)&list->head,
                    ^
/tmp/FC29_K4.20_GCC8.0.1/x86_64-native-linuxapp-gcc/2d534ae6c1284d209a18c3f049117219/dpdk/lib/librte_stack/rte_stack_generic.h:107:28: warning: variable ‘new_head’ set but not used [-Wunused-but-set-variable]
   struct rte_stack_lf_head new_head;
                            ^~~~~~~~
make[5]: *** [/tmp/FC29_K4.20_GCC8.0.1/x86_64-native-linuxapp-gcc/2d534ae6c1284d209a18c3f049117219/dpdk/mk/internal/rte.compile-pre.mk:116: rte_stack.o] Error 1
make[4]: *** [/tmp/FC29_K4.20_GCC8.0.1/x86_64-native-linuxapp-gcc/2d534ae6c1284d209a18c3f049117219/dpdk/mk/rte.subdir.mk:37: librte_stack] Error 2
make[4]: *** Waiting for unfinished jobs....

*Failed Build #17:
OS: FC29
Target: x86_64-native-linuxapp-clang
  CC rte_acl.o
  SYMLINK-FILE include/cmdline_parse_etheraddr.h
  SYMLINK-FILE include/cmdline_parse_string.h
In file included from /tmp/FC29_K4.20_Clang6.0.1/x86_64-native-linuxapp-clang/2d534ae6c1284d209a18c3f049117219/dpdk/lib/librte_stack/rte_stack.c:16:
In file included from /tmp/FC29_K4.20_Clang6.0.1/x86_64-native-linuxapp-clang/2d534ae6c1284d209a18c3f049117219/dpdk/lib/librte_stack/rte_stack.h:97:
/tmp/FC29_K4.20_Clang6.0.1/x86_64-native-linuxapp-clang/2d534ae6c1284d209a18c3f049117219/dpdk/lib/librte_stack/rte_stack_generic.h:61:13: warning: implicit declaration of function 'rte_atomic128_cmp_exchange' is invalid in C99 [-Wimplicit-function-declaration]
                success = rte_atomic128_cmp_exchange(
                          ^
/tmp/FC29_K4.20_Clang6.0.1/x86_64-native-linuxapp-clang/2d534ae6c1284d209a18c3f049117219/dpdk/lib/librte_stack/rte_stack_generic.h:61:13: warning: this function declaration is not a prototype [-Wstrict-prototypes]
/tmp/FC29_K4.20_Clang6.0.1/x86_64-native-linuxapp-clang/2d534ae6c1284d209a18c3f049117219/dpdk/lib/librte_stack/rte_stack_generic.h:62:20: error: expected expression
                                (rte_int128_t *)&list->head,
                                               ^
/tmp/FC29_K4.20_Clang6.0.1/x86_64-native-linuxapp-clang/2d534ae6c1284d209a18c3f049117219/dpdk/lib/librte_stack/rte_stack_generic.h:62:6: error: use of undeclared identifier 'rte_int128_t'
                                (rte_int128_t *)&list->head,
                                 ^
/tmp/FC29_K4.20_Clang6.0.1/x86_64-native-linuxapp-clang/2d534ae6c1284d209a18c3f049117219/dpdk/lib/librte_stack/rte_stack_generic.h:63:20: error: expected expression
                                (rte_int128_t *)&old_head,
                                               ^
/tmp/FC29_K4.20_Clang6.0.1/x86_64-native-linuxapp-clang/2d534ae6c1284d209a18c3f049117219/dpdk/lib/librte_stack/rte_stack_generic.h:63:6: error: use of undeclared identifier 'rte_int128_t'
                                (rte_int128_t *)&old_head,
                                 ^
/tmp/FC29_K4.20_Clang6.0.1/x86_64-native-linuxapp-clang/2d534ae6c1284d209a18c3f049117219/dpdk/lib/librte_stack/rte_stack_generic.h:64:20: error: expected expression
                                (rte_int128_t *)&new_head,
                                               ^
/tmp/FC29_K4.20_Clang6.0.1/x86_64-native-linuxapp-clang/2d534ae6c1284d209a18c3f049117219/dpdk/lib/librte_stack/rte_stack_generic.h:64:6: error: use of undeclared identifier 'rte_int128_t'
                                (rte_int128_t *)&new_head,
                                 ^
/tmp/FC29_K4.20_Clang6.0.1/x86_64-native-linuxapp-clang/2d534ae6c1284d209a18c3f049117219/dpdk/lib/librte_stack/rte_stack_generic.h:139:13: warning: implicit declaration of function 'rte_atomic128_cmp_exchange' is invalid in C99 [-Wimplicit-function-declaration]
                success = rte_atomic128_cmp_exchange(
                          ^
/tmp/FC29_K4.20_Clang6.0.1/x86_64-native-linuxapp-clang/2d534ae6c1284d209a18c3f049117219/dpdk/lib/librte_stack/rte_stack_generic.h:140:20: error: expected expression
                                (rte_int128_t *)&list->head,
                                               ^
/tmp/FC29_K4.20_Clang6.0.1/x86_64-native-linuxapp-clang/2d534ae6c1284d209a18c3f049117219/dpdk/lib/librte_stack/rte_stack_generic.h:140:6: error: use of undeclared identifier 'rte_int128_t'
                                (rte_int128_t *)&list->head,
                                 ^
/tmp/FC29_K4.20_Clang6.0.1/x86_64-native-linuxapp-clang/2d534ae6c1284d209a18c3f049117219/dpdk/lib/librte_stack/rte_stack_generic.h:141:20: error: expected expression
                                (rte_int128_t *)&old_head,
                                               ^
/tmp/FC29_K4.20_Clang6.0.1/x86_64-native-linuxapp-clang/2d534ae6c1284d209a18c3f049117219/dpdk/lib/librte_stack/rte_stack_generic.h:141:6: error: use of undeclared identifier 'rte_int128_t'
                                (rte_int128_t *)&old_head,
                                 ^
/tmp/FC29_K4.20_Clang6.0.1/x86_64-native-linuxapp-clang/2d534ae6c1284d209a18c3f049117219/dpdk/lib/librte_stack/rte_stack_generic.h:142:20: error: expected expression
                                (rte_int128_t *)&new_head,
                                               ^
/tmp/FC29_K4.20_Clang6.0.1/x86_64-native-linuxapp-clang/2d534ae6c1284d209a18c3f049117219/dpdk/lib/librte_stack/rte_stack_generic.h:142:6: error: use of undeclared identifier 'rte_int128_t'
                                (rte_int128_t *)&new_head,
                                 ^
3 warnings and 12 errors generated.
  SYMLINK-FILE include/cmdline_rdline.h
make[5]: *** [/tmp/FC29_K4.20_Clang6.0.1/x86_64-native-linuxapp-clang/2d534ae6c1284d209a18c3f049117219/dpdk/mk/internal/rte.compile-pre.mk:116: rte_stack.o] Error 1
make[4]: *** [/tmp/FC29_K4.20_Clang6.0.1/x86_64-native-linuxapp-clang/2d534ae6c1284d209a18c3f049117219/dpdk/mk/rte.subdir.mk:35: librte_stack] Error 2
make[4]: *** Waiting for unfinished jobs....
  CC acl_bld.o

*Failed Build #18:
OS: FC29
Target: x86_64-native-linuxapp-icc
  AR librte_meter.a
  INSTALL-LIB librte_meter.a
  SYMLINK-FILE include/cmdline_vt100.h
In file included from /tmp/FC29_K4.20_ICC19.0.0/x86_64-native-linuxapp-icc/2d534ae6c1284d209a18c3f049117219/dpdk/lib/librte_stack/rte_stack.h(97),
                 from /tmp/FC29_K4.20_ICC19.0.0/x86_64-native-linuxapp-icc/2d534ae6c1284d209a18c3f049117219/dpdk/lib/librte_stack/rte_stack.c(16):
/tmp/FC29_K4.20_ICC19.0.0/x86_64-native-linuxapp-icc/2d534ae6c1284d209a18c3f049117219/dpdk/lib/librte_stack/rte_stack_generic.h(61): warning #266: function "rte_atomic128_cmp_exchange" declared implicitly
  		success = rte_atomic128_cmp_exchange(
  		          ^

In file included from /tmp/FC29_K4.20_ICC19.0.0/x86_64-native-linuxapp-icc/2d534ae6c1284d209a18c3f049117219/dpdk/lib/librte_stack/rte_stack.h(97),
                 from /tmp/FC29_K4.20_ICC19.0.0/x86_64-native-linuxapp-icc/2d534ae6c1284d209a18c3f049117219/dpdk/lib/librte_stack/rte_stack.c(16):
/tmp/FC29_K4.20_ICC19.0.0/x86_64-native-linuxapp-icc/2d534ae6c1284d209a18c3f049117219/dpdk/lib/librte_stack/rte_stack_generic.h(62): error: identifier "rte_int128_t" is undefined
  				(rte_int128_t *)&list->head,
  				 ^

In file included from /tmp/FC29_K4.20_ICC19.0.0/x86_64-native-linuxapp-icc/2d534ae6c1284d209a18c3f049117219/dpdk/lib/librte_stack/rte_stack.h(97),
                 from /tmp/FC29_K4.20_ICC19.0.0/x86_64-native-linuxapp-icc/2d534ae6c1284d209a18c3f049117219/dpdk/lib/librte_stack/rte_stack.c(16):
/tmp/FC29_K4.20_ICC19.0.0/x86_64-native-linuxapp-icc/2d534ae6c1284d209a18c3f049117219/dpdk/lib/librte_stack/rte_stack_generic.h(62): error: expected an expression
  				(rte_int128_t *)&list->head,
  				               ^

In file included from /tmp/FC29_K4.20_ICC19.0.0/x86_64-native-linuxapp-icc/2d534ae6c1284d209a18c3f049117219/dpdk/lib/librte_stack/rte_stack.h(97),
                 from /tmp/FC29_K4.20_ICC19.0.0/x86_64-native-linuxapp-icc/2d534ae6c1284d209a18c3f049117219/dpdk/lib/librte_stack/rte_stack.c(16):
/tmp/FC29_K4.20_ICC19.0.0/x86_64-native-linuxapp-icc/2d534ae6c1284d209a18c3f049117219/dpdk/lib/librte_stack/rte_stack_generic.h(62): error: expression must have integral type
  				(rte_int128_t *)&list->head,
  				                 ^

In file included from /tmp/FC29_K4.20_ICC19.0.0/x86_64-native-linuxapp-icc/2d534ae6c1284d209a18c3f049117219/dpdk/lib/librte_stack/rte_stack.h(97),
                 from /tmp/FC29_K4.20_ICC19.0.0/x86_64-native-linuxapp-icc/2d534ae6c1284d209a18c3f049117219/dpdk/lib/librte_stack/rte_stack.c(16):
/tmp/FC29_K4.20_ICC19.0.0/x86_64-native-linuxapp-icc/2d534ae6c1284d209a18c3f049117219/dpdk/lib/librte_stack/rte_stack_generic.h(63): error: expected an expression
  				(rte_int128_t *)&old_head,
  				               ^

In file included from /tmp/FC29_K4.20_ICC19.0.0/x86_64-native-linuxapp-icc/2d534ae6c1284d209a18c3f049117219/dpdk/lib/librte_stack/rte_stack.h(97),
                 from /tmp/FC29_K4.20_ICC19.0.0/x86_64-native-linuxapp-icc/2d534ae6c1284d209a18c3f049117219/dpdk/lib/librte_stack/rte_stack.c(16):
/tmp/FC29_K4.20_ICC19.0.0/x86_64-native-linuxapp-icc/2d534ae6c1284d209a18c3f049117219/dpdk/lib/librte_stack/rte_stack_generic.h(63): error: expression must have integral type
  				(rte_int128_t *)&old_head,
  				                 ^

In file included from /tmp/FC29_K4.20_ICC19.0.0/x86_64-native-linuxapp-icc/2d534ae6c1284d209a18c3f049117219/dpdk/lib/librte_stack/rte_stack.h(97),
                 from /tmp/FC29_K4.20_ICC19.0.0/x86_64-native-linuxapp-icc/2d534ae6c1284d209a18c3f049117219/dpdk/lib/librte_stack/rte_stack.c(16):
/tmp/FC29_K4.20_ICC19.0.0/x86_64-native-linuxapp-icc/2d534ae6c1284d209a18c3f049117219/dpdk/lib/librte_stack/rte_stack_generic.h(64): error: expected an expression
  				(rte_int128_t *)&new_head,
  				               ^

In file included from /tmp/FC29_K4.20_ICC19.0.0/x86_64-native-linuxapp-icc/2d534ae6c1284d209a18c3f049117219/dpdk/lib/librte_stack/rte_stack.h(97),
                 from /tmp/FC29_K4.20_ICC19.0.0/x86_64-native-linuxapp-icc/2d534ae6c1284d209a18c3f049117219/dpdk/lib/librte_stack/rte_stack.c(16):
/tmp/FC29_K4.20_ICC19.0.0/x86_64-native-linuxapp-icc/2d534ae6c1284d209a18c3f049117219/dpdk/lib/librte_stack/rte_stack_generic.h(64): error: expression must have integral type
  				(rte_int128_t *)&new_head,
  				                 ^

In file included from /tmp/FC29_K4.20_ICC19.0.0/x86_64-native-linuxapp-icc/2d534ae6c1284d209a18c3f049117219/dpdk/lib/librte_stack/rte_stack.h(97),
                 from /tmp/FC29_K4.20_ICC19.0.0/x86_64-native-linuxapp-icc/2d534ae6c1284d209a18c3f049117219/dpdk/lib/librte_stack/rte_stack.c(16):
/tmp/FC29_K4.20_ICC19.0.0/x86_64-native-linuxapp-icc/2d534ae6c1284d209a18c3f049117219/dpdk/lib/librte_stack/rte_stack_generic.h(139): warning #266: function "rte_atomic128_cmp_exchange" declared implicitly
  		success = rte_atomic128_cmp_exchange(
  		          ^

In file included from /tmp/FC29_K4.20_ICC19.0.0/x86_64-native-linuxapp-icc/2d534ae6c1284d209a18c3f049117219/dpdk/lib/librte_stack/rte_stack.h(97),
                 from /tmp/FC29_K4.20_ICC19.0.0/x86_64-native-linuxapp-icc/2d534ae6c1284d209a18c3f049117219/dpdk/lib/librte_stack/rte_stack.c(16):
/tmp/FC29_K4.20_ICC19.0.0/x86_64-native-linuxapp-icc/2d534ae6c1284d209a18c3f049117219/dpdk/lib/librte_stack/rte_stack_generic.h(140): error: identifier "rte_int128_t" is undefined
  				(rte_int128_t *)&list->head,
  				 ^

In file included from /tmp/FC29_K4.20_ICC19.0.0/x86_64-native-linuxapp-icc/2d534ae6c1284d209a18c3f049117219/dpdk/lib/librte_stack/rte_stack.h(97),
                 from /tmp/FC29_K4.20_ICC19.0.0/x86_64-native-linuxapp-icc/2d534ae6c1284d209a18c3f049117219/dpdk/lib/librte_stack/rte_stack.c(16):
/tmp/FC29_K4.20_ICC19.0.0/x86_64-native-linuxapp-icc/2d534ae6c1284d209a18c3f049117219/dpdk/lib/librte_stack/rte_stack_generic.h(140): error: expected an expression
  				(rte_int128_t *)&list->head,
  				               ^

In file included from /tmp/FC29_K4.20_ICC19.0.0/x86_64-native-linuxapp-icc/2d534ae6c1284d209a18c3f049117219/dpdk/lib/librte_stack/rte_stack.h(97),
                 from /tmp/FC29_K4.20_ICC19.0.0/x86_64-native-linuxapp-icc/2d534ae6c1284d209a18c3f049117219/dpdk/lib/librte_stack/rte_stack.c(16):
/tmp/FC29_K4.20_ICC19.0.0/x86_64-native-linuxapp-icc/2d534ae6c1284d209a18c3f049117219/dpdk/lib/librte_stack/rte_stack_generic.h(140): error: expression must have integral type
  				(rte_int128_t *)&list->head,
  				                 ^

In file included from /tmp/FC29_K4.20_ICC19.0.0/x86_64-native-linuxapp-icc/2d534ae6c1284d209a18c3f049117219/dpdk/lib/librte_stack/rte_stack.h(97),
                 from /tmp/FC29_K4.20_ICC19.0.0/x86_64-native-linuxapp-icc/2d534ae6c1284d209a18c3f049117219/dpdk/lib/librte_stack/rte_stack.c(16):
/tmp/FC29_K4.20_ICC19.0.0/x86_64-native-linuxapp-icc/2d534ae6c1284d209a18c3f049117219/dpdk/lib/librte_stack/rte_stack_generic.h(141): error: expected an expression
  				(rte_int128_t *)&old_head,
  				               ^

In file included from /tmp/FC29_K4.20_ICC19.0.0/x86_64-native-linuxapp-icc/2d534ae6c1284d209a18c3f049117219/dpdk/lib/librte_stack/rte_stack.h(97),
                 from /tmp/FC29_K4.20_ICC19.0.0/x86_64-native-linuxapp-icc/2d534ae6c1284d209a18c3f049117219/dpdk/lib/librte_stack/rte_stack.c(16):
/tmp/FC29_K4.20_ICC19.0.0/x86_64-native-linuxapp-icc/2d534ae6c1284d209a18c3f049117219/dpdk/lib/librte_stack/rte_stack_generic.h(141): error: expression must have integral type
  				(rte_int128_t *)&old_head,
  				                 ^

In file included from /tmp/FC29_K4.20_ICC19.0.0/x86_64-native-linuxapp-icc/2d534ae6c1284d209a18c3f049117219/dpdk/lib/librte_stack/rte_stack.h(97),
                 from /tmp/FC29_K4.20_ICC19.0.0/x86_64-native-linuxapp-icc/2d534ae6c1284d209a18c3f049117219/dpdk/lib/librte_stack/rte_stack.c(16):
/tmp/FC29_K4.20_ICC19.0.0/x86_64-native-linuxapp-icc/2d534ae6c1284d209a18c3f049117219/dpdk/lib/librte_stack/rte_stack_generic.h(142): error: expected an expression
  				(rte_int128_t *)&new_head,
  				               ^

In file included from /tmp/FC29_K4.20_ICC19.0.0/x86_64-native-linuxapp-icc/2d534ae6c1284d209a18c3f049117219/dpdk/lib/librte_stack/rte_stack.h(97),
                 from /tmp/FC29_K4.20_ICC19.0.0/x86_64-native-linuxapp-icc/2d534ae6c1284d209a18c3f049117219/dpdk/lib/librte_stack/rte_stack.c(16):
/tmp/FC29_K4.20_ICC19.0.0/x86_64-native-linuxapp-icc/2d534ae6c1284d209a18c3f049117219/dpdk/lib/librte_stack/rte_stack_generic.h(142): error: expression must have integral type
  				(rte_int128_t *)&new_head,
  				                 ^

compilation aborted for /tmp/FC29_K4.20_ICC19.0.0/x86_64-native-linuxapp-icc/2d534ae6c1284d209a18c3f049117219/dpdk/lib/librte_stack/rte_stack.c (code 2)
make[5]: *** [/tmp/FC29_K4.20_ICC19.0.0/x86_64-native-linuxapp-icc/2d534ae6c1284d209a18c3f049117219/dpdk/mk/internal/rte.compile-pre.mk:116: rte_stack.o] Error 2

*Failed Build #19:
OS: RHEL74
Target: x86_64-native-linuxapp-gcc
  INSTALL-LIB librte_meter.a
  INSTALL-LIB librte_timer.a
In file included from /tmp/RHEL74_K3.10.0_GCC4.8.5/x86_64-native-linuxapp-gcc/2d534ae6c1284d209a18c3f049117219/dpdk/lib/librte_stack/rte_stack.h:97:0,
                 from /tmp/RHEL74_K3.10.0_GCC4.8.5/x86_64-native-linuxapp-gcc/2d534ae6c1284d209a18c3f049117219/dpdk/lib/librte_stack/rte_stack.c:16:
/tmp/RHEL74_K3.10.0_GCC4.8.5/x86_64-native-linuxapp-gcc/2d534ae6c1284d209a18c3f049117219/dpdk/lib/librte_stack/rte_stack_generic.h: In function ‘__rte_stack_lf_push’:
/tmp/RHEL74_K3.10.0_GCC4.8.5/x86_64-native-linuxapp-gcc/2d534ae6c1284d209a18c3f049117219/dpdk/lib/librte_stack/rte_stack_generic.h:61:3: warning: implicit declaration of function ‘rte_atomic128_cmp_exchange’ [-Wimplicit-function-declaration]
   success = rte_atomic128_cmp_exchange(
   ^
/tmp/RHEL74_K3.10.0_GCC4.8.5/x86_64-native-linuxapp-gcc/2d534ae6c1284d209a18c3f049117219/dpdk/lib/librte_stack/rte_stack_generic.h:61:3: warning: nested extern declaration of ‘rte_atomic128_cmp_exchange’ [-Wnested-externs]
/tmp/RHEL74_K3.10.0_GCC4.8.5/x86_64-native-linuxapp-gcc/2d534ae6c1284d209a18c3f049117219/dpdk/lib/librte_stack/rte_stack_generic.h:62:6: error: ‘rte_int128_t’ undeclared (first use in this function)
     (rte_int128_t *)&list->head,
      ^
/tmp/RHEL74_K3.10.0_GCC4.8.5/x86_64-native-linuxapp-gcc/2d534ae6c1284d209a18c3f049117219/dpdk/lib/librte_stack/rte_stack_generic.h:62:6: note: each undeclared identifier is reported only once for each function it appears in
/tmp/RHEL74_K3.10.0_GCC4.8.5/x86_64-native-linuxapp-gcc/2d534ae6c1284d209a18c3f049117219/dpdk/lib/librte_stack/rte_stack_generic.h:62:20: error: expected expression before ‘)’ token
     (rte_int128_t *)&list->head,
                    ^
/tmp/RHEL74_K3.10.0_GCC4.8.5/x86_64-native-linuxapp-gcc/2d534ae6c1284d209a18c3f049117219/dpdk/lib/librte_stack/rte_stack_generic.h:50:28: warning: variable ‘new_head’ set but not used [-Wunused-but-set-variable]
   struct rte_stack_lf_head new_head;
                            ^
/tmp/RHEL74_K3.10.0_GCC4.8.5/x86_64-native-linuxapp-gcc/2d534ae6c1284d209a18c3f049117219/dpdk/lib/librte_stack/rte_stack_generic.h: In function ‘__rte_stack_lf_pop’:
/tmp/RHEL74_K3.10.0_GCC4.8.5/x86_64-native-linuxapp-gcc/2d534ae6c1284d209a18c3f049117219/dpdk/lib/librte_stack/rte_stack_generic.h:140:6: error: ‘rte_int128_t’ undeclared (first use in this function)
     (rte_int128_t *)&list->head,
      ^
/tmp/RHEL74_K3.10.0_GCC4.8.5/x86_64-native-linuxapp-gcc/2d534ae6c1284d209a18c3f049117219/dpdk/lib/librte_stack/rte_stack_generic.h:140:20: error: expected expression before ‘)’ token
     (rte_int128_t *)&list->head,
                    ^
/tmp/RHEL74_K3.10.0_GCC4.8.5/x86_64-native-linuxapp-gcc/2d534ae6c1284d209a18c3f049117219/dpdk/lib/librte_stack/rte_stack_generic.h:107:28: warning: variable ‘new_head’ set but not used [-Wunused-but-set-variable]
   struct rte_stack_lf_head new_head;
                            ^
make[5]: *** [rte_stack.o] Error 1
make[4]: *** [librte_stack] Error 2
make[4]: *** Waiting for unfinished jobs....

*Failed Build #20:
OS: CENTOS75
Target: x86_64-native-linuxapp-gcc
  SYMLINK-FILE include/cmdline_parse_etheraddr.h
  CC acl_bld.o
In file included from /tmp/CENTOS75_K3.10.0_GCC4.8.5/x86_64-native-linuxapp-gcc/2d534ae6c1284d209a18c3f049117219/dpdk/lib/librte_stack/rte_stack.h:97:0,
                 from /tmp/CENTOS75_K3.10.0_GCC4.8.5/x86_64-native-linuxapp-gcc/2d534ae6c1284d209a18c3f049117219/dpdk/lib/librte_stack/rte_stack.c:16:
/tmp/CENTOS75_K3.10.0_GCC4.8.5/x86_64-native-linuxapp-gcc/2d534ae6c1284d209a18c3f049117219/dpdk/lib/librte_stack/rte_stack_generic.h: In function ‘__rte_stack_lf_push’:
/tmp/CENTOS75_K3.10.0_GCC4.8.5/x86_64-native-linuxapp-gcc/2d534ae6c1284d209a18c3f049117219/dpdk/lib/librte_stack/rte_stack_generic.h:61:3: warning: implicit declaration of function ‘rte_atomic128_cmp_exchange’ [-Wimplicit-function-declaration]
   success = rte_atomic128_cmp_exchange(
   ^
/tmp/CENTOS75_K3.10.0_GCC4.8.5/x86_64-native-linuxapp-gcc/2d534ae6c1284d209a18c3f049117219/dpdk/lib/librte_stack/rte_stack_generic.h:61:3: warning: nested extern declaration of ‘rte_atomic128_cmp_exchange’ [-Wnested-externs]
/tmp/CENTOS75_K3.10.0_GCC4.8.5/x86_64-native-linuxapp-gcc/2d534ae6c1284d209a18c3f049117219/dpdk/lib/librte_stack/rte_stack_generic.h:62:6: error: ‘rte_int128_t’ undeclared (first use in this function)
     (rte_int128_t *)&list->head,
      ^
/tmp/CENTOS75_K3.10.0_GCC4.8.5/x86_64-native-linuxapp-gcc/2d534ae6c1284d209a18c3f049117219/dpdk/lib/librte_stack/rte_stack_generic.h:62:6: note: each undeclared identifier is reported only once for each function it appears in
/tmp/CENTOS75_K3.10.0_GCC4.8.5/x86_64-native-linuxapp-gcc/2d534ae6c1284d209a18c3f049117219/dpdk/lib/librte_stack/rte_stack_generic.h:62:20: error: expected expression before ‘)’ token
     (rte_int128_t *)&list->head,
                    ^
/tmp/CENTOS75_K3.10.0_GCC4.8.5/x86_64-native-linuxapp-gcc/2d534ae6c1284d209a18c3f049117219/dpdk/lib/librte_stack/rte_stack_generic.h:50:28: warning: variable ‘new_head’ set but not used [-Wunused-but-set-variable]
   struct rte_stack_lf_head new_head;
                            ^
/tmp/CENTOS75_K3.10.0_GCC4.8.5/x86_64-native-linuxapp-gcc/2d534ae6c1284d209a18c3f049117219/dpdk/lib/librte_stack/rte_stack_generic.h: In function ‘__rte_stack_lf_pop’:
/tmp/CENTOS75_K3.10.0_GCC4.8.5/x86_64-native-linuxapp-gcc/2d534ae6c1284d209a18c3f049117219/dpdk/lib/librte_stack/rte_stack_generic.h:140:6: error: ‘rte_int128_t’ undeclared (first use in this function)
     (rte_int128_t *)&list->head,
      ^
/tmp/CENTOS75_K3.10.0_GCC4.8.5/x86_64-native-linuxapp-gcc/2d534ae6c1284d209a18c3f049117219/dpdk/lib/librte_stack/rte_stack_generic.h:140:20: error: expected expression before ‘)’ token
     (rte_int128_t *)&list->head,
                    ^
/tmp/CENTOS75_K3.10.0_GCC4.8.5/x86_64-native-linuxapp-gcc/2d534ae6c1284d209a18c3f049117219/dpdk/lib/librte_stack/rte_stack_generic.h:107:28: warning: variable ‘new_head’ set but not used [-Wunused-but-set-variable]
   struct rte_stack_lf_head new_head;
                            ^
  AR librte_jobstats.a
make[5]: *** [rte_stack.o] Error 1
make[4]: *** [librte_stack] Error 2

*Failed Build #21:
OS: CENTOS74
Target: x86_64-native-linuxapp-gcc
  CC acl_bld.o
  INSTALL-LIB librte_metrics.a
In file included from /tmp/CENTOS74_K3.10.0_GCC4.8.5/x86_64-native-linuxapp-gcc/2d534ae6c1284d209a18c3f049117219/dpdk/lib/librte_stack/rte_stack.h:97:0,
                 from /tmp/CENTOS74_K3.10.0_GCC4.8.5/x86_64-native-linuxapp-gcc/2d534ae6c1284d209a18c3f049117219/dpdk/lib/librte_stack/rte_stack.c:16:
/tmp/CENTOS74_K3.10.0_GCC4.8.5/x86_64-native-linuxapp-gcc/2d534ae6c1284d209a18c3f049117219/dpdk/lib/librte_stack/rte_stack_generic.h: In function ‘__rte_stack_lf_push’:
/tmp/CENTOS74_K3.10.0_GCC4.8.5/x86_64-native-linuxapp-gcc/2d534ae6c1284d209a18c3f049117219/dpdk/lib/librte_stack/rte_stack_generic.h:61:3: warning: implicit declaration of function ‘rte_atomic128_cmp_exchange’ [-Wimplicit-function-declaration]
   success = rte_atomic128_cmp_exchange(
   ^
/tmp/CENTOS74_K3.10.0_GCC4.8.5/x86_64-native-linuxapp-gcc/2d534ae6c1284d209a18c3f049117219/dpdk/lib/librte_stack/rte_stack_generic.h:61:3: warning: nested extern declaration of ‘rte_atomic128_cmp_exchange’ [-Wnested-externs]
/tmp/CENTOS74_K3.10.0_GCC4.8.5/x86_64-native-linuxapp-gcc/2d534ae6c1284d209a18c3f049117219/dpdk/lib/librte_stack/rte_stack_generic.h:62:6: error: ‘rte_int128_t’ undeclared (first use in this function)
     (rte_int128_t *)&list->head,
      ^
/tmp/CENTOS74_K3.10.0_GCC4.8.5/x86_64-native-linuxapp-gcc/2d534ae6c1284d209a18c3f049117219/dpdk/lib/librte_stack/rte_stack_generic.h:62:6: note: each undeclared identifier is reported only once for each function it appears in
/tmp/CENTOS74_K3.10.0_GCC4.8.5/x86_64-native-linuxapp-gcc/2d534ae6c1284d209a18c3f049117219/dpdk/lib/librte_stack/rte_stack_generic.h:62:20: error: expected expression before ‘)’ token
     (rte_int128_t *)&list->head,
                    ^
/tmp/CENTOS74_K3.10.0_GCC4.8.5/x86_64-native-linuxapp-gcc/2d534ae6c1284d209a18c3f049117219/dpdk/lib/librte_stack/rte_stack_generic.h:50:28: warning: variable ‘new_head’ set but not used [-Wunused-but-set-variable]
   struct rte_stack_lf_head new_head;
                            ^
/tmp/CENTOS74_K3.10.0_GCC4.8.5/x86_64-native-linuxapp-gcc/2d534ae6c1284d209a18c3f049117219/dpdk/lib/librte_stack/rte_stack_generic.h: In function ‘__rte_stack_lf_pop’:
/tmp/CENTOS74_K3.10.0_GCC4.8.5/x86_64-native-linuxapp-gcc/2d534ae6c1284d209a18c3f049117219/dpdk/lib/librte_stack/rte_stack_generic.h:140:6: error: ‘rte_int128_t’ undeclared (first use in this function)
     (rte_int128_t *)&list->head,
      ^
/tmp/CENTOS74_K3.10.0_GCC4.8.5/x86_64-native-linuxapp-gcc/2d534ae6c1284d209a18c3f049117219/dpdk/lib/librte_stack/rte_stack_generic.h:140:20: error: expected expression before ‘)’ token
     (rte_int128_t *)&list->head,
                    ^
/tmp/CENTOS74_K3.10.0_GCC4.8.5/x86_64-native-linuxapp-gcc/2d534ae6c1284d209a18c3f049117219/dpdk/lib/librte_stack/rte_stack_generic.h:107:28: warning: variable ‘new_head’ set but not used [-Wunused-but-set-variable]
   struct rte_stack_lf_head new_head;
                            ^
make[5]: *** [rte_stack.o] Error 1
make[4]: *** [librte_stack] Error 2
make[4]: *** Waiting for unfinished jobs....

*Failed Build #22:
OS: FC28
Target: x86_64-native-linuxapp-icc
  AR librte_metrics.a
  INSTALL-LIB librte_metrics.a
  SYMLINK-FILE include/cmdline_socket.h
In file included from /tmp/FC28_K4.16.3_ICC19.0.0/x86_64-native-linuxapp-icc/2d534ae6c1284d209a18c3f049117219/dpdk/lib/librte_stack/rte_stack.h(97),
                 from /tmp/FC28_K4.16.3_ICC19.0.0/x86_64-native-linuxapp-icc/2d534ae6c1284d209a18c3f049117219/dpdk/lib/librte_stack/rte_stack.c(16):
/tmp/FC28_K4.16.3_ICC19.0.0/x86_64-native-linuxapp-icc/2d534ae6c1284d209a18c3f049117219/dpdk/lib/librte_stack/rte_stack_generic.h(61): warning #266: function "rte_atomic128_cmp_exchange" declared implicitly
  		success = rte_atomic128_cmp_exchange(
  		          ^

In file included from /tmp/FC28_K4.16.3_ICC19.0.0/x86_64-native-linuxapp-icc/2d534ae6c1284d209a18c3f049117219/dpdk/lib/librte_stack/rte_stack.h(97),
                 from /tmp/FC28_K4.16.3_ICC19.0.0/x86_64-native-linuxapp-icc/2d534ae6c1284d209a18c3f049117219/dpdk/lib/librte_stack/rte_stack.c(16):
/tmp/FC28_K4.16.3_ICC19.0.0/x86_64-native-linuxapp-icc/2d534ae6c1284d209a18c3f049117219/dpdk/lib/librte_stack/rte_stack_generic.h(62): error: identifier "rte_int128_t" is undefined
  				(rte_int128_t *)&list->head,
  				 ^

In file included from /tmp/FC28_K4.16.3_ICC19.0.0/x86_64-native-linuxapp-icc/2d534ae6c1284d209a18c3f049117219/dpdk/lib/librte_stack/rte_stack.h(97),
                 from /tmp/FC28_K4.16.3_ICC19.0.0/x86_64-native-linuxapp-icc/2d534ae6c1284d209a18c3f049117219/dpdk/lib/librte_stack/rte_stack.c(16):
/tmp/FC28_K4.16.3_ICC19.0.0/x86_64-native-linuxapp-icc/2d534ae6c1284d209a18c3f049117219/dpdk/lib/librte_stack/rte_stack_generic.h(62): error: expected an expression
  				(rte_int128_t *)&list->head,
  				               ^

In file included from /tmp/FC28_K4.16.3_ICC19.0.0/x86_64-native-linuxapp-icc/2d534ae6c1284d209a18c3f049117219/dpdk/lib/librte_stack/rte_stack.h(97),
                 from /tmp/FC28_K4.16.3_ICC19.0.0/x86_64-native-linuxapp-icc/2d534ae6c1284d209a18c3f049117219/dpdk/lib/librte_stack/rte_stack.c(16):
/tmp/FC28_K4.16.3_ICC19.0.0/x86_64-native-linuxapp-icc/2d534ae6c1284d209a18c3f049117219/dpdk/lib/librte_stack/rte_stack_generic.h(62): error: expression must have integral type
  				(rte_int128_t *)&list->head,
  				                 ^

In file included from /tmp/FC28_K4.16.3_ICC19.0.0/x86_64-native-linuxapp-icc/2d534ae6c1284d209a18c3f049117219/dpdk/lib/librte_stack/rte_stack.h(97),
                 from /tmp/FC28_K4.16.3_ICC19.0.0/x86_64-native-linuxapp-icc/2d534ae6c1284d209a18c3f049117219/dpdk/lib/librte_stack/rte_stack.c(16):
/tmp/FC28_K4.16.3_ICC19.0.0/x86_64-native-linuxapp-icc/2d534ae6c1284d209a18c3f049117219/dpdk/lib/librte_stack/rte_stack_generic.h(63): error: expected an expression
  				(rte_int128_t *)&old_head,
  				               ^

In file included from /tmp/FC28_K4.16.3_ICC19.0.0/x86_64-native-linuxapp-icc/2d534ae6c1284d209a18c3f049117219/dpdk/lib/librte_stack/rte_stack.h(97),
                 from /tmp/FC28_K4.16.3_ICC19.0.0/x86_64-native-linuxapp-icc/2d534ae6c1284d209a18c3f049117219/dpdk/lib/librte_stack/rte_stack.c(16):
/tmp/FC28_K4.16.3_ICC19.0.0/x86_64-native-linuxapp-icc/2d534ae6c1284d209a18c3f049117219/dpdk/lib/librte_stack/rte_stack_generic.h(63): error: expression must have integral type
  				(rte_int128_t *)&old_head,
  				                 ^

In file included from /tmp/FC28_K4.16.3_ICC19.0.0/x86_64-native-linuxapp-icc/2d534ae6c1284d209a18c3f049117219/dpdk/lib/librte_stack/rte_stack.h(97),
                 from /tmp/FC28_K4.16.3_ICC19.0.0/x86_64-native-linuxapp-icc/2d534ae6c1284d209a18c3f049117219/dpdk/lib/librte_stack/rte_stack.c(16):
/tmp/FC28_K4.16.3_ICC19.0.0/x86_64-native-linuxapp-icc/2d534ae6c1284d209a18c3f049117219/dpdk/lib/librte_stack/rte_stack_generic.h(64): error: expected an expression
  				(rte_int128_t *)&new_head,
  				               ^

In file included from /tmp/FC28_K4.16.3_ICC19.0.0/x86_64-native-linuxapp-icc/2d534ae6c1284d209a18c3f049117219/dpdk/lib/librte_stack/rte_stack.h(97),
                 from /tmp/FC28_K4.16.3_ICC19.0.0/x86_64-native-linuxapp-icc/2d534ae6c1284d209a18c3f049117219/dpdk/lib/librte_stack/rte_stack.c(16):
/tmp/FC28_K4.16.3_ICC19.0.0/x86_64-native-linuxapp-icc/2d534ae6c1284d209a18c3f049117219/dpdk/lib/librte_stack/rte_stack_generic.h(64): error: expression must have integral type
  				(rte_int128_t *)&new_head,
  				                 ^

In file included from /tmp/FC28_K4.16.3_ICC19.0.0/x86_64-native-linuxapp-icc/2d534ae6c1284d209a18c3f049117219/dpdk/lib/librte_stack/rte_stack.h(97),
                 from /tmp/FC28_K4.16.3_ICC19.0.0/x86_64-native-linuxapp-icc/2d534ae6c1284d209a18c3f049117219/dpdk/lib/librte_stack/rte_stack.c(16):
/tmp/FC28_K4.16.3_ICC19.0.0/x86_64-native-linuxapp-icc/2d534ae6c1284d209a18c3f049117219/dpdk/lib/librte_stack/rte_stack_generic.h(139): warning #266: function "rte_atomic128_cmp_exchange" declared implicitly
  		success = rte_atomic128_cmp_exchange(
  		          ^

In file included from /tmp/FC28_K4.16.3_ICC19.0.0/x86_64-native-linuxapp-icc/2d534ae6c1284d209a18c3f049117219/dpdk/lib/librte_stack/rte_stack.h(97),
                 from /tmp/FC28_K4.16.3_ICC19.0.0/x86_64-native-linuxapp-icc/2d534ae6c1284d209a18c3f049117219/dpdk/lib/librte_stack/rte_stack.c(16):
/tmp/FC28_K4.16.3_ICC19.0.0/x86_64-native-linuxapp-icc/2d534ae6c1284d209a18c3f049117219/dpdk/lib/librte_stack/rte_stack_generic.h(140): error: identifier "rte_int128_t" is undefined
  				(rte_int128_t *)&list->head,
  				 ^

In file included from /tmp/FC28_K4.16.3_ICC19.0.0/x86_64-native-linuxapp-icc/2d534ae6c1284d209a18c3f049117219/dpdk/lib/librte_stack/rte_stack.h(97),
                 from /tmp/FC28_K4.16.3_ICC19.0.0/x86_64-native-linuxapp-icc/2d534ae6c1284d209a18c3f049117219/dpdk/lib/librte_stack/rte_stack.c(16):
/tmp/FC28_K4.16.3_ICC19.0.0/x86_64-native-linuxapp-icc/2d534ae6c1284d209a18c3f049117219/dpdk/lib/librte_stack/rte_stack_generic.h(140): error: expected an expression
  				(rte_int128_t *)&list->head,
  				               ^

In file included from /tmp/FC28_K4.16.3_ICC19.0.0/x86_64-native-linuxapp-icc/2d534ae6c1284d209a18c3f049117219/dpdk/lib/librte_stack/rte_stack.h(97),
                 from /tmp/FC28_K4.16.3_ICC19.0.0/x86_64-native-linuxapp-icc/2d534ae6c1284d209a18c3f049117219/dpdk/lib/librte_stack/rte_stack.c(16):
/tmp/FC28_K4.16.3_ICC19.0.0/x86_64-native-linuxapp-icc/2d534ae6c1284d209a18c3f049117219/dpdk/lib/librte_stack/rte_stack_generic.h(140): error: expression must have integral type
  				(rte_int128_t *)&list->head,
  				                 ^

In file included from /tmp/FC28_K4.16.3_ICC19.0.0/x86_64-native-linuxapp-icc/2d534ae6c1284d209a18c3f049117219/dpdk/lib/librte_stack/rte_stack.h(97),
                 from /tmp/FC28_K4.16.3_ICC19.0.0/x86_64-native-linuxapp-icc/2d534ae6c1284d209a18c3f049117219/dpdk/lib/librte_stack/rte_stack.c(16):
/tmp/FC28_K4.16.3_ICC19.0.0/x86_64-native-linuxapp-icc/2d534ae6c1284d209a18c3f049117219/dpdk/lib/librte_stack/rte_stack_generic.h(141): error: expected an expression
  				(rte_int128_t *)&old_head,
  				               ^

In file included from /tmp/FC28_K4.16.3_ICC19.0.0/x86_64-native-linuxapp-icc/2d534ae6c1284d209a18c3f049117219/dpdk/lib/librte_stack/rte_stack.h(97),
                 from /tmp/FC28_K4.16.3_ICC19.0.0/x86_64-native-linuxapp-icc/2d534ae6c1284d209a18c3f049117219/dpdk/lib/librte_stack/rte_stack.c(16):
/tmp/FC28_K4.16.3_ICC19.0.0/x86_64-native-linuxapp-icc/2d534ae6c1284d209a18c3f049117219/dpdk/lib/librte_stack/rte_stack_generic.h(141): error: expression must have integral type
  				(rte_int128_t *)&old_head,
  				                 ^

In file included from /tmp/FC28_K4.16.3_ICC19.0.0/x86_64-native-linuxapp-icc/2d534ae6c1284d209a18c3f049117219/dpdk/lib/librte_stack/rte_stack.h(97),
                 from /tmp/FC28_K4.16.3_ICC19.0.0/x86_64-native-linuxapp-icc/2d534ae6c1284d209a18c3f049117219/dpdk/lib/librte_stack/rte_stack.c(16):
/tmp/FC28_K4.16.3_ICC19.0.0/x86_64-native-linuxapp-icc/2d534ae6c1284d209a18c3f049117219/dpdk/lib/librte_stack/rte_stack_generic.h(142): error: expected an expression
  				(rte_int128_t *)&new_head,
  				               ^

In file included from /tmp/FC28_K4.16.3_ICC19.0.0/x86_64-native-linuxapp-icc/2d534ae6c1284d209a18c3f049117219/dpdk/lib/librte_stack/rte_stack.h(97),
                 from /tmp/FC28_K4.16.3_ICC19.0.0/x86_64-native-linuxapp-icc/2d534ae6c1284d209a18c3f049117219/dpdk/lib/librte_stack/rte_stack.c(16):
/tmp/FC28_K4.16.3_ICC19.0.0/x86_64-native-linuxapp-icc/2d534ae6c1284d209a18c3f049117219/dpdk/lib/librte_stack/rte_stack_generic.h(142): error: expression must have integral type
  				(rte_int128_t *)&new_head,
  				                 ^

compilation aborted for /tmp/FC28_K4.16.3_ICC19.0.0/x86_64-native-linuxapp-icc/2d534ae6c1284d209a18c3f049117219/dpdk/lib/librte_stack/rte_stack.c (code 2)
make[5]: *** [/tmp/FC28_K4.16.3_ICC19.0.0/x86_64-native-linuxapp-icc/2d534ae6c1284d209a18c3f049117219/dpdk/mk/internal/rte.compile-pre.mk:116: rte_stack.o] Error 2

*Failed Build #23:
OS: SUSE12
Target: x86_64-native-linuxapp-gcc
  SYMLINK-FILE include/cmdline_parse_string.h
  INSTALL-LIB librte_metrics.a
In file included from /tmp/SUSE12_K3.7.10_GCC4.7.2/x86_64-native-linuxapp-gcc/2d534ae6c1284d209a18c3f049117219/dpdk/lib/librte_stack/rte_stack.h:97:0,
                 from /tmp/SUSE12_K3.7.10_GCC4.7.2/x86_64-native-linuxapp-gcc/2d534ae6c1284d209a18c3f049117219/dpdk/lib/librte_stack/rte_stack.c:16:
/tmp/SUSE12_K3.7.10_GCC4.7.2/x86_64-native-linuxapp-gcc/2d534ae6c1284d209a18c3f049117219/dpdk/lib/librte_stack/rte_stack_generic.h: In function ‘__rte_stack_lf_push’:
/tmp/SUSE12_K3.7.10_GCC4.7.2/x86_64-native-linuxapp-gcc/2d534ae6c1284d209a18c3f049117219/dpdk/lib/librte_stack/rte_stack_generic.h:61:13: warning: implicit declaration of function ‘rte_atomic128_cmp_exchange’; did you mean ‘rte_atomic32_exchange’? [-Wimplicit-function-declaration]
   success = rte_atomic128_cmp_exchange(
             ^~~~~~~~~~~~~~~~~~~~~~~~~~
             rte_atomic32_exchange
/tmp/SUSE12_K3.7.10_GCC4.7.2/x86_64-native-linuxapp-gcc/2d534ae6c1284d209a18c3f049117219/dpdk/lib/librte_stack/rte_stack_generic.h:61:13: warning: nested extern declaration of ‘rte_atomic128_cmp_exchange’ [-Wnested-externs]
/tmp/SUSE12_K3.7.10_GCC4.7.2/x86_64-native-linuxapp-gcc/2d534ae6c1284d209a18c3f049117219/dpdk/lib/librte_stack/rte_stack_generic.h:62:6: error: ‘rte_int128_t’ undeclared (first use in this function); did you mean ‘__int128_t’?
     (rte_int128_t *)&list->head,
      ^~~~~~~~~~~~
      __int128_t
/tmp/SUSE12_K3.7.10_GCC4.7.2/x86_64-native-linuxapp-gcc/2d534ae6c1284d209a18c3f049117219/dpdk/lib/librte_stack/rte_stack_generic.h:62:6: note: each undeclared identifier is reported only once for each function it appears in
/tmp/SUSE12_K3.7.10_GCC4.7.2/x86_64-native-linuxapp-gcc/2d534ae6c1284d209a18c3f049117219/dpdk/lib/librte_stack/rte_stack_generic.h:62:20: error: expected expression before ‘)’ token
     (rte_int128_t *)&list->head,
                    ^
/tmp/SUSE12_K3.7.10_GCC4.7.2/x86_64-native-linuxapp-gcc/2d534ae6c1284d209a18c3f049117219/dpdk/lib/librte_stack/rte_stack_generic.h:50:28: warning: variable ‘new_head’ set but not used [-Wunused-but-set-variable]
   struct rte_stack_lf_head new_head;
                            ^~~~~~~~
/tmp/SUSE12_K3.7.10_GCC4.7.2/x86_64-native-linuxapp-gcc/2d534ae6c1284d209a18c3f049117219/dpdk/lib/librte_stack/rte_stack_generic.h: In function ‘__rte_stack_lf_pop’:
/tmp/SUSE12_K3.7.10_GCC4.7.2/x86_64-native-linuxapp-gcc/2d534ae6c1284d209a18c3f049117219/dpdk/lib/librte_stack/rte_stack_generic.h:140:6: error: ‘rte_int128_t’ undeclared (first use in this function); did you mean ‘__int128_t’?
     (rte_int128_t *)&list->head,
      ^~~~~~~~~~~~
      __int128_t
/tmp/SUSE12_K3.7.10_GCC4.7.2/x86_64-native-linuxapp-gcc/2d534ae6c1284d209a18c3f049117219/dpdk/lib/librte_stack/rte_stack_generic.h:140:20: error: expected expression before ‘)’ token
     (rte_int128_t *)&list->head,
                    ^
/tmp/SUSE12_K3.7.10_GCC4.7.2/x86_64-native-linuxapp-gcc/2d534ae6c1284d209a18c3f049117219/dpdk/lib/librte_stack/rte_stack_generic.h:107:28: warning: variable ‘new_head’ set but not used [-Wunused-but-set-variable]
   struct rte_stack_lf_head new_head;
                            ^~~~~~~~
/tmp/SUSE12_K3.7.10_GCC4.7.2/x86_64-native-linuxapp-gcc/2d534ae6c1284d209a18c3f049117219/dpdk/mk/internal/rte.compile-pre.mk:114: recipe for target 'rte_stack.o' failed
make[5]: *** [rte_stack.o] Error 1
/tmp/SUSE12_K3.7.10_GCC4.7.2/x86_64-native-linuxapp-gcc/2d534ae6c1284d209a18c3f049117219/dpdk/mk/rte.subdir.mk:35: recipe for target 'librte_stack' failed
make[4]: *** [librte_stack] Error 2
make[4]: *** Waiting for unfinished jobs....
  SYMLINK-FILE include/cmdline_rdline.h
  SYMLINK-FILE include/cmdline_vt100.h
  SYMLINK-FILE include/cmdline_socket.h
--
  CC acl_run_avx2.o
  AR librte_cmdline.a
  INSTALL-LIB librte_cmdline.a
  AR librte_acl.a
  INSTALL-LIB librte_acl.a
/tmp/SUSE12_K3.7.10_GCC4.7.2/x86_64-native-linuxapp-gcc/2d534ae6c1284d209a18c3f049117219/dpdk/mk/rte.sdkbuild.mk:46: recipe for target 'lib' failed
make[3]: *** [lib] Error 2
/tmp/SUSE12_K3.7.10_GCC4.7.2/x86_64-native-linuxapp-gcc/2d534ae6c1284d209a18c3f049117219/dpdk/mk/rte.sdkroot.mk:98: recipe for target 'all' failed
make[2]: *** [all] Error 2
/tmp/SUSE12_K3.7.10_GCC4.7.2/x86_64-native-linuxapp-gcc/2d534ae6c1284d209a18c3f049117219/dpdk/mk/rte.sdkinstall.mk:60: recipe for target 'pre_install' failed
make[1]: *** [pre_install] Error 2
/tmp/SUSE12_K3.7.10_GCC4.7.2/x86_64-native-linuxapp-gcc/2d534ae6c1284d209a18c3f049117219/dpdk/mk/rte.sdkroot.mk:77: recipe for target 'install' failed
make: *** [install] Error 2

*Failed Build #24:
OS: CENTOS76
Target: x86_64-native-linuxapp-gcc
  CC acl_run_avx2.o
  AR librte_timer.a
In file included from /tmp/CENTOS76_K3.10.0_GCC4.8.5/x86_64-native-linuxapp-gcc/2d534ae6c1284d209a18c3f049117219/dpdk/lib/librte_stack/rte_stack.h:97:0,
                 from /tmp/CENTOS76_K3.10.0_GCC4.8.5/x86_64-native-linuxapp-gcc/2d534ae6c1284d209a18c3f049117219/dpdk/lib/librte_stack/rte_stack.c:16:
/tmp/CENTOS76_K3.10.0_GCC4.8.5/x86_64-native-linuxapp-gcc/2d534ae6c1284d209a18c3f049117219/dpdk/lib/librte_stack/rte_stack_generic.h: In function ‘__rte_stack_lf_push’:
/tmp/CENTOS76_K3.10.0_GCC4.8.5/x86_64-native-linuxapp-gcc/2d534ae6c1284d209a18c3f049117219/dpdk/lib/librte_stack/rte_stack_generic.h:61:3: warning: implicit declaration of function ‘rte_atomic128_cmp_exchange’ [-Wimplicit-function-declaration]
   success = rte_atomic128_cmp_exchange(
   ^
/tmp/CENTOS76_K3.10.0_GCC4.8.5/x86_64-native-linuxapp-gcc/2d534ae6c1284d209a18c3f049117219/dpdk/lib/librte_stack/rte_stack_generic.h:61:3: warning: nested extern declaration of ‘rte_atomic128_cmp_exchange’ [-Wnested-externs]
/tmp/CENTOS76_K3.10.0_GCC4.8.5/x86_64-native-linuxapp-gcc/2d534ae6c1284d209a18c3f049117219/dpdk/lib/librte_stack/rte_stack_generic.h:62:6: error: ‘rte_int128_t’ undeclared (first use in this function)
     (rte_int128_t *)&list->head,
      ^
/tmp/CENTOS76_K3.10.0_GCC4.8.5/x86_64-native-linuxapp-gcc/2d534ae6c1284d209a18c3f049117219/dpdk/lib/librte_stack/rte_stack_generic.h:62:6: note: each undeclared identifier is reported only once for each function it appears in
/tmp/CENTOS76_K3.10.0_GCC4.8.5/x86_64-native-linuxapp-gcc/2d534ae6c1284d209a18c3f049117219/dpdk/lib/librte_stack/rte_stack_generic.h:62:20: error: expected expression before ‘)’ token
     (rte_int128_t *)&list->head,
                    ^
/tmp/CENTOS76_K3.10.0_GCC4.8.5/x86_64-native-linuxapp-gcc/2d534ae6c1284d209a18c3f049117219/dpdk/lib/librte_stack/rte_stack_generic.h:50:28: warning: variable ‘new_head’ set but not used [-Wunused-but-set-variable]
   struct rte_stack_lf_head new_head;
                            ^
/tmp/CENTOS76_K3.10.0_GCC4.8.5/x86_64-native-linuxapp-gcc/2d534ae6c1284d209a18c3f049117219/dpdk/lib/librte_stack/rte_stack_generic.h: In function ‘__rte_stack_lf_pop’:
/tmp/CENTOS76_K3.10.0_GCC4.8.5/x86_64-native-linuxapp-gcc/2d534ae6c1284d209a18c3f049117219/dpdk/lib/librte_stack/rte_stack_generic.h:140:6: error: ‘rte_int128_t’ undeclared (first use in this function)
     (rte_int128_t *)&list->head,
      ^
/tmp/CENTOS76_K3.10.0_GCC4.8.5/x86_64-native-linuxapp-gcc/2d534ae6c1284d209a18c3f049117219/dpdk/lib/librte_stack/rte_stack_generic.h:140:20: error: expected expression before ‘)’ token
     (rte_int128_t *)&list->head,
                    ^
/tmp/CENTOS76_K3.10.0_GCC4.8.5/x86_64-native-linuxapp-gcc/2d534ae6c1284d209a18c3f049117219/dpdk/lib/librte_stack/rte_stack_generic.h:107:28: warning: variable ‘new_head’ set but not used [-Wunused-but-set-variable]
   struct rte_stack_lf_head new_head;
                            ^
  INSTALL-LIB librte_timer.a
make[5]: *** [rte_stack.o] Error 1
== Build lib/librte_mempool

DPDK STV team


More information about the test-report mailing list