[dpdk-test-report] |FAILURE| pw51874[v7, 3/8] build: add module definition file for windows

sys_stv at intel.com sys_stv at intel.com
Fri Mar 29 00:35:40 CET 2019


Test-Label: Intel-compilation
Test-Status: FAILURE
http://dpdk.org/patch/51874

_Compilation issues_

Submitter: Anand Rawat <anand.rawat at intel.com>
Date: 2019-03-28 23:24:46
Reply_mail: 20190328232451.16988-4-anand.rawat at intel.com
DPDK git baseline: Repo:dpdk-master, CommitID: a1c6b707866d82337ddb7b79e6b316840d8d9a3c

Build Summary: 26 Builds Done, 0 Successful, 26 Failures

Test environment and configuration as below:

OS: SUSE15
	Kernel Version: 4.12.14-lp150.12.22-default
	CPU info: Intel(R) Xeon(R) CPU E5-2699 v3 @ 2.30GHz
	GCC Version: gcc (SUSE Linux) 7.3.1 20180323 [gcc-7-branch revision 258812]
	Clang Version: 5.0.1 (tags/RELEASE_501/final 312548)
	x86_64-native-linuxapp-gcc

OS: CENTOS76
	Kernel Version: 3.10.0-957.5.1.el7.x86_64
	CPU info: Intel(R) Xeon(R) CPU E5-2699 v4 @ 2.20GHz
	GCC Version: gcc (GCC) 4.8.5 20150623 (Red Hat 4.8.5-36)
	Clang Version: 3.4.2 (tags/RELEASE_34/dot2-final)
	x86_64-native-linuxapp-gcc

OS: UBT144-32
	Kernel Version: 3.13.0-161-generic
	CPU info: Intel(R) Xeon(R) CPU E5-2699 v3 @ 2.30GHz
	GCC Version: gcc (Ubuntu 4.8.4-2ubuntu1~14.04.4) 4.8.4
	Clang Version: NA
	i686-native-linuxapp-gcc

OS: UBT164-32
	Kernel Version: 4.4.0-131-generic
	CPU info: Intel(R) Xeon(R) CPU E5-2699 v3 @ 2.30GHz
	GCC Version: gcc (Ubuntu 5.4.0-6ubuntu1~16.04.10) 5.4.0 20160609
	Clang Version: NA
	i686-native-linuxapp-gcc

OS: SUSE12
	Kernel Version: 4.4.73-5-default
	CPU info: Intel(R) Xeon(R) CPU E5-2699 v4 @ 2.20GHz
	GCC Version: gcc (SUSE Linux) 7.1.1 20170607 [gcc-7-branch revision 248970]
	Clang Version: 3.8.0 (tags/RELEASE_380/final 262553)
	x86_64-native-linuxapp-gcc

OS: FreeBSD12.0
	Kernel Version: 12.0-RC3
	CPU info: Intel(R) Xeon(R) CPU E5-2699 v3 @ 2.30GHz (2294.75-MHz K8-class CPU)
	GCC Version: gcc (FreeBSD Ports Collection) 7.3.0
	Clang Version: 6.0.1 (tags/RELEASE_601/final 335540) (based on LLVM 6.0.1)
	x86_64-native-bsdapp-clang
	x86_64-native-bsdapp-gcc

OS: UBT144-64
	Kernel Version: 4.2.0-27-generic
	CPU info: Intel(R) Xeon(R) CPU E5-2699 v3 @ 2.30GHz
	GCC Version: gcc (Ubuntu 4.8.4-2ubuntu1~14.04.4) 4.8.4
	Clang Version: 3.4-1ubuntu3 (tags/RELEASE_34/final) (based on LLVM 3.4)
	x86_64-native-linuxapp-gcc

OS: CENTOS75
	Kernel Version: 3.10.0-957.5.1.el7.x86_64
	CPU info: Intel(R) Xeon(R) CPU E5-2699 v4 @ 2.20GHz
	GCC Version: gcc (GCC) 4.8.5 20150623 (Red Hat 4.8.5-36)
	Clang Version: 3.4.2 (tags/RELEASE_34/dot2-final)
	x86_64-native-linuxapp-gcc

OS: UBT1804
	Kernel Version: 4.15.0-20-generic
	CPU info: Intel(R) Xeon(R) CPU E5-2699 v3 @ 2.30GHz
	GCC Version: gcc (Ubuntu 7.3.0-27ubuntu1~18.04) 7.3.0
	Clang Version: 6.0.0-1ubuntu2 (tags/RELEASE_600/final)
	x86_64-native-linuxapp-clang
	x86_64-native-linuxapp-gcc
	x86_64-native-linuxapp-icc

OS: UBT1810
	Kernel Version: 4.18.0-10-generic
	CPU info: Intel(R) Xeon(R) CPU E5-2699 v3 @ 2.30GHz
	GCC Version: gcc (Ubuntu 8.2.0-7ubuntu1) 8.2.0
	Clang Version: 7.0.0-3 (tags/RELEASE_700/final)
	x86_64-native-linuxapp-gcc

OS: RHEL74
	Kernel Version: 3.10.0-693.el7.x86_64
	CPU info: Intel(R) Xeon(R) CPU E5-2699 v4 @ 2.20GHz
	GCC Version: gcc (GCC) 4.8.5 20150623 (Red Hat 4.8.5-16)
	Clang Version: NA
	x86_64-native-linuxapp-gcc

OS: CENTOS74
	Kernel Version: 3.10.0-862.14.4.el7.x86_64
	CPU info: Intel(R) Xeon(R) CPU E5-2699 v4 @ 2.20GHz
	GCC Version: gcc (GCC) 4.8.5 20150623 (Red Hat 4.8.5-28)
	Clang Version: 3.4.2 (tags/RELEASE_34/dot2-final)
	x86_64-native-linuxapp-gcc

OS: FreeBSD11.2
	Kernel Version: 11.2-RELEASE
	CPU info: Intel(R) Xeon(R) CPU E5-2699 v3 @ 2.30GHz (2294.74-MHz K8-class CPU)
	GCC Version: gcc (FreeBSD Ports Collection) 6.4.0
	Clang Version: 6.0.0 (tags/RELEASE_600/final 326565) (based on LLVM 6.0.0)
	x86_64-native-bsdapp-clang
	x86_64-native-bsdapp-gcc

OS: UBT164-64
	Kernel Version: 4.4.0-47-generic
	CPU info: Intel(R) Xeon(R) CPU E5-2699 v3 @ 2.30GHz
	GCC Version: gcc (Ubuntu 5.4.0-6ubuntu1~16.04.10) 5.4.0 20160609
	Clang Version: 3.8.0-2ubuntu4 (tags/RELEASE_380/final)
	x86_64-native-linuxapp-gcc

OS: RHEL75
	Kernel Version: 3.10.0-862.el7.x86_64
	CPU info: Intel(R) Xeon(R) CPU E5-2699 v4 @ 2.20GHz
	GCC Version: gcc (GCC) 4.8.5 20150623 (Red Hat 4.8.5-28)
	Clang Version: NA
	x86_64-native-linuxapp-gcc

OS: RHEL76
	Kernel Version: 3.10.0-957.el7.x86_64
	CPU info: Intel(R) Xeon(R) CPU E5-2699 v4 @ 2.20GHz
	GCC Version: gcc (GCC) 4.8.5 20150623 (Red Hat 4.8.5-36)
	Clang Version: NA
	x86_64-native-linuxapp-gcc

OS: FC29
	Kernel Version: 4.18.16-300.fc29.x86_64
	CPU info: Intel(R) Xeon(R) CPU E5-2699 v4 @ 2.20GHz
	GCC Version: gcc (GCC) 8.2.1 20181215 (Red Hat 8.2.1-6)
	Clang Version: NA
	x86_64-native-linuxapp-gcc
	x86_64-native-linuxapp-clang
	x86_64-native-linuxapp-icc

OS: FC28
	Kernel Version: 4.16.3-301.fc28.x86_64
	CPU info: Intel(R) Xeon(R) CPU E5-2699 v4 @ 2.20GHz
	GCC Version: gcc (GCC) 8.1.1 20180712 (Red Hat 8.1.1-5)
	Clang Version: 6.0.1 (tags/RELEASE_601/final)
	x86_64-native-linuxapp-clang
	x86_64-native-linuxapp-gcc
	x86_64-native-linuxapp-icc

*Failed Build #1:
OS: UBT164-64
Target: x86_64-native-linuxapp-gcc
  CC rte_kvargs.o
  SYMLINK-FILE include/rte_cfgfile.h
  CC rte_cfgfile.o
In file included from /tmp/UBT164-64_K4.4.0_GCC5.4.0/x86_64-native-linuxapp-gcc/950bb668d50144248147049721ccadee/dpdk/lib/librte_eal/common/include/rte_string_fns.h:21:0,
                 from /tmp/UBT164-64_K4.4.0_GCC5.4.0/x86_64-native-linuxapp-gcc/950bb668d50144248147049721ccadee/dpdk/lib/librte_kvargs/rte_kvargs.c:9:
/tmp/UBT164-64_K4.4.0_GCC5.4.0/x86_64-native-linuxapp-gcc/950bb668d50144248147049721ccadee/dpdk/lib/librte_eal/common/include/rte_common.h:28:20: fatal error: rte_os.h: No such file or directory
compilation terminated.
/tmp/UBT164-64_K4.4.0_GCC5.4.0/x86_64-native-linuxapp-gcc/950bb668d50144248147049721ccadee/dpdk/mk/internal/rte.compile-pre.mk:114: recipe for target 'rte_kvargs.o' failed
make[5]: *** [rte_kvargs.o] Error 1
/tmp/UBT164-64_K4.4.0_GCC5.4.0/x86_64-native-linuxapp-gcc/950bb668d50144248147049721ccadee/dpdk/mk/rte.subdir.mk:35: recipe for target 'librte_kvargs' failed
make[4]: *** [librte_kvargs] Error 2
make[4]: *** Waiting for unfinished jobs....
In file included from /tmp/UBT164-64_K4.4.0_GCC5.4.0/x86_64-native-linuxapp-gcc/950bb668d50144248147049721ccadee/dpdk/lib/librte_cfgfile/rte_cfgfile.c:10:0:
/tmp/UBT164-64_K4.4.0_GCC5.4.0/x86_64-native-linuxapp-gcc/950bb668d50144248147049721ccadee/dpdk/lib/librte_cfgfile/../librte_eal/common/include/rte_common.h:28:20: fatal error: rte_os.h: No such file or directory
compilation terminated.
/tmp/UBT164-64_K4.4.0_GCC5.4.0/x86_64-native-linuxapp-gcc/950bb668d50144248147049721ccadee/dpdk/mk/internal/rte.compile-pre.mk:114: recipe for target 'rte_cfgfile.o' failed
make[5]: *** [rte_cfgfile.o] Error 1
/tmp/UBT164-64_K4.4.0_GCC5.4.0/x86_64-native-linuxapp-gcc/950bb668d50144248147049721ccadee/dpdk/mk/rte.subdir.mk:35: recipe for target 'librte_cfgfile' failed
make[4]: *** [librte_cfgfile] Error 2
/tmp/UBT164-64_K4.4.0_GCC5.4.0/x86_64-native-linuxapp-gcc/950bb668d50144248147049721ccadee/dpdk/mk/rte.sdkbuild.mk:46: recipe for target 'lib' failed
make[3]: *** [lib] Error 2
/tmp/UBT164-64_K4.4.0_GCC5.4.0/x86_64-native-linuxapp-gcc/950bb668d50144248147049721ccadee/dpdk/mk/rte.sdkroot.mk:98: recipe for target 'all' failed
make[2]: *** [all] Error 2
/tmp/UBT164-64_K4.4.0_GCC5.4.0/x86_64-native-linuxapp-gcc/950bb668d50144248147049721ccadee/dpdk/mk/rte.sdkinstall.mk:60: recipe for target 'pre_install' failed
make[1]: *** [pre_install] Error 2
/tmp/UBT164-64_K4.4.0_GCC5.4.0/x86_64-native-linuxapp-gcc/950bb668d50144248147049721ccadee/dpdk/mk/rte.sdkroot.mk:77: recipe for target 'install' failed
make: *** [install] Error 2

*Failed Build #2:
OS: UBT144-64
Target: x86_64-native-linuxapp-gcc
  CC rte_kvargs.o
  SYMLINK-FILE include/rte_cfgfile.h
  CC rte_cfgfile.o
In file included from /tmp/UBT144-64_K4.2.0_GCC4.8.4/x86_64-native-linuxapp-gcc/950bb668d50144248147049721ccadee/dpdk/lib/librte_eal/common/include/rte_string_fns.h:21:0,
                 from /tmp/UBT144-64_K4.2.0_GCC4.8.4/x86_64-native-linuxapp-gcc/950bb668d50144248147049721ccadee/dpdk/lib/librte_kvargs/rte_kvargs.c:9:
/tmp/UBT144-64_K4.2.0_GCC4.8.4/x86_64-native-linuxapp-gcc/950bb668d50144248147049721ccadee/dpdk/lib/librte_eal/common/include/rte_common.h:28:20: fatal error: rte_os.h: No such file or directory
 #include <rte_os.h>
                    ^
compilation terminated.
In file included from /tmp/UBT144-64_K4.2.0_GCC4.8.4/x86_64-native-linuxapp-gcc/950bb668d50144248147049721ccadee/dpdk/lib/librte_cfgfile/rte_cfgfile.c:10:0:
/tmp/UBT144-64_K4.2.0_GCC4.8.4/x86_64-native-linuxapp-gcc/950bb668d50144248147049721ccadee/dpdk/lib/librte_cfgfile/../librte_eal/common/include/rte_common.h:28:20: fatal error: rte_os.h: No such file or directory
 #include <rte_os.h>
                    ^
compilation terminated.
make[5]: *** [rte_cfgfile.o] Error 1
make[4]: *** [librte_cfgfile] Error 2

*Failed Build #3:
OS: UBT164-32
Target: i686-native-linuxapp-gcc
== Build lib/librte_kvargs
  SYMLINK-FILE include/rte_kvargs.h
  CC rte_kvargs.o
In file included from /tmp/UBT164-32_K4.4.0_GCC5.4.0/i686-native-linuxapp-gcc/950bb668d50144248147049721ccadee/dpdk/lib/librte_eal/common/include/rte_string_fns.h:21:0,
                 from /tmp/UBT164-32_K4.4.0_GCC5.4.0/i686-native-linuxapp-gcc/950bb668d50144248147049721ccadee/dpdk/lib/librte_kvargs/rte_kvargs.c:9:
/tmp/UBT164-32_K4.4.0_GCC5.4.0/i686-native-linuxapp-gcc/950bb668d50144248147049721ccadee/dpdk/lib/librte_eal/common/include/rte_common.h:28:20: fatal error: rte_os.h: No such file or directory
compilation terminated.
  SYMLINK-FILE include/rte_cfgfile.h
/tmp/UBT164-32_K4.4.0_GCC5.4.0/i686-native-linuxapp-gcc/950bb668d50144248147049721ccadee/dpdk/mk/internal/rte.compile-pre.mk:114: recipe for target 'rte_kvargs.o' failed
make[5]: *** [rte_kvargs.o] Error 1
make[5]: *** Waiting for unfinished jobs....
/tmp/UBT164-32_K4.4.0_GCC5.4.0/i686-native-linuxapp-gcc/950bb668d50144248147049721ccadee/dpdk/mk/rte.subdir.mk:35: recipe for target 'librte_kvargs' failed
make[4]: *** [librte_kvargs] Error 2
make[4]: *** Waiting for unfinished jobs....
  CC rte_cfgfile.o
In file included from /tmp/UBT164-32_K4.4.0_GCC5.4.0/i686-native-linuxapp-gcc/950bb668d50144248147049721ccadee/dpdk/lib/librte_cfgfile/rte_cfgfile.c:10:0:
/tmp/UBT164-32_K4.4.0_GCC5.4.0/i686-native-linuxapp-gcc/950bb668d50144248147049721ccadee/dpdk/lib/librte_cfgfile/../librte_eal/common/include/rte_common.h:28:20: fatal error: rte_os.h: No such file or directory
compilation terminated.
/tmp/UBT164-32_K4.4.0_GCC5.4.0/i686-native-linuxapp-gcc/950bb668d50144248147049721ccadee/dpdk/mk/internal/rte.compile-pre.mk:114: recipe for target 'rte_cfgfile.o' failed
make[5]: *** [rte_cfgfile.o] Error 1
/tmp/UBT164-32_K4.4.0_GCC5.4.0/i686-native-linuxapp-gcc/950bb668d50144248147049721ccadee/dpdk/mk/rte.subdir.mk:35: recipe for target 'librte_cfgfile' failed
make[4]: *** [librte_cfgfile] Error 2
/tmp/UBT164-32_K4.4.0_GCC5.4.0/i686-native-linuxapp-gcc/950bb668d50144248147049721ccadee/dpdk/mk/rte.sdkbuild.mk:46: recipe for target 'lib' failed
make[3]: *** [lib] Error 2
/tmp/UBT164-32_K4.4.0_GCC5.4.0/i686-native-linuxapp-gcc/950bb668d50144248147049721ccadee/dpdk/mk/rte.sdkroot.mk:98: recipe for target 'all' failed
make[2]: *** [all] Error 2
/tmp/UBT164-32_K4.4.0_GCC5.4.0/i686-native-linuxapp-gcc/950bb668d50144248147049721ccadee/dpdk/mk/rte.sdkinstall.mk:60: recipe for target 'pre_install' failed
make[1]: *** [pre_install] Error 2
/tmp/UBT164-32_K4.4.0_GCC5.4.0/i686-native-linuxapp-gcc/950bb668d50144248147049721ccadee/dpdk/mk/rte.sdkroot.mk:77: recipe for target 'install' failed
make: *** [install] Error 2

*Failed Build #4:
OS: UBT1804
Target: x86_64-native-linuxapp-clang
  SYMLINK-FILE include/rte_cfgfile.h
  CC rte_cfgfile.o
  SYMLINK-FILE include/rte_kvargs.h
  CC rte_kvargs.o
In file included from /tmp/UBT1804_K4.15.0_Clang6.0.0/x86_64-native-linuxapp-clang/950bb668d50144248147049721ccadee/dpdk/lib/librte_cfgfile/rte_cfgfile.c:10:
/tmp/UBT1804_K4.15.0_Clang6.0.0/x86_64-native-linuxapp-clang/950bb668d50144248147049721ccadee/dpdk/lib/librte_cfgfile/../librte_eal/common/include/rte_common.h:28:10: fatal error: 'rte_os.h' file not found
#include <rte_os.h>
         ^~~~~~~~~~
In file included from /tmp/UBT1804_K4.15.0_Clang6.0.0/x86_64-native-linuxapp-clang/950bb668d50144248147049721ccadee/dpdk/lib/librte_kvargs/rte_kvargs.c:9:
In file included from /tmp/UBT1804_K4.15.0_Clang6.0.0/x86_64-native-linuxapp-clang/950bb668d50144248147049721ccadee/dpdk/lib/librte_eal/common/include/rte_string_fns.h:21:
/tmp/UBT1804_K4.15.0_Clang6.0.0/x86_64-native-linuxapp-clang/950bb668d50144248147049721ccadee/dpdk/lib/librte_eal/common/include/rte_common.h:28:10: fatal error: 'rte_os.h' file not found
#include <rte_os.h>
         ^~~~~~~~~~
1 error generated.
1 error generated.
/tmp/UBT1804_K4.15.0_Clang6.0.0/x86_64-native-linuxapp-clang/950bb668d50144248147049721ccadee/dpdk/mk/internal/rte.compile-pre.mk:114: recipe for target 'rte_kvargs.o' failed
make[5]: *** [rte_kvargs.o] Error 1
/tmp/UBT1804_K4.15.0_Clang6.0.0/x86_64-native-linuxapp-clang/950bb668d50144248147049721ccadee/dpdk/mk/rte.subdir.mk:35: recipe for target 'librte_kvargs' failed
make[4]: *** [librte_kvargs] Error 2
make[4]: *** Waiting for unfinished jobs....
/tmp/UBT1804_K4.15.0_Clang6.0.0/x86_64-native-linuxapp-clang/950bb668d50144248147049721ccadee/dpdk/mk/internal/rte.compile-pre.mk:114: recipe for target 'rte_cfgfile.o' failed
make[5]: *** [rte_cfgfile.o] Error 1
/tmp/UBT1804_K4.15.0_Clang6.0.0/x86_64-native-linuxapp-clang/950bb668d50144248147049721ccadee/dpdk/mk/rte.subdir.mk:35: recipe for target 'librte_cfgfile' failed
make[4]: *** [librte_cfgfile] Error 2
/tmp/UBT1804_K4.15.0_Clang6.0.0/x86_64-native-linuxapp-clang/950bb668d50144248147049721ccadee/dpdk/mk/rte.sdkbuild.mk:46: recipe for target 'lib' failed
make[3]: *** [lib] Error 2
/tmp/UBT1804_K4.15.0_Clang6.0.0/x86_64-native-linuxapp-clang/950bb668d50144248147049721ccadee/dpdk/mk/rte.sdkroot.mk:98: recipe for target 'all' failed
make[2]: *** [all] Error 2
/tmp/UBT1804_K4.15.0_Clang6.0.0/x86_64-native-linuxapp-clang/950bb668d50144248147049721ccadee/dpdk/mk/rte.sdkinstall.mk:60: recipe for target 'pre_install' failed
make[1]: *** [pre_install] Error 2
/tmp/UBT1804_K4.15.0_Clang6.0.0/x86_64-native-linuxapp-clang/950bb668d50144248147049721ccadee/dpdk/mk/rte.sdkroot.mk:77: recipe for target 'install' failed
make: *** [install] Error 2

*Failed Build #5:
OS: UBT144-32
Target: i686-native-linuxapp-gcc
  SYMLINK-FILE include/rte_cfgfile.h
  SYMLINK-FILE include/rte_kvargs.h
  CC rte_cfgfile.o
  CC rte_kvargs.o
In file included from /tmp/UBT144-32_K3.13.0_GCC4.8.4/i686-native-linuxapp-gcc/950bb668d50144248147049721ccadee/dpdk/lib/librte_cfgfile/rte_cfgfile.c:10:0:
/tmp/UBT144-32_K3.13.0_GCC4.8.4/i686-native-linuxapp-gcc/950bb668d50144248147049721ccadee/dpdk/lib/librte_cfgfile/../librte_eal/common/include/rte_common.h:28:20: fatal error: rte_os.h: No such file or directory
 #include <rte_os.h>
                    ^
compilation terminated.
In file included from /tmp/UBT144-32_K3.13.0_GCC4.8.4/i686-native-linuxapp-gcc/950bb668d50144248147049721ccadee/dpdk/lib/librte_eal/common/include/rte_string_fns.h:21:0,
                 from /tmp/UBT144-32_K3.13.0_GCC4.8.4/i686-native-linuxapp-gcc/950bb668d50144248147049721ccadee/dpdk/lib/librte_kvargs/rte_kvargs.c:9:
/tmp/UBT144-32_K3.13.0_GCC4.8.4/i686-native-linuxapp-gcc/950bb668d50144248147049721ccadee/dpdk/lib/librte_eal/common/include/rte_common.h:28:20: fatal error: rte_os.h: No such file or directory
 #include <rte_os.h>
                    ^
compilation terminated.
make[5]: *** [rte_cfgfile.o] Error 1
make[4]: *** [librte_cfgfile] Error 2

*Failed Build #6:
OS: UBT1804
Target: x86_64-native-linuxapp-gcc
  SYMLINK-FILE include/rte_cfgfile.h
  CC rte_kvargs.o
  CC rte_cfgfile.o
In file included from /tmp/UBT1804_K4.15.0_GCC7.3.0/x86_64-native-linuxapp-gcc/950bb668d50144248147049721ccadee/dpdk/lib/librte_eal/common/include/rte_string_fns.h:21:0,
                 from /tmp/UBT1804_K4.15.0_GCC7.3.0/x86_64-native-linuxapp-gcc/950bb668d50144248147049721ccadee/dpdk/lib/librte_kvargs/rte_kvargs.c:9:
/tmp/UBT1804_K4.15.0_GCC7.3.0/x86_64-native-linuxapp-gcc/950bb668d50144248147049721ccadee/dpdk/lib/librte_eal/common/include/rte_common.h:28:10: fatal error: rte_os.h: No such file or directory
 #include <rte_os.h>
          ^~~~~~~~~~
compilation terminated.
In file included from /tmp/UBT1804_K4.15.0_GCC7.3.0/x86_64-native-linuxapp-gcc/950bb668d50144248147049721ccadee/dpdk/lib/librte_cfgfile/rte_cfgfile.c:10:0:
/tmp/UBT1804_K4.15.0_GCC7.3.0/x86_64-native-linuxapp-gcc/950bb668d50144248147049721ccadee/dpdk/lib/librte_cfgfile/../librte_eal/common/include/rte_common.h:28:10: fatal error: rte_os.h: No such file or directory
 #include <rte_os.h>
          ^~~~~~~~~~
compilation terminated.
/tmp/UBT1804_K4.15.0_GCC7.3.0/x86_64-native-linuxapp-gcc/950bb668d50144248147049721ccadee/dpdk/mk/internal/rte.compile-pre.mk:114: recipe for target 'rte_kvargs.o' failed
make[5]: *** [rte_kvargs.o] Error 1
/tmp/UBT1804_K4.15.0_GCC7.3.0/x86_64-native-linuxapp-gcc/950bb668d50144248147049721ccadee/dpdk/mk/internal/rte.compile-pre.mk:114: recipe for target 'rte_cfgfile.o' failed
make[5]: *** [rte_cfgfile.o] Error 1
/tmp/UBT1804_K4.15.0_GCC7.3.0/x86_64-native-linuxapp-gcc/950bb668d50144248147049721ccadee/dpdk/mk/rte.subdir.mk:35: recipe for target 'librte_kvargs' failed
make[4]: *** [librte_kvargs] Error 2
make[4]: *** Waiting for unfinished jobs....
/tmp/UBT1804_K4.15.0_GCC7.3.0/x86_64-native-linuxapp-gcc/950bb668d50144248147049721ccadee/dpdk/mk/rte.subdir.mk:35: recipe for target 'librte_cfgfile' failed
make[4]: *** [librte_cfgfile] Error 2
/tmp/UBT1804_K4.15.0_GCC7.3.0/x86_64-native-linuxapp-gcc/950bb668d50144248147049721ccadee/dpdk/mk/rte.sdkbuild.mk:46: recipe for target 'lib' failed
make[3]: *** [lib] Error 2
/tmp/UBT1804_K4.15.0_GCC7.3.0/x86_64-native-linuxapp-gcc/950bb668d50144248147049721ccadee/dpdk/mk/rte.sdkroot.mk:98: recipe for target 'all' failed
make[2]: *** [all] Error 2
/tmp/UBT1804_K4.15.0_GCC7.3.0/x86_64-native-linuxapp-gcc/950bb668d50144248147049721ccadee/dpdk/mk/rte.sdkinstall.mk:60: recipe for target 'pre_install' failed
make[1]: *** [pre_install] Error 2
/tmp/UBT1804_K4.15.0_GCC7.3.0/x86_64-native-linuxapp-gcc/950bb668d50144248147049721ccadee/dpdk/mk/rte.sdkroot.mk:77: recipe for target 'install' failed
make: *** [install] Error 2

*Failed Build #7:
OS: UBT1810
Target: x86_64-native-linuxapp-gcc
  CC rte_kvargs.o
  SYMLINK-FILE include/rte_cfgfile.h
  CC rte_cfgfile.o
In file included from /tmp/UBT1810_K4.18.0_GCC8.2.0/x86_64-native-linuxapp-gcc/950bb668d50144248147049721ccadee/dpdk/lib/librte_eal/common/include/rte_string_fns.h:21,
                 from /tmp/UBT1810_K4.18.0_GCC8.2.0/x86_64-native-linuxapp-gcc/950bb668d50144248147049721ccadee/dpdk/lib/librte_kvargs/rte_kvargs.c:9:
/tmp/UBT1810_K4.18.0_GCC8.2.0/x86_64-native-linuxapp-gcc/950bb668d50144248147049721ccadee/dpdk/lib/librte_eal/common/include/rte_common.h:28:10: fatal error: rte_os.h: No such file or directory
 #include <rte_os.h>
          ^~~~~~~~~~
compilation terminated.
make[5]: *** [/tmp/UBT1810_K4.18.0_GCC8.2.0/x86_64-native-linuxapp-gcc/950bb668d50144248147049721ccadee/dpdk/mk/internal/rte.compile-pre.mk:116: rte_kvargs.o] Error 1
make[4]: *** [/tmp/UBT1810_K4.18.0_GCC8.2.0/x86_64-native-linuxapp-gcc/950bb668d50144248147049721ccadee/dpdk/mk/rte.subdir.mk:37: librte_kvargs] Error 2
make[4]: *** Waiting for unfinished jobs....
In file included from /tmp/UBT1810_K4.18.0_GCC8.2.0/x86_64-native-linuxapp-gcc/950bb668d50144248147049721ccadee/dpdk/lib/librte_cfgfile/rte_cfgfile.c:10:
/tmp/UBT1810_K4.18.0_GCC8.2.0/x86_64-native-linuxapp-gcc/950bb668d50144248147049721ccadee/dpdk/lib/librte_cfgfile/../librte_eal/common/include/rte_common.h:28:10: fatal error: rte_os.h: No such file or directory
 #include <rte_os.h>
          ^~~~~~~~~~
compilation terminated.
make[5]: *** [/tmp/UBT1810_K4.18.0_GCC8.2.0/x86_64-native-linuxapp-gcc/950bb668d50144248147049721ccadee/dpdk/mk/internal/rte.compile-pre.mk:116: rte_cfgfile.o] Error 1
make[4]: *** [/tmp/UBT1810_K4.18.0_GCC8.2.0/x86_64-native-linuxapp-gcc/950bb668d50144248147049721ccadee/dpdk/mk/rte.subdir.mk:37: librte_cfgfile] Error 2

*Failed Build #8:
OS: UBT1804
Target: x86_64-native-linuxapp-icc
  SYMLINK-FILE include/rte_kvargs.h
  SYMLINK-FILE include/rte_cfgfile.h
  CC rte_kvargs.o
  CC rte_cfgfile.o
In file included from /tmp/UBT1804_K4.15.0_ICC19.0.0/x86_64-native-linuxapp-icc/950bb668d50144248147049721ccadee/dpdk/lib/librte_cfgfile/rte_cfgfile.c(10):
/tmp/UBT1804_K4.15.0_ICC19.0.0/x86_64-native-linuxapp-icc/950bb668d50144248147049721ccadee/dpdk/lib/librte_cfgfile/../librte_eal/common/include/rte_common.h(28): catastrophic error: cannot open source file "rte_os.h"
  #include <rte_os.h>
                     ^

In file included from /tmp/UBT1804_K4.15.0_ICC19.0.0/x86_64-native-linuxapp-icc/950bb668d50144248147049721ccadee/dpdk/lib/librte_eal/common/include/rte_string_fns.h(21),
                 from /tmp/UBT1804_K4.15.0_ICC19.0.0/x86_64-native-linuxapp-icc/950bb668d50144248147049721ccadee/dpdk/lib/librte_kvargs/rte_kvargs.c(9):
/tmp/UBT1804_K4.15.0_ICC19.0.0/x86_64-native-linuxapp-icc/950bb668d50144248147049721ccadee/dpdk/lib/librte_eal/common/include/rte_common.h(28): catastrophic error: cannot open source file "rte_os.h"
  #include <rte_os.h>
                     ^

compilation aborted for /tmp/UBT1804_K4.15.0_ICC19.0.0/x86_64-native-linuxapp-icc/950bb668d50144248147049721ccadee/dpdk/lib/librte_cfgfile/rte_cfgfile.c (code 4)
compilation aborted for /tmp/UBT1804_K4.15.0_ICC19.0.0/x86_64-native-linuxapp-icc/950bb668d50144248147049721ccadee/dpdk/lib/librte_kvargs/rte_kvargs.c (code 4)
/tmp/UBT1804_K4.15.0_ICC19.0.0/x86_64-native-linuxapp-icc/950bb668d50144248147049721ccadee/dpdk/mk/internal/rte.compile-pre.mk:114: recipe for target 'rte_cfgfile.o' failed
make[5]: *** [rte_cfgfile.o] Error 4
/tmp/UBT1804_K4.15.0_ICC19.0.0/x86_64-native-linuxapp-icc/950bb668d50144248147049721ccadee/dpdk/mk/rte.subdir.mk:35: recipe for target 'librte_cfgfile' failed
make[4]: *** [librte_cfgfile] Error 2
make[4]: *** Waiting for unfinished jobs....
/tmp/UBT1804_K4.15.0_ICC19.0.0/x86_64-native-linuxapp-icc/950bb668d50144248147049721ccadee/dpdk/mk/internal/rte.compile-pre.mk:114: recipe for target 'rte_kvargs.o' failed
make[5]: *** [rte_kvargs.o] Error 4
/tmp/UBT1804_K4.15.0_ICC19.0.0/x86_64-native-linuxapp-icc/950bb668d50144248147049721ccadee/dpdk/mk/rte.subdir.mk:35: recipe for target 'librte_kvargs' failed
make[4]: *** [librte_kvargs] Error 2
/tmp/UBT1804_K4.15.0_ICC19.0.0/x86_64-native-linuxapp-icc/950bb668d50144248147049721ccadee/dpdk/mk/rte.sdkbuild.mk:46: recipe for target 'lib' failed
make[3]: *** [lib] Error 2
/tmp/UBT1804_K4.15.0_ICC19.0.0/x86_64-native-linuxapp-icc/950bb668d50144248147049721ccadee/dpdk/mk/rte.sdkroot.mk:98: recipe for target 'all' failed
make[2]: *** [all] Error 2
/tmp/UBT1804_K4.15.0_ICC19.0.0/x86_64-native-linuxapp-icc/950bb668d50144248147049721ccadee/dpdk/mk/rte.sdkinstall.mk:60: recipe for target 'pre_install' failed
make[1]: *** [pre_install] Error 2
/tmp/UBT1804_K4.15.0_ICC19.0.0/x86_64-native-linuxapp-icc/950bb668d50144248147049721ccadee/dpdk/mk/rte.sdkroot.mk:77: recipe for target 'install' failed
make: *** [install] Error 2

*Failed Build #9:
OS: FC28
Target: x86_64-native-linuxapp-clang
  SYMLINK-FILE include/rte_cfgfile.h
  SYMLINK-FILE include/rte_kvargs.h
  CC rte_cfgfile.o
  CC rte_kvargs.o
In file included from /tmp/FC28_K4.16.3_Clang6.0.1/x86_64-native-linuxapp-clang/950bb668d50144248147049721ccadee/dpdk/lib/librte_cfgfile/rte_cfgfile.c:10:
/tmp/FC28_K4.16.3_Clang6.0.1/x86_64-native-linuxapp-clang/950bb668d50144248147049721ccadee/dpdk/lib/librte_cfgfile/../librte_eal/common/include/rte_common.h:28:10: fatal error: 'rte_os.h' file not found
#include <rte_os.h>
         ^~~~~~~~~~
In file included from /tmp/FC28_K4.16.3_Clang6.0.1/x86_64-native-linuxapp-clang/950bb668d50144248147049721ccadee/dpdk/lib/librte_kvargs/rte_kvargs.c:9:
In file included from /tmp/FC28_K4.16.3_Clang6.0.1/x86_64-native-linuxapp-clang/950bb668d50144248147049721ccadee/dpdk/lib/librte_eal/common/include/rte_string_fns.h:21:
/tmp/FC28_K4.16.3_Clang6.0.1/x86_64-native-linuxapp-clang/950bb668d50144248147049721ccadee/dpdk/lib/librte_eal/common/include/rte_common.h:28:10: fatal error: 'rte_os.h' file not found
#include <rte_os.h>
         ^~~~~~~~~~
1 error generated.
make[5]: *** [/tmp/FC28_K4.16.3_Clang6.0.1/x86_64-native-linuxapp-clang/950bb668d50144248147049721ccadee/dpdk/mk/internal/rte.compile-pre.mk:116: rte_kvargs.o] Error 1
1 error generated.
make[4]: *** [/tmp/FC28_K4.16.3_Clang6.0.1/x86_64-native-linuxapp-clang/950bb668d50144248147049721ccadee/dpdk/mk/rte.subdir.mk:37: librte_kvargs] Error 2
make[4]: *** Waiting for unfinished jobs....
make[5]: *** [/tmp/FC28_K4.16.3_Clang6.0.1/x86_64-native-linuxapp-clang/950bb668d50144248147049721ccadee/dpdk/mk/internal/rte.compile-pre.mk:116: rte_cfgfile.o] Error 1
make[4]: *** [/tmp/FC28_K4.16.3_Clang6.0.1/x86_64-native-linuxapp-clang/950bb668d50144248147049721ccadee/dpdk/mk/rte.subdir.mk:37: librte_cfgfile] Error 2
make[3]: *** [/tmp/FC28_K4.16.3_Clang6.0.1/x86_64-native-linuxapp-clang/950bb668d50144248147049721ccadee/dpdk/mk/rte.sdkbuild.mk:48: lib] Error 2

*Failed Build #10:
OS: FC28
Target: x86_64-native-linuxapp-gcc
  CC rte_kvargs.o
  SYMLINK-FILE include/rte_cfgfile.h
  CC rte_cfgfile.o
In file included from /tmp/FC28_K4.16.3_GCC8.0.1/x86_64-native-linuxapp-gcc/950bb668d50144248147049721ccadee/dpdk/lib/librte_eal/common/include/rte_string_fns.h:21,
                 from /tmp/FC28_K4.16.3_GCC8.0.1/x86_64-native-linuxapp-gcc/950bb668d50144248147049721ccadee/dpdk/lib/librte_kvargs/rte_kvargs.c:9:
/tmp/FC28_K4.16.3_GCC8.0.1/x86_64-native-linuxapp-gcc/950bb668d50144248147049721ccadee/dpdk/lib/librte_eal/common/include/rte_common.h:28:10: fatal error: rte_os.h: No such file or directory
 #include <rte_os.h>
          ^~~~~~~~~~
compilation terminated.
make[5]: *** [/tmp/FC28_K4.16.3_GCC8.0.1/x86_64-native-linuxapp-gcc/950bb668d50144248147049721ccadee/dpdk/mk/internal/rte.compile-pre.mk:116: rte_kvargs.o] Error 1
make[4]: *** [/tmp/FC28_K4.16.3_GCC8.0.1/x86_64-native-linuxapp-gcc/950bb668d50144248147049721ccadee/dpdk/mk/rte.subdir.mk:37: librte_kvargs] Error 2
make[4]: *** Waiting for unfinished jobs....
In file included from /tmp/FC28_K4.16.3_GCC8.0.1/x86_64-native-linuxapp-gcc/950bb668d50144248147049721ccadee/dpdk/lib/librte_cfgfile/rte_cfgfile.c:10:
/tmp/FC28_K4.16.3_GCC8.0.1/x86_64-native-linuxapp-gcc/950bb668d50144248147049721ccadee/dpdk/lib/librte_cfgfile/../librte_eal/common/include/rte_common.h:28:10: fatal error: rte_os.h: No such file or directory
 #include <rte_os.h>
          ^~~~~~~~~~
compilation terminated.
make[5]: *** [/tmp/FC28_K4.16.3_GCC8.0.1/x86_64-native-linuxapp-gcc/950bb668d50144248147049721ccadee/dpdk/mk/internal/rte.compile-pre.mk:116: rte_cfgfile.o] Error 1
make[4]: *** [/tmp/FC28_K4.16.3_GCC8.0.1/x86_64-native-linuxapp-gcc/950bb668d50144248147049721ccadee/dpdk/mk/rte.subdir.mk:37: librte_cfgfile] Error 2

*Failed Build #11:
OS: RHEL75
Target: x86_64-native-linuxapp-gcc
  SYMLINK-FILE include/rte_kvargs.h
  SYMLINK-FILE include/rte_cfgfile.h
  CC rte_kvargs.o
  CC rte_cfgfile.o
In file included from /tmp/RHEL75_K3.10.0_GCC4.8.5/x86_64-native-linuxapp-gcc/950bb668d50144248147049721ccadee/dpdk/lib/librte_cfgfile/rte_cfgfile.c:10:0:
/tmp/RHEL75_K3.10.0_GCC4.8.5/x86_64-native-linuxapp-gcc/950bb668d50144248147049721ccadee/dpdk/lib/librte_cfgfile/../librte_eal/common/include/rte_common.h:28:20: fatal error: rte_os.h: No such file or directory
 #include <rte_os.h>
                    ^
In file included from /tmp/RHEL75_K3.10.0_GCC4.8.5/x86_64-native-linuxapp-gcc/950bb668d50144248147049721ccadee/dpdk/lib/librte_eal/common/include/rte_string_fns.h:21:0,
                 from /tmp/RHEL75_K3.10.0_GCC4.8.5/x86_64-native-linuxapp-gcc/950bb668d50144248147049721ccadee/dpdk/lib/librte_kvargs/rte_kvargs.c:9:
/tmp/RHEL75_K3.10.0_GCC4.8.5/x86_64-native-linuxapp-gcc/950bb668d50144248147049721ccadee/dpdk/lib/librte_eal/common/include/rte_common.h:28:20: fatal error: rte_os.h: No such file or directory
 #include <rte_os.h>
                    ^
compilation terminated.
compilation terminated.
make[5]: *** [rte_cfgfile.o] Error 1

*Failed Build #12:
OS: FreeBSD11.2
Target: x86_64-native-bsdapp-clang
  CC rte_cfgfile.o
  SYMLINK-FILE include/rte_kvargs.h
  CC rte_kvargs.o
In file included from /tmp/FreeBSD11.2_K11.2_Clang6.0.0/x86_64-native-bsdapp-clang/950bb668d50144248147049721ccadee/dpdk/lib/librte_kvargs/rte_kvargs.c:9:
In file included from /tmp/FreeBSD11.2_K11.2_Clang6.0.0/x86_64-native-bsdapp-clang/950bb668d50144248147049721ccadee/dpdk/lib/librte_eal/common/include/rte_string_fns.h:21:
/tmp/FreeBSD11.2_K11.2_Clang6.0.0/x86_64-native-bsdapp-clang/950bb668d50144248147049721ccadee/dpdk/lib/librte_eal/common/include/rte_common.h:28:10: fatal error: 'rte_os.h' file not found
In file included from /tmp/FreeBSD11.2_K11.2_Clang6.0.0/x86_64-native-bsdapp-clang/950bb668d50144248147049721ccadee/dpdk/lib/librte_cfgfile/rte_cfgfile.c:10#include <rte_os.h>
         ^~~~~~~~~~
:
/tmp/FreeBSD11.2_K11.2_Clang6.0.0/x86_64-native-bsdapp-clang/950bb668d50144248147049721ccadee/dpdk/lib/librte_cfgfile/../librte_eal/common/include/rte_common.h:28:10: fatal error: 'rte_os.h' file not found
#include <rte_os.h>
         ^~~~~~~~~~
1 error generated.
gmake[5]: *** [/tmp/FreeBSD11.2_K11.2_Clang6.0.0/x86_64-native-bsdapp-clang/950bb668d50144248147049721ccadee/dpdk/mk/internal/rte.compile-pre.mk:116: rte_kvargs.o] Error 1
gmake[4]: *** [/tmp/FreeBSD11.2_K11.2_Clang6.0.0/x86_64-native-bsdapp-clang/950bb668d50144248147049721ccadee/dpdk/mk/rte.subdir.mk:37: librte_kvargs] Error 2
gmake[4]: *** Waiting for unfinished jobs....
1 error generated.
gmake[5]: *** [/tmp/FreeBSD11.2_K11.2_Clang6.0.0/x86_64-native-bsdapp-clang/950bb668d50144248147049721ccadee/dpdk/mk/internal/rte.compile-pre.mk:116: rte_cfgfile.o] Error 1
gmake[4]: *** [/tmp/FreeBSD11.2_K11.2_Clang6.0.0/x86_64-native-bsdapp-clang/950bb668d50144248147049721ccadee/dpdk/mk/rte.subdir.mk:37: librte_cfgfile] Error 2
gmake[3]: *** [/tmp/FreeBSD11.2_K11.2_Clang6.0.0/x86_64-native-bsdapp-clang/950bb668d50144248147049721ccadee/dpdk/mk/rte.sdkbuild.mk:48: lib] Error 2
gmake[2]: *** [/tmp/FreeBSD11.2_K11.2_Clang6.0.0/x86_64-native-bsdapp-clang/950bb668d50144248147049721ccadee/dpdk/mk/rte.sdkroot.mk:99: all] Error 2
gmake[1]: *** [/tmp/FreeBSD11.2_K11.2_Clang6.0.0/x86_64-native-bsdapp-clang/950bb668d50144248147049721ccadee/dpdk/mk/rte.sdkinstall.mk:61: pre_install] Error 2

*Failed Build #13:
OS: FreeBSD11.2
Target: x86_64-native-bsdapp-gcc
  CC rte_cfgfile.o
  SYMLINK-FILE include/rte_kvargs.h
  CC rte_kvargs.o
In file included from /tmp/FreeBSD11.2_K11.2_GCC6.4.0/x86_64-native-bsdapp-gcc/950bb668d50144248147049721ccadee/dpdk/lib/librte_eal/common/include/rte_string_fns.h:21:0,
                 from /tmp/FreeBSD11.2_K11.2_GCC6.4.0/x86_64-native-bsdapp-gcc/950bb668d50144248147049721ccadee/dpdk/lib/librte_kvargs/rte_kvargs.c:9:
/tmp/FreeBSD11.2_K11.2_GCC6.4.0/x86_64-native-bsdapp-gcc/950bb668d50144248147049721ccadee/dpdk/lib/librte_eal/common/include/rte_common.h:28:20: fatal error: rte_os.h: No such file or directory
 #include <rte_os.h>
                    ^
In file included from /tmp/FreeBSD11.2_K11.2_GCC6.4.0/x86_64-native-bsdapp-gcc/950bb668d50144248147049721ccadee/dpdk/lib/librte_cfgfile/rte_cfgfile.c:10:0:
/tmp/FreeBSD11.2_K11.2_GCC6.4.0/x86_64-native-bsdapp-gcc/950bb668d50144248147049721ccadee/dpdk/lib/librte_cfgfile/../librte_eal/common/include/rte_common.h:28:20: fatal error: rte_os.h: No such file or directory
 #include <rte_os.h>
                    ^
compilation terminated.
compilation terminated.
gmake[5]: *** [/tmp/FreeBSD11.2_K11.2_GCC6.4.0/x86_64-native-bsdapp-gcc/950bb668d50144248147049721ccadee/dpdk/mk/internal/rte.compile-pre.mk:116: rte_kvargs.o] Error 1

*Failed Build #14:
OS: FreeBSD12.0
Target: x86_64-native-bsdapp-clang
  CC rte_kvargs.o
  SYMLINK-FILE include/rte_cfgfile.h
  CC rte_cfgfile.o
In file included from /tmp/FreeBSD12.0_K19.02_Clang6.0.1/x86_64-native-bsdapp-clang/950bb668d50144248147049721ccadee/dpdk/lib/librte_kvargs/rte_kvargs.c:9:
In file included from /tmp/FreeBSD12.0_K19.02_Clang6.0.1/x86_64-native-bsdapp-clang/950bb668d50144248147049721ccadee/dpdk/lib/librte_eal/common/include/rte_string_fns.h:21:
/tmp/FreeBSD12.0_K19.02_Clang6.0.1/x86_64-native-bsdapp-clang/950bb668d50144248147049721ccadee/dpdk/lib/librte_eal/common/include/rte_common.h:28:10: fatal error: 'rte_os.h' file not found
#include <rte_os.h>
         ^~~~~~~~~~
In file included from /tmp/FreeBSD12.0_K19.02_Clang6.0.1/x86_64-native-bsdapp-clang/950bb668d50144248147049721ccadee/dpdk/lib/librte_cfgfile/rte_cfgfile.c:10:
/tmp/FreeBSD12.0_K19.02_Clang6.0.1/x86_64-native-bsdapp-clang/950bb668d50144248147049721ccadee/dpdk/lib/librte_cfgfile/../librte_eal/common/include/rte_common.h:28:10: fatal error: 'rte_os.h' file not found
#include <rte_os.h>
         ^~~~~~~~~~
1 error generated.
gmake[5]: *** [/tmp/FreeBSD12.0_K19.02_Clang6.0.1/x86_64-native-bsdapp-clang/950bb668d50144248147049721ccadee/dpdk/mk/internal/rte.compile-pre.mk:116: rte_kvargs.o] Error 1
gmake[4]: *** [/tmp/FreeBSD12.0_K19.02_Clang6.0.1/x86_64-native-bsdapp-clang/950bb668d50144248147049721ccadee/dpdk/mk/rte.subdir.mk:37: librte_kvargs] Error 2
gmake[4]: *** Waiting for unfinished jobs....
1 error generated.
gmake[5]: *** [/tmp/FreeBSD12.0_K19.02_Clang6.0.1/x86_64-native-bsdapp-clang/950bb668d50144248147049721ccadee/dpdk/mk/internal/rte.compile-pre.mk:116: rte_cfgfile.o] Error 1
gmake[4]: *** [/tmp/FreeBSD12.0_K19.02_Clang6.0.1/x86_64-native-bsdapp-clang/950bb668d50144248147049721ccadee/dpdk/mk/rte.subdir.mk:37: librte_cfgfile] Error 2
gmake[3]: *** [/tmp/FreeBSD12.0_K19.02_Clang6.0.1/x86_64-native-bsdapp-clang/950bb668d50144248147049721ccadee/dpdk/mk/rte.sdkbuild.mk:48: lib] Error 2
gmake[2]: *** [/tmp/FreeBSD12.0_K19.02_Clang6.0.1/x86_64-native-bsdapp-clang/950bb668d50144248147049721ccadee/dpdk/mk/rte.sdkroot.mk:99: all] Error 2
gmake[1]: *** [/tmp/FreeBSD12.0_K19.02_Clang6.0.1/x86_64-native-bsdapp-clang/950bb668d50144248147049721ccadee/dpdk/mk/rte.sdkinstall.mk:61: pre_install] Error 2

*Failed Build #15:
OS: FreeBSD12.0
Target: x86_64-native-bsdapp-gcc
  CC rte_kvargs.o
  SYMLINK-FILE include/rte_cfgfile.h
  CC rte_cfgfile.o
In file included from /tmp/FreeBSD12.0_K19.02_GCC7.3.0/x86_64-native-bsdapp-gcc/950bb668d50144248147049721ccadee/dpdk/lib/librte_eal/common/include/rte_string_fns.h:21:0,
                 from /tmp/FreeBSD12.0_K19.02_GCC7.3.0/x86_64-native-bsdapp-gcc/950bb668d50144248147049721ccadee/dpdk/lib/librte_kvargs/rte_kvargs.c:9:
/tmp/FreeBSD12.0_K19.02_GCC7.3.0/x86_64-native-bsdapp-gcc/950bb668d50144248147049721ccadee/dpdk/lib/librte_eal/common/include/rte_common.h:28:10: fatal error: rte_os.h: No such file or directory
 #include <rte_os.h>
          ^~~~~~~~~~
compilation terminated.
In file included from /tmp/FreeBSD12.0_K19.02_GCC7.3.0/x86_64-native-bsdapp-gcc/950bb668d50144248147049721ccadee/dpdk/lib/librte_cfgfile/rte_cfgfile.c:10:0:
/tmp/FreeBSD12.0_K19.02_GCC7.3.0/x86_64-native-bsdapp-gcc/950bb668d50144248147049721ccadee/dpdk/lib/librte_cfgfile/../librte_eal/common/include/rte_common.h:28:10: fatal error: rte_os.h: No such file or directory
 #include <rte_os.h>
          ^~~~~~~~~~
compilation terminated.
gmake[5]: *** [/tmp/FreeBSD12.0_K19.02_GCC7.3.0/x86_64-native-bsdapp-gcc/950bb668d50144248147049721ccadee/dpdk/mk/internal/rte.compile-pre.mk:116: rte_kvargs.o] Error 1
gmake[4]: *** [/tmp/FreeBSD12.0_K19.02_GCC7.3.0/x86_64-native-bsdapp-gcc/950bb668d50144248147049721ccadee/dpdk/mk/rte.subdir.mk:37: librte_kvargs] Error 2

*Failed Build #16:
OS: SUSE15
Target: x86_64-native-linuxapp-gcc
  SYMLINK-FILE include/rte_cfgfile.h
  SYMLINK-FILE include/rte_kvargs.h
  CC rte_cfgfile.o
  CC rte_kvargs.o
In file included from /tmp/SUSE15_K4.12.14_GCC7.3.1/x86_64-native-linuxapp-gcc/950bb668d50144248147049721ccadee/dpdk/lib/librte_cfgfile/rte_cfgfile.c:10:0:
/tmp/SUSE15_K4.12.14_GCC7.3.1/x86_64-native-linuxapp-gcc/950bb668d50144248147049721ccadee/dpdk/lib/librte_cfgfile/../librte_eal/common/include/rte_common.h:28:10: fatal error: rte_os.h: No such file or directory
 #include <rte_os.h>
          ^~~~~~~~~~
compilation terminated.
make[5]: *** [/tmp/SUSE15_K4.12.14_GCC7.3.1/x86_64-native-linuxapp-gcc/950bb668d50144248147049721ccadee/dpdk/mk/internal/rte.compile-pre.mk:116: rte_cfgfile.o] Error 1
make[4]: *** [/tmp/SUSE15_K4.12.14_GCC7.3.1/x86_64-native-linuxapp-gcc/950bb668d50144248147049721ccadee/dpdk/mk/rte.subdir.mk:37: librte_cfgfile] Error 2
make[4]: *** Waiting for unfinished jobs....
In file included from /tmp/SUSE15_K4.12.14_GCC7.3.1/x86_64-native-linuxapp-gcc/950bb668d50144248147049721ccadee/dpdk/lib/librte_eal/common/include/rte_string_fns.h:21:0,
                 from /tmp/SUSE15_K4.12.14_GCC7.3.1/x86_64-native-linuxapp-gcc/950bb668d50144248147049721ccadee/dpdk/lib/librte_kvargs/rte_kvargs.c:9:
/tmp/SUSE15_K4.12.14_GCC7.3.1/x86_64-native-linuxapp-gcc/950bb668d50144248147049721ccadee/dpdk/lib/librte_eal/common/include/rte_common.h:28:10: fatal error: rte_os.h: No such file or directory
 #include <rte_os.h>
          ^~~~~~~~~~
compilation terminated.
make[5]: *** [/tmp/SUSE15_K4.12.14_GCC7.3.1/x86_64-native-linuxapp-gcc/950bb668d50144248147049721ccadee/dpdk/mk/internal/rte.compile-pre.mk:116: rte_kvargs.o] Error 1
make[4]: *** [/tmp/SUSE15_K4.12.14_GCC7.3.1/x86_64-native-linuxapp-gcc/950bb668d50144248147049721ccadee/dpdk/mk/rte.subdir.mk:37: librte_kvargs] Error 2

*Failed Build #17:
OS: RHEL76
Target: x86_64-native-linuxapp-gcc
  SYMLINK-FILE include/rte_cfgfile.h
  CC rte_cfgfile.o
  SYMLINK-FILE include/rte_kvargs.h
  CC rte_kvargs.o
In file included from /tmp/RHEL76_K3.10.0_GCC4.8.5/x86_64-native-linuxapp-gcc/950bb668d50144248147049721ccadee/dpdk/lib/librte_cfgfile/rte_cfgfile.c:10:0:
/tmp/RHEL76_K3.10.0_GCC4.8.5/x86_64-native-linuxapp-gcc/950bb668d50144248147049721ccadee/dpdk/lib/librte_cfgfile/../librte_eal/common/include/rte_common.h:28:20: fatal error: rte_os.h: No such file or directory
 #include <rte_os.h>
                    ^
compilation terminated.
In file included from /tmp/RHEL76_K3.10.0_GCC4.8.5/x86_64-native-linuxapp-gcc/950bb668d50144248147049721ccadee/dpdk/lib/librte_eal/common/include/rte_string_fns.h:21:0,
                 from /tmp/RHEL76_K3.10.0_GCC4.8.5/x86_64-native-linuxapp-gcc/950bb668d50144248147049721ccadee/dpdk/lib/librte_kvargs/rte_kvargs.c:9:
/tmp/RHEL76_K3.10.0_GCC4.8.5/x86_64-native-linuxapp-gcc/950bb668d50144248147049721ccadee/dpdk/lib/librte_eal/common/include/rte_common.h:28:20: fatal error: rte_os.h: No such file or directory
 #include <rte_os.h>
                    ^
compilation terminated.
make[5]: *** [rte_cfgfile.o] Error 1
make[4]: *** [librte_cfgfile] Error 2

*Failed Build #18:
OS: FC29
Target: x86_64-native-linuxapp-gcc
  CC rte_kvargs.o
  SYMLINK-FILE include/rte_cfgfile.h
  CC rte_cfgfile.o
In file included from /tmp/FC29_K4.20_GCC8.0.1/x86_64-native-linuxapp-gcc/950bb668d50144248147049721ccadee/dpdk/lib/librte_eal/common/include/rte_string_fns.h:21,
                 from /tmp/FC29_K4.20_GCC8.0.1/x86_64-native-linuxapp-gcc/950bb668d50144248147049721ccadee/dpdk/lib/librte_kvargs/rte_kvargs.c:9:
/tmp/FC29_K4.20_GCC8.0.1/x86_64-native-linuxapp-gcc/950bb668d50144248147049721ccadee/dpdk/lib/librte_eal/common/include/rte_common.h:28:10: fatal error: rte_os.h: No such file or directory
 #include <rte_os.h>
          ^~~~~~~~~~
compilation terminated.
make[5]: *** [/tmp/FC29_K4.20_GCC8.0.1/x86_64-native-linuxapp-gcc/950bb668d50144248147049721ccadee/dpdk/mk/internal/rte.compile-pre.mk:116: rte_kvargs.o] Error 1
make[4]: *** [/tmp/FC29_K4.20_GCC8.0.1/x86_64-native-linuxapp-gcc/950bb668d50144248147049721ccadee/dpdk/mk/rte.subdir.mk:37: librte_kvargs] Error 2
make[4]: *** Waiting for unfinished jobs....
In file included from /tmp/FC29_K4.20_GCC8.0.1/x86_64-native-linuxapp-gcc/950bb668d50144248147049721ccadee/dpdk/lib/librte_cfgfile/rte_cfgfile.c:10:
/tmp/FC29_K4.20_GCC8.0.1/x86_64-native-linuxapp-gcc/950bb668d50144248147049721ccadee/dpdk/lib/librte_cfgfile/../librte_eal/common/include/rte_common.h:28:10: fatal error: rte_os.h: No such file or directory
 #include <rte_os.h>
          ^~~~~~~~~~
compilation terminated.
make[5]: *** [/tmp/FC29_K4.20_GCC8.0.1/x86_64-native-linuxapp-gcc/950bb668d50144248147049721ccadee/dpdk/mk/internal/rte.compile-pre.mk:116: rte_cfgfile.o] Error 1
make[4]: *** [/tmp/FC29_K4.20_GCC8.0.1/x86_64-native-linuxapp-gcc/950bb668d50144248147049721ccadee/dpdk/mk/rte.subdir.mk:37: librte_cfgfile] Error 2

*Failed Build #19:
OS: FC29
Target: x86_64-native-linuxapp-clang
  SYMLINK-FILE include/rte_cfgfile.h
  CC rte_cfgfile.o
  SYMLINK-FILE include/rte_kvargs.h
  CC rte_kvargs.o
In file included from /tmp/FC29_K4.20_Clang6.0.1/x86_64-native-linuxapp-clang/950bb668d50144248147049721ccadee/dpdk/lib/librte_cfgfile/rte_cfgfile.c:10:
/tmp/FC29_K4.20_Clang6.0.1/x86_64-native-linuxapp-clang/950bb668d50144248147049721ccadee/dpdk/lib/librte_cfgfile/../librte_eal/common/include/rte_common.h:28:10: fatal error: 'rte_os.h' file not found
#include <rte_os.h>
         ^~~~~~~~~~
1 error generated.
make[5]: *** [/tmp/FC29_K4.20_Clang6.0.1/x86_64-native-linuxapp-clang/950bb668d50144248147049721ccadee/dpdk/mk/internal/rte.compile-pre.mk:116: rte_cfgfile.o] Error 1
make[4]: *** [/tmp/FC29_K4.20_Clang6.0.1/x86_64-native-linuxapp-clang/950bb668d50144248147049721ccadee/dpdk/mk/rte.subdir.mk:37: librte_cfgfile] Error 2
make[4]: *** Waiting for unfinished jobs....
In file included from /tmp/FC29_K4.20_Clang6.0.1/x86_64-native-linuxapp-clang/950bb668d50144248147049721ccadee/dpdk/lib/librte_kvargs/rte_kvargs.c:9:
In file included from /tmp/FC29_K4.20_Clang6.0.1/x86_64-native-linuxapp-clang/950bb668d50144248147049721ccadee/dpdk/lib/librte_eal/common/include/rte_string_fns.h:21:
/tmp/FC29_K4.20_Clang6.0.1/x86_64-native-linuxapp-clang/950bb668d50144248147049721ccadee/dpdk/lib/librte_eal/common/include/rte_common.h:28:10: fatal error: 'rte_os.h' file not found
#include <rte_os.h>
         ^~~~~~~~~~
1 error generated.
make[5]: *** [/tmp/FC29_K4.20_Clang6.0.1/x86_64-native-linuxapp-clang/950bb668d50144248147049721ccadee/dpdk/mk/internal/rte.compile-pre.mk:116: rte_kvargs.o] Error 1
make[4]: *** [/tmp/FC29_K4.20_Clang6.0.1/x86_64-native-linuxapp-clang/950bb668d50144248147049721ccadee/dpdk/mk/rte.subdir.mk:37: librte_kvargs] Error 2
make[3]: *** [/tmp/FC29_K4.20_Clang6.0.1/x86_64-native-linuxapp-clang/950bb668d50144248147049721ccadee/dpdk/mk/rte.sdkbuild.mk:48: lib] Error 2
make[2]: *** [/tmp/FC29_K4.20_Clang6.0.1/x86_64-native-linuxapp-clang/950bb668d50144248147049721ccadee/dpdk/mk/rte.sdkroot.mk:99: all] Error 2
make[1]: *** [/tmp/FC29_K4.20_Clang6.0.1/x86_64-native-linuxapp-clang/950bb668d50144248147049721ccadee/dpdk/mk/rte.sdkinstall.mk:61: pre_install] Error 2

*Failed Build #20:
OS: FC29
Target: x86_64-native-linuxapp-icc
  CC rte_kvargs.o
  SYMLINK-FILE include/rte_cfgfile.h
  CC rte_cfgfile.o
In file included from /tmp/FC29_K4.20_ICC19.0.0/x86_64-native-linuxapp-icc/950bb668d50144248147049721ccadee/dpdk/lib/librte_eal/common/include/rte_string_fns.h(21),
                 from /tmp/FC29_K4.20_ICC19.0.0/x86_64-native-linuxapp-icc/950bb668d50144248147049721ccadee/dpdk/lib/librte_kvargs/rte_kvargs.c(9):
/tmp/FC29_K4.20_ICC19.0.0/x86_64-native-linuxapp-icc/950bb668d50144248147049721ccadee/dpdk/lib/librte_eal/common/include/rte_common.h(28): catastrophic error: cannot open source file "rte_os.h"
  #include <rte_os.h>
                     ^

compilation aborted for /tmp/FC29_K4.20_ICC19.0.0/x86_64-native-linuxapp-icc/950bb668d50144248147049721ccadee/dpdk/lib/librte_kvargs/rte_kvargs.c (code 4)
make[5]: *** [/tmp/FC29_K4.20_ICC19.0.0/x86_64-native-linuxapp-icc/950bb668d50144248147049721ccadee/dpdk/mk/internal/rte.compile-pre.mk:116: rte_kvargs.o] Error 4
make[4]: *** [/tmp/FC29_K4.20_ICC19.0.0/x86_64-native-linuxapp-icc/950bb668d50144248147049721ccadee/dpdk/mk/rte.subdir.mk:37: librte_kvargs] Error 2
make[4]: *** Waiting for unfinished jobs....
In file included from /tmp/FC29_K4.20_ICC19.0.0/x86_64-native-linuxapp-icc/950bb668d50144248147049721ccadee/dpdk/lib/librte_cfgfile/rte_cfgfile.c(10):
/tmp/FC29_K4.20_ICC19.0.0/x86_64-native-linuxapp-icc/950bb668d50144248147049721ccadee/dpdk/lib/librte_cfgfile/../librte_eal/common/include/rte_common.h(28): catastrophic error: cannot open source file "rte_os.h"
  #include <rte_os.h>
                     ^

compilation aborted for /tmp/FC29_K4.20_ICC19.0.0/x86_64-native-linuxapp-icc/950bb668d50144248147049721ccadee/dpdk/lib/librte_cfgfile/rte_cfgfile.c (code 4)
make[5]: *** [/tmp/FC29_K4.20_ICC19.0.0/x86_64-native-linuxapp-icc/950bb668d50144248147049721ccadee/dpdk/mk/internal/rte.compile-pre.mk:116: rte_cfgfile.o] Error 4

*Failed Build #21:
OS: CENTOS74
Target: x86_64-native-linuxapp-gcc
  SYMLINK-FILE include/rte_cfgfile.h
  SYMLINK-FILE include/rte_kvargs.h
  CC rte_cfgfile.o
  CC rte_kvargs.o
In file included from /tmp/CENTOS74_K3.10.0_GCC4.8.5/x86_64-native-linuxapp-gcc/950bb668d50144248147049721ccadee/dpdk/lib/librte_cfgfile/rte_cfgfile.c:10:0:
/tmp/CENTOS74_K3.10.0_GCC4.8.5/x86_64-native-linuxapp-gcc/950bb668d50144248147049721ccadee/dpdk/lib/librte_cfgfile/../librte_eal/common/include/rte_common.h:28:20: fatal error: rte_os.h: No such file or directory
 #include <rte_os.h>
                    ^
compilation terminated.
In file included from /tmp/CENTOS74_K3.10.0_GCC4.8.5/x86_64-native-linuxapp-gcc/950bb668d50144248147049721ccadee/dpdk/lib/librte_eal/common/include/rte_string_fns.h:21:0,
                 from /tmp/CENTOS74_K3.10.0_GCC4.8.5/x86_64-native-linuxapp-gcc/950bb668d50144248147049721ccadee/dpdk/lib/librte_kvargs/rte_kvargs.c:9:
/tmp/CENTOS74_K3.10.0_GCC4.8.5/x86_64-native-linuxapp-gcc/950bb668d50144248147049721ccadee/dpdk/lib/librte_eal/common/include/rte_common.h:28:20: fatal error: rte_os.h: No such file or directory
 #include <rte_os.h>
                    ^
compilation terminated.
make[5]: *** [rte_cfgfile.o] Error 1
make[4]: *** [librte_cfgfile] Error 2

*Failed Build #22:
OS: CENTOS75
Target: x86_64-native-linuxapp-gcc
  SYMLINK-FILE include/rte_cfgfile.h
  CC rte_cfgfile.o
  SYMLINK-FILE include/rte_kvargs.h
  CC rte_kvargs.o
In file included from /tmp/CENTOS75_K3.10.0_GCC4.8.5/x86_64-native-linuxapp-gcc/950bb668d50144248147049721ccadee/dpdk/lib/librte_cfgfile/rte_cfgfile.c:10:0:
/tmp/CENTOS75_K3.10.0_GCC4.8.5/x86_64-native-linuxapp-gcc/950bb668d50144248147049721ccadee/dpdk/lib/librte_cfgfile/../librte_eal/common/include/rte_common.h:28:20: fatal error: rte_os.h: No such file or directory
 #include <rte_os.h>
                    ^
compilation terminated.
In file included from /tmp/CENTOS75_K3.10.0_GCC4.8.5/x86_64-native-linuxapp-gcc/950bb668d50144248147049721ccadee/dpdk/lib/librte_eal/common/include/rte_string_fns.h:21:0,
                 from /tmp/CENTOS75_K3.10.0_GCC4.8.5/x86_64-native-linuxapp-gcc/950bb668d50144248147049721ccadee/dpdk/lib/librte_kvargs/rte_kvargs.c:9:
/tmp/CENTOS75_K3.10.0_GCC4.8.5/x86_64-native-linuxapp-gcc/950bb668d50144248147049721ccadee/dpdk/lib/librte_eal/common/include/rte_common.h:28:20: fatal error: rte_os.h: No such file or directory
 #include <rte_os.h>
                    ^
compilation terminated.
make[5]: *** [rte_cfgfile.o] Error 1
make[4]: *** [librte_cfgfile] Error 2

*Failed Build #23:
OS: FC28
Target: x86_64-native-linuxapp-icc
  CC rte_kvargs.o
  SYMLINK-FILE include/rte_cfgfile.h
  CC rte_cfgfile.o
In file included from /tmp/FC28_K4.16.3_ICC19.0.0/x86_64-native-linuxapp-icc/950bb668d50144248147049721ccadee/dpdk/lib/librte_eal/common/include/rte_string_fns.h(21),
                 from /tmp/FC28_K4.16.3_ICC19.0.0/x86_64-native-linuxapp-icc/950bb668d50144248147049721ccadee/dpdk/lib/librte_kvargs/rte_kvargs.c(9):
/tmp/FC28_K4.16.3_ICC19.0.0/x86_64-native-linuxapp-icc/950bb668d50144248147049721ccadee/dpdk/lib/librte_eal/common/include/rte_common.h(28): catastrophic error: cannot open source file "rte_os.h"
  #include <rte_os.h>
                     ^

In file included from /tmp/FC28_K4.16.3_ICC19.0.0/x86_64-native-linuxapp-icc/950bb668d50144248147049721ccadee/dpdk/lib/librte_cfgfile/rte_cfgfile.c(10):
/tmp/FC28_K4.16.3_ICC19.0.0/x86_64-native-linuxapp-icc/950bb668d50144248147049721ccadee/dpdk/lib/librte_cfgfile/../librte_eal/common/include/rte_common.h(28): catastrophic error: cannot open source file "rte_os.h"
  #include <rte_os.h>
                     ^

compilation aborted for /tmp/FC28_K4.16.3_ICC19.0.0/x86_64-native-linuxapp-icc/950bb668d50144248147049721ccadee/dpdk/lib/librte_kvargs/rte_kvargs.c (code 4)
compilation aborted for /tmp/FC28_K4.16.3_ICC19.0.0/x86_64-native-linuxapp-icc/950bb668d50144248147049721ccadee/dpdk/lib/librte_cfgfile/rte_cfgfile.c (code 4)

*Failed Build #24:
OS: RHEL74
Target: x86_64-native-linuxapp-gcc
  SYMLINK-FILE include/rte_cfgfile.h
  CC rte_kvargs.o
  CC rte_cfgfile.o
In file included from /tmp/RHEL74_K3.10.0_GCC4.8.5/x86_64-native-linuxapp-gcc/950bb668d50144248147049721ccadee/dpdk/lib/librte_eal/common/include/rte_string_fns.h:21:0,
                 from /tmp/RHEL74_K3.10.0_GCC4.8.5/x86_64-native-linuxapp-gcc/950bb668d50144248147049721ccadee/dpdk/lib/librte_kvargs/rte_kvargs.c:9:
/tmp/RHEL74_K3.10.0_GCC4.8.5/x86_64-native-linuxapp-gcc/950bb668d50144248147049721ccadee/dpdk/lib/librte_eal/common/include/rte_common.h:28:20: fatal error: rte_os.h: No such file or directory
 #include <rte_os.h>
                    ^
compilation terminated.
In file included from /tmp/RHEL74_K3.10.0_GCC4.8.5/x86_64-native-linuxapp-gcc/950bb668d50144248147049721ccadee/dpdk/lib/librte_cfgfile/rte_cfgfile.c:10:0:
/tmp/RHEL74_K3.10.0_GCC4.8.5/x86_64-native-linuxapp-gcc/950bb668d50144248147049721ccadee/dpdk/lib/librte_cfgfile/../librte_eal/common/include/rte_common.h:28:20: fatal error: rte_os.h: No such file or directory
 #include <rte_os.h>
                    ^
compilation terminated.
make[5]: *** [rte_cfgfile.o] Error 1
make[4]: *** [librte_cfgfile] Error 2

*Failed Build #25:
OS: SUSE12
Target: x86_64-native-linuxapp-gcc
  SYMLINK-FILE include/rte_cfgfile.h
  CC rte_kvargs.o
  CC rte_cfgfile.o
In file included from /tmp/SUSE12_K3.7.10_GCC4.7.2/x86_64-native-linuxapp-gcc/950bb668d50144248147049721ccadee/dpdk/lib/librte_eal/common/include/rte_string_fns.h:21:0,
                 from /tmp/SUSE12_K3.7.10_GCC4.7.2/x86_64-native-linuxapp-gcc/950bb668d50144248147049721ccadee/dpdk/lib/librte_kvargs/rte_kvargs.c:9:
/tmp/SUSE12_K3.7.10_GCC4.7.2/x86_64-native-linuxapp-gcc/950bb668d50144248147049721ccadee/dpdk/lib/librte_eal/common/include/rte_common.h:28:10: fatal error: rte_os.h: No such file or directory
 #include <rte_os.h>
          ^~~~~~~~~~
compilation terminated.
/tmp/SUSE12_K3.7.10_GCC4.7.2/x86_64-native-linuxapp-gcc/950bb668d50144248147049721ccadee/dpdk/mk/internal/rte.compile-pre.mk:114: recipe for target 'rte_kvargs.o' failed
make[5]: *** [rte_kvargs.o] Error 1
/tmp/SUSE12_K3.7.10_GCC4.7.2/x86_64-native-linuxapp-gcc/950bb668d50144248147049721ccadee/dpdk/mk/rte.subdir.mk:35: recipe for target 'librte_kvargs' failed
make[4]: *** [librte_kvargs] Error 2
make[4]: *** Waiting for unfinished jobs....
In file included from /tmp/SUSE12_K3.7.10_GCC4.7.2/x86_64-native-linuxapp-gcc/950bb668d50144248147049721ccadee/dpdk/lib/librte_cfgfile/rte_cfgfile.c:10:0:
/tmp/SUSE12_K3.7.10_GCC4.7.2/x86_64-native-linuxapp-gcc/950bb668d50144248147049721ccadee/dpdk/lib/librte_cfgfile/../librte_eal/common/include/rte_common.h:28:10: fatal error: rte_os.h: No such file or directory
 #include <rte_os.h>
          ^~~~~~~~~~
compilation terminated.
/tmp/SUSE12_K3.7.10_GCC4.7.2/x86_64-native-linuxapp-gcc/950bb668d50144248147049721ccadee/dpdk/mk/internal/rte.compile-pre.mk:114: recipe for target 'rte_cfgfile.o' failed
make[5]: *** [rte_cfgfile.o] Error 1
/tmp/SUSE12_K3.7.10_GCC4.7.2/x86_64-native-linuxapp-gcc/950bb668d50144248147049721ccadee/dpdk/mk/rte.subdir.mk:35: recipe for target 'librte_cfgfile' failed
make[4]: *** [librte_cfgfile] Error 2
/tmp/SUSE12_K3.7.10_GCC4.7.2/x86_64-native-linuxapp-gcc/950bb668d50144248147049721ccadee/dpdk/mk/rte.sdkbuild.mk:46: recipe for target 'lib' failed
make[3]: *** [lib] Error 2
/tmp/SUSE12_K3.7.10_GCC4.7.2/x86_64-native-linuxapp-gcc/950bb668d50144248147049721ccadee/dpdk/mk/rte.sdkroot.mk:98: recipe for target 'all' failed
make[2]: *** [all] Error 2
/tmp/SUSE12_K3.7.10_GCC4.7.2/x86_64-native-linuxapp-gcc/950bb668d50144248147049721ccadee/dpdk/mk/rte.sdkinstall.mk:60: recipe for target 'pre_install' failed
make[1]: *** [pre_install] Error 2
/tmp/SUSE12_K3.7.10_GCC4.7.2/x86_64-native-linuxapp-gcc/950bb668d50144248147049721ccadee/dpdk/mk/rte.sdkroot.mk:77: recipe for target 'install' failed
make: *** [install] Error 2

*Failed Build #26:
OS: CENTOS76
Target: x86_64-native-linuxapp-gcc
  SYMLINK-FILE include/rte_kvargs.h
  SYMLINK-FILE include/rte_cfgfile.h
  CC rte_kvargs.o
  CC rte_cfgfile.o
In file included from /tmp/CENTOS76_K3.10.0_GCC4.8.5/x86_64-native-linuxapp-gcc/950bb668d50144248147049721ccadee/dpdk/lib/librte_cfgfile/rte_cfgfile.c:10:0:
/tmp/CENTOS76_K3.10.0_GCC4.8.5/x86_64-native-linuxapp-gcc/950bb668d50144248147049721ccadee/dpdk/lib/librte_cfgfile/../librte_eal/common/include/rte_common.h:28:20: fatal error: rte_os.h: No such file or directory
 #include <rte_os.h>
                    ^
compilation terminated.
In file included from /tmp/CENTOS76_K3.10.0_GCC4.8.5/x86_64-native-linuxapp-gcc/950bb668d50144248147049721ccadee/dpdk/lib/librte_eal/common/include/rte_string_fns.h:21:0,
                 from /tmp/CENTOS76_K3.10.0_GCC4.8.5/x86_64-native-linuxapp-gcc/950bb668d50144248147049721ccadee/dpdk/lib/librte_kvargs/rte_kvargs.c:9:
/tmp/CENTOS76_K3.10.0_GCC4.8.5/x86_64-native-linuxapp-gcc/950bb668d50144248147049721ccadee/dpdk/lib/librte_eal/common/include/rte_common.h:28:20: fatal error: rte_os.h: No such file or directory
 #include <rte_os.h>
                    ^
compilation terminated.
make[5]: *** [rte_kvargs.o] Error 1
make[4]: *** [librte_kvargs] Error 2

DPDK STV team


More information about the test-report mailing list