[dpdk-test-report] |FAILURE| pw62612[v16, 5/8] examples/eventdev_pipeline: split port init sequence

sys_stv at intel.com sys_stv at intel.com
Sat Nov 9 14:30:38 CET 2019


Test-Label: Intel-compilation
Test-Status: FAILURE
http://dpdk.org/patch/62612

_Compilation issues_

Submitter: Pavan Nikhilesh Bhagavatula <pbhagavatula at marvell.com>
Date: 2019-11-06 19:17:59
Reply_mail: 20191106191803.15098-6-pbhagavatula at marvell.com
DPDK git baseline: Repo:dpdk, CommitID: 6bbc5a9236250b708c6d1931e966c74da381b4f2

Makefile build Summary: 22 Builds Done, 0 Successful, 22 Failures

Meson build Summary: 7 Builds Done, 2 Successful, 5 Failures

               +==============================================+===========+==========+
               |                   Makefile                   |   Meson   | Document |
+--------------+------+-------+------+------------+-----------+-----------+----------+
| os           | gcc  | clang | icc  | gcc+shared | gcc+debug | gcc/clang | pdf/html |
+--------------+------+-------+------+------------+-----------+-----------+----------+
| RHEL76-64    | FAIL |       |      |            |           |           |          |
| CENTOS76-64  | FAIL | FAIL  | FAIL | FAIL       | FAIL      |           |          |
| UB1804-64    | FAIL | FAIL  | FAIL |            |           | FAIL      | pass     |
| UB1604-32    | FAIL |       |      |            |           | FAIL      |          |
| UB1904-64    | FAIL |       |      |            |           |           |          |
| UB1604-64    | FAIL | FAIL  |      |            |           |           |          |
| FC30-64      | FAIL | FAIL  |      |            |           | FAIL      |          |
| WIN10-64     |      |       |      |            |           | pass      |          |
| FreeBSD12-64 | FAIL | FAIL  |      | FAIL       | FAIL      | FAIL      |          |
| RHEL80-64    | FAIL |       |      |            |           |           |          |
| SUSE15-64    | FAIL | FAIL  |      |            |           | FAIL      |          |
+--------------+------+-------+------+------------+-----------+-----------+----------+

Test environment and configuration as below:

** Makefile build **


OS: RHEL76-64
	Kernel Version: 3.10.0-957.el7.x86_64
	CPU info: Intel(R) Xeon(R) CPU E5-2699 v4 @ 2.20GHz
	GCC Version: gcc (GCC) 4.8.5 20150623 (Red Hat 4.8.5-36)
	Clang Version: NA
	x86_64-native-linuxapp-gcc


OS: CENTOS76-64
	Kernel Version: 3.10.0-957.27.2.el7.x86_64
	CPU info: Intel(R) Xeon(R) CPU E5-2699 v4 @ 2.20GHz
	GCC Version: gcc (GCC) 4.8.5 20150623 (Red Hat 4.8.5-36)
	Clang Version: 3.4.2 (tags/RELEASE_34/dot2-final)
	x86_64-native-linuxapp-clang
	x86_64-native-linuxapp-gcc
	x86_64-native-linuxapp-gcc+debug
	x86_64-native-linuxapp-gcc+shared
	x86_64-native-linuxapp-icc


OS: UB1804-64
	Kernel Version: 4.15.0-20-generic
	CPU info: Intel(R) Xeon(R) CPU E5-2699 v3 @ 2.30GHz
	GCC Version: gcc (Ubuntu 7.3.0-27ubuntu1~18.04) 7.3.0
	Clang Version: 6.0.0-1ubuntu2 (tags/RELEASE_600/final)
	x86_64-native-linuxapp-icc
	x86_64-native-linuxapp-clang
	x86_64-native-linuxapp-gcc


OS: UB1904-64
	Kernel Version: 5.0.0-13-generic
	CPU info: Intel(R) Xeon(R) CPU E5-2699 v3 @ 2.30GHz
	GCC Version: gcc (Ubuntu 8.3.0-6ubuntu1) 8.3.0
	Clang Version: 8.0.0-3 (tags/RELEASE_800/final)
	x86_64-native-linuxapp-gcc


OS: UB1604-32
	Kernel Version: 4.4.0-131-generic
	CPU info: Intel(R) Xeon(R) CPU E5-2699 v3 @ 2.30GHz
	GCC Version: gcc (Ubuntu 5.4.0-6ubuntu1~16.04.11) 5.4.0 20160609
	Clang Version: 3.8.0-2ubuntu4 (tags/RELEASE_380/final)
	i686-native-linuxapp-gcc


OS: UB1604-64
	Kernel Version: 4.4.0-47-generic
	CPU info: Intel(R) Xeon(R) CPU E5-2699 v3 @ 2.30GHz
	GCC Version: gcc (Ubuntu 5.4.0-6ubuntu1~16.04.12) 5.4.0 20160609
	Clang Version: 3.8.0-2ubuntu4 (tags/RELEASE_380/final)
	x86_64-native-linuxapp-clang
	x86_64-native-linuxapp-gcc


OS: FC30-64
	Kernel Version: 5.1.7-300.fc30.x86_64
	CPU info: Intel(R) Xeon(R) CPU E5-2699 v4 @ 2.20GHz
	GCC Version: gcc (GCC) 9.1.1 20190503 (Red Hat 9.1.1-1)
	Clang Version: 8.0.0 (Fedora 8.0.0-1.fc30)
	x86_64-native-linuxapp-gcc
	x86_64-native-linuxapp-clang


OS: FreeBSD12-64
	Kernel Version: 12.0-RC3
	CPU info: Intel(R) Xeon(R) CPU E5-2699 v4 @ 2.20GHz (2194.98-MHz K8-class CPU)
	GCC Version: gcc (FreeBSD Ports Collection) 7.3.0
	Clang Version: 6.0.1 (tags/RELEASE_601/final 335540) (based on LLVM 6.0.1)
	x86_64-native-bsdapp-clang
	x86_64-native-bsdapp-gcc
	x86_64-native-bsdapp-gcc+debug
	x86_64-native-bsdapp-gcc+shared


OS: RHEL80-64
	Kernel Version: 4.18.0-80.el8.x86_64
	CPU info: Intel(R) Xeon(R) CPU E5-2699 v4 @ 2.20GHz
	GCC Version: gcc (GCC) 8.2.1 20180905 (Red Hat 8.2.1-3)
	Clang Version: 6.0.1 (tags/RELEASE_601/final)
	x86_64-native-linuxapp-gcc


OS: SUSE15-64
	Kernel Version: 4.12.14-lp150.11-default
	CPU info: Intel(R) Xeon(R) CPU E5-2699 v4 @ 2.20GHz
	GCC Version: gcc (SUSE Linux) 7.3.1 20180323 [gcc-7-branch revision 258812]
	Clang Version: 5.0.1 (tags/RELEASE_501/final 312548)
	x86_64-native-linuxapp-gcc
	x86_64-native-linuxapp-clang


** Meson build **


OS: UB1804-64
	Kernel Version: 4.15.0-20-generic
	CPU info: Intel(R) Xeon(R) CPU E5-2699 v4 @ 2.20GHz
	GCC Version: gcc (Ubuntu 7.3.0-27ubuntu1~18.04) 7.3.0
	Clang Version: 6.0.0-1ubuntu2 (tags/RELEASE_600/final)
	x86_64-native-linuxapp-doc
	build-gcc-static
	build-gcc-shared
	build-clang-static
	build-clang-shared
	build-x86-default


OS: UB1604-32
	Kernel Version: 4.4.0-131-generic
	CPU info: Intel(R) Xeon(R) CPU E5-2699 v4 @ 2.20GHz
	GCC Version: gcc (Ubuntu 5.4.0-6ubuntu1~16.04.11) 5.4.0 20160609
	Clang Version: 3.8.0-2ubuntu4 (tags/RELEASE_380/final)
	build-gcc-static
	build-gcc-shared
	build-clang-static
	build-clang-shared
	build-x86-default


OS: FC30-64
	Kernel Version: 5.0.9-301.fc30.x86_64
	CPU info: Intel(R) Xeon(R) CPU E5-2699 v4 @ 2.20GHz
	GCC Version: gcc (GCC) 9.1.1 20190503 (Red Hat 9.1.1-1)
	Clang Version: 8.0.0 (Fedora 8.0.0-1.fc30)
	build-gcc-static
	build-gcc-shared
	build-clang-static
	build-clang-shared
	build-x86-default


OS: WIN10-64
	Kernel Version: N/A
	CPU info: N/A
	GCC Version: N/A
	Clang Version: Clang 8.0.0
	x86_64-windows-clang


OS: FreeBSD12-64
	Kernel Version: 12.0-RC3
	CPU info: Intel(R) Xeon(R) CPU E5-2699 v4 @ 2.20GHz (2194.97-MHz K8-class CPU)
	GCC Version: gcc (FreeBSD Ports Collection) 7.3.0
	Clang Version: 6.0.1 (tags/RELEASE_601/final 335540) (based on LLVM 6.0.1)
	build-gcc-static
	build-gcc-shared
	build-clang-static
	build-clang-shared
	build-x86-default


OS: SUSE15-64
	Kernel Version: 4.12.14-lp150.11-default
	CPU info: Intel(R) Xeon(R) CPU E5-2699 v4 @ 2.20GHz
	GCC Version: gcc (SUSE Linux) 7.3.1 20180323 [gcc-7-branch revision 258812]
	Clang Version: 5.0.1 (tags/RELEASE_501/final 312548)
	build-gcc-static
	build-gcc-shared
	build-clang-static
	build-clang-shared
	build-x86-default


*Make Build Failed #1:
OS: UB1604-64
Target: x86_64-native-linuxapp-clang
/tmp/UB1604-64_K4.4.0_Clang3.8.0/x86_64-native-linuxapp-clang/96cc8aa56d544c9cb04380e3a9789da1/dpdk/x86_64-native-linuxapp-clang/include/rte_ethdev.h:2574:5: note: 'rte_eth_dev_set_mtu' declared here
int rte_eth_dev_set_mtu(uint16_t port_id, uint16_t mtu);
    ^
  CC test.o
1 error generated.
/tmp/UB1604-64_K4.4.0_Clang3.8.0/x86_64-native-linuxapp-clang/96cc8aa56d544c9cb04380e3a9789da1/dpdk/mk/internal/rte.compile-pre.mk:114: recipe for target 'testpmd.o' failed
make[5]: *** [testpmd.o] Error 1
/tmp/UB1604-64_K4.4.0_Clang3.8.0/x86_64-native-linuxapp-clang/96cc8aa56d544c9cb04380e3a9789da1/dpdk/mk/rte.subdir.mk:35: recipe for target 'test-pmd' failed
make[4]: *** [test-pmd] Error 2
make[4]: *** Waiting for unfinished jobs....
  CC comp_perf_options_parse.o
  CC comp_perf_test_verify.o
  LD dpdk-pdump
  CC resource.o
--
  MKRES test_resource_c.res.o
  LD test
  INSTALL-APP test
  INSTALL-MAP test.map
make[5]: warning:  Clock skew detected.  Your build may be incomplete.
/tmp/UB1604-64_K4.4.0_Clang3.8.0/x86_64-native-linuxapp-clang/96cc8aa56d544c9cb04380e3a9789da1/dpdk/mk/rte.sdkbuild.mk:46: recipe for target 'app' failed
make[3]: *** [app] Error 2
/tmp/UB1604-64_K4.4.0_Clang3.8.0/x86_64-native-linuxapp-clang/96cc8aa56d544c9cb04380e3a9789da1/dpdk/mk/rte.sdkroot.mk:98: recipe for target 'all' failed
make[2]: *** [all] Error 2
/tmp/UB1604-64_K4.4.0_Clang3.8.0/x86_64-native-linuxapp-clang/96cc8aa56d544c9cb04380e3a9789da1/dpdk/mk/rte.sdkinstall.mk:60: recipe for target 'pre_install' failed
make[1]: *** [pre_install] Error 2
/tmp/UB1604-64_K4.4.0_Clang3.8.0/x86_64-native-linuxapp-clang/96cc8aa56d544c9cb04380e3a9789da1/dpdk/mk/rte.sdkroot.mk:77: recipe for target 'install' failed
make: *** [install] Error 2


*Make Build Failed #2:
OS: UB1604-32
Target: i686-native-linuxapp-gcc
  ret = rte_eth_dev_set_ptypes(port_id, ptype_mask, ptypes, ret);
  ^
/tmp/UB1604-32_K4.4.0_GCC5.4.0/i686-native-linuxapp-gcc/96cc8aa56d544c9cb04380e3a9789da1/dpdk/app/test-pmd/testpmd.c: At top level:
cc1: error: unrecognized command line option ‘-Wno-address-of-packed-member’ [-Werror]
cc1: all warnings being treated as errors
/tmp/UB1604-32_K4.4.0_GCC5.4.0/i686-native-linuxapp-gcc/96cc8aa56d544c9cb04380e3a9789da1/dpdk/mk/internal/rte.compile-pre.mk:114: recipe for target 'testpmd.o' failed
make[5]: *** [testpmd.o] Error 1
make[5]: *** Waiting for unfinished jobs....
  CC comp_perf_test_verify.o
  CC comp_perf_test_benchmark.o
  CC comp_perf_test_common.o
  CC runtime.o
--
  CC test_bbdev_vector.o
  CC test_reciprocal_division.o
/tmp/UB1604-32_K4.4.0_GCC5.4.0/i686-native-linuxapp-gcc/96cc8aa56d544c9cb04380e3a9789da1/dpdk/app/test-pmd/cmdline.c: At top level:
cc1: error: unrecognized command line option ‘-Wno-address-of-packed-member’ [-Werror]
cc1: all warnings being treated as errors
/tmp/UB1604-32_K4.4.0_GCC5.4.0/i686-native-linuxapp-gcc/96cc8aa56d544c9cb04380e3a9789da1/dpdk/mk/internal/rte.compile-pre.mk:114: recipe for target 'cmdline.o' failed
make[5]: *** [cmdline.o] Error 1
/tmp/UB1604-32_K4.4.0_GCC5.4.0/i686-native-linuxapp-gcc/96cc8aa56d544c9cb04380e3a9789da1/dpdk/mk/rte.subdir.mk:35: recipe for target 'test-pmd' failed
make[4]: *** [test-pmd] Error 2
make[4]: *** Waiting for unfinished jobs....
  CC test_reciprocal_division_perf.o
  CC pipeline_acl.o
  CC test_fbarray.o
  CC test_external_mem.o
--
  MKRES test_resource_c.res.o
  LD test
  INSTALL-APP test
  INSTALL-MAP test.map
make[5]: warning:  Clock skew detected.  Your build may be incomplete.
/tmp/UB1604-32_K4.4.0_GCC5.4.0/i686-native-linuxapp-gcc/96cc8aa56d544c9cb04380e3a9789da1/dpdk/mk/rte.sdkbuild.mk:46: recipe for target 'app' failed
make[3]: *** [app] Error 2
/tmp/UB1604-32_K4.4.0_GCC5.4.0/i686-native-linuxapp-gcc/96cc8aa56d544c9cb04380e3a9789da1/dpdk/mk/rte.sdkroot.mk:98: recipe for target 'all' failed
make[2]: *** [all] Error 2
/tmp/UB1604-32_K4.4.0_GCC5.4.0/i686-native-linuxapp-gcc/96cc8aa56d544c9cb04380e3a9789da1/dpdk/mk/rte.sdkinstall.mk:60: recipe for target 'pre_install' failed
make[1]: *** [pre_install] Error 2
/tmp/UB1604-32_K4.4.0_GCC5.4.0/i686-native-linuxapp-gcc/96cc8aa56d544c9cb04380e3a9789da1/dpdk/mk/rte.sdkroot.mk:77: recipe for target 'install' failed
make: *** [install] Error 2


*Make Build Failed #3:
OS: UB1904-64
Target: x86_64-native-linuxapp-gcc
  INSTALL-APP dpdk-pdump
  CC comp_perf_test_verify.o
/tmp/UB1904-64_K4.18.0_GCC8.3.0/x86_64-native-linuxapp-gcc/96cc8aa56d544c9cb04380e3a9789da1/dpdk/app/test-pmd/testpmd.c: At top level:
cc1: error: unrecognized command line option ‘-Wno-address-of-packed-member’ [-Werror]
cc1: all warnings being treated as errors
make[5]: *** [/tmp/UB1904-64_K4.18.0_GCC8.3.0/x86_64-native-linuxapp-gcc/96cc8aa56d544c9cb04380e3a9789da1/dpdk/mk/internal/rte.compile-pre.mk:116: testpmd.o] Error 1
make[4]: *** [/tmp/UB1904-64_K4.18.0_GCC8.3.0/x86_64-native-linuxapp-gcc/96cc8aa56d544c9cb04380e3a9789da1/dpdk/mk/rte.subdir.mk:37: test-pmd] Error 2
make[4]: *** Waiting for unfinished jobs....
  CC test_bbdev_vector.o
  INSTALL-MAP dpdk-pdump.map
  INSTALL-APP cmdline_test
  INSTALL-MAP cmdline_test.map
--
  MKRES test_resource_c.res.o
  LD test
  INSTALL-APP test
  INSTALL-MAP test.map
make[5]: warning:  Clock skew detected.  Your build may be incomplete.
make[3]: *** [/tmp/UB1904-64_K4.18.0_GCC8.3.0/x86_64-native-linuxapp-gcc/96cc8aa56d544c9cb04380e3a9789da1/dpdk/mk/rte.sdkbuild.mk:48: app] Error 2
make[2]: *** [/tmp/UB1904-64_K4.18.0_GCC8.3.0/x86_64-native-linuxapp-gcc/96cc8aa56d544c9cb04380e3a9789da1/dpdk/mk/rte.sdkroot.mk:99: all] Error 2
make[1]: *** [/tmp/UB1904-64_K4.18.0_GCC8.3.0/x86_64-native-linuxapp-gcc/96cc8aa56d544c9cb04380e3a9789da1/dpdk/mk/rte.sdkinstall.mk:61: pre_install] Error 2
make: *** [/tmp/UB1904-64_K4.18.0_GCC8.3.0/x86_64-native-linuxapp-gcc/96cc8aa56d544c9cb04380e3a9789da1/dpdk/mk/rte.sdkroot.mk:77: install] Error 2


*Make Build Failed #4:
OS: UB1804-64
Target: x86_64-native-linuxapp-icc
/tmp/UB1804-64_K4.15.0_ICC19.0.0/x86_64-native-linuxapp-icc/96cc8aa56d544c9cb04380e3a9789da1/dpdk/app/test-pmd/testpmd.c(2163): error #266: function "rte_eth_dev_set_ptypes" declared implicitly
  			rte_eth_dev_set_ptypes(pi, RTE_PTYPE_UNKNOWN, NULL, 0);
  			^

compilation aborted for /tmp/UB1804-64_K4.15.0_ICC19.0.0/x86_64-native-linuxapp-icc/96cc8aa56d544c9cb04380e3a9789da1/dpdk/app/test-pmd/testpmd.c (code 2)
/tmp/UB1804-64_K4.15.0_ICC19.0.0/x86_64-native-linuxapp-icc/96cc8aa56d544c9cb04380e3a9789da1/dpdk/mk/internal/rte.compile-pre.mk:114: recipe for target 'testpmd.o' failed
make[5]: *** [testpmd.o] Error 2
/tmp/UB1804-64_K4.15.0_ICC19.0.0/x86_64-native-linuxapp-icc/96cc8aa56d544c9cb04380e3a9789da1/dpdk/mk/rte.subdir.mk:35: recipe for target 'test-pmd' failed
make[4]: *** [test-pmd] Error 2
make[4]: *** Waiting for unfinished jobs....
  CC comp_perf_test_verify.o
  CC test_bbdev.o
  CC commands.o
  CC comp_perf_options_parse.o
--
  MKRES test_resource_c.res.o
  LD test
  INSTALL-MAP test.map
  INSTALL-APP test
make[5]: warning:  Clock skew detected.  Your build may be incomplete.
/tmp/UB1804-64_K4.15.0_ICC19.0.0/x86_64-native-linuxapp-icc/96cc8aa56d544c9cb04380e3a9789da1/dpdk/mk/rte.sdkbuild.mk:46: recipe for target 'app' failed
make[3]: *** [app] Error 2
/tmp/UB1804-64_K4.15.0_ICC19.0.0/x86_64-native-linuxapp-icc/96cc8aa56d544c9cb04380e3a9789da1/dpdk/mk/rte.sdkroot.mk:98: recipe for target 'all' failed
make[2]: *** [all] Error 2
/tmp/UB1804-64_K4.15.0_ICC19.0.0/x86_64-native-linuxapp-icc/96cc8aa56d544c9cb04380e3a9789da1/dpdk/mk/rte.sdkinstall.mk:60: recipe for target 'pre_install' failed
make[1]: *** [pre_install] Error 2
/tmp/UB1804-64_K4.15.0_ICC19.0.0/x86_64-native-linuxapp-icc/96cc8aa56d544c9cb04380e3a9789da1/dpdk/mk/rte.sdkroot.mk:77: recipe for target 'install' failed
make: *** [install] Error 2


*Make Build Failed #5:
OS: UB1804-64
Target: x86_64-native-linuxapp-clang
    ^
/tmp/UB1804-64_K4.15.0_Clang6.0.0/x86_64-native-linuxapp-clang/96cc8aa56d544c9cb04380e3a9789da1/dpdk/app/test-pmd/testpmd.c:2163:4: error: this function declaration is not a prototype [-Werror,-Wstrict-prototypes]
                        rte_eth_dev_set_ptypes(pi, RTE_PTYPE_UNKNOWN, NULL, 0);
                        ^
2 errors generated.
/tmp/UB1804-64_K4.15.0_Clang6.0.0/x86_64-native-linuxapp-clang/96cc8aa56d544c9cb04380e3a9789da1/dpdk/mk/internal/rte.compile-pre.mk:114: recipe for target 'testpmd.o' failed
make[5]: *** [testpmd.o] Error 1
/tmp/UB1804-64_K4.15.0_Clang6.0.0/x86_64-native-linuxapp-clang/96cc8aa56d544c9cb04380e3a9789da1/dpdk/mk/rte.subdir.mk:35: recipe for target 'test-pmd' failed
make[4]: *** [test-pmd] Error 2
make[4]: *** Waiting for unfinished jobs....
  CC comp_perf_test_verify.o
  CC main.o
  CC test_bbdev_perf.o
  CC test.o
--
  MKRES test_resource_c.res.o
  LD test
  INSTALL-APP test
  INSTALL-MAP test.map
make[5]: warning:  Clock skew detected.  Your build may be incomplete.
/tmp/UB1804-64_K4.15.0_Clang6.0.0/x86_64-native-linuxapp-clang/96cc8aa56d544c9cb04380e3a9789da1/dpdk/mk/rte.sdkbuild.mk:46: recipe for target 'app' failed
make[3]: *** [app] Error 2
/tmp/UB1804-64_K4.15.0_Clang6.0.0/x86_64-native-linuxapp-clang/96cc8aa56d544c9cb04380e3a9789da1/dpdk/mk/rte.sdkroot.mk:98: recipe for target 'all' failed
make[2]: *** [all] Error 2
/tmp/UB1804-64_K4.15.0_Clang6.0.0/x86_64-native-linuxapp-clang/96cc8aa56d544c9cb04380e3a9789da1/dpdk/mk/rte.sdkinstall.mk:60: recipe for target 'pre_install' failed
make[1]: *** [pre_install] Error 2
/tmp/UB1804-64_K4.15.0_Clang6.0.0/x86_64-native-linuxapp-clang/96cc8aa56d544c9cb04380e3a9789da1/dpdk/mk/rte.sdkroot.mk:77: recipe for target 'install' failed
make: *** [install] Error 2


*Make Build Failed #6:
OS: SUSE15-64
Target: x86_64-native-linuxapp-gcc
make[5]: warning:  Clock skew detected.  Your build may be incomplete.
  CC runtime.o
/tmp/SUSE15-64_K4.12.14_GCC7.3.1/x86_64-native-linuxapp-gcc/96cc8aa56d544c9cb04380e3a9789da1/dpdk/app/test-pmd/testpmd.c: At top level:
cc1: error: unrecognized command line option ‘-Wno-address-of-packed-member’ [-Werror]
cc1: all warnings being treated as errors
make[5]: *** [/tmp/SUSE15-64_K4.12.14_GCC7.3.1/x86_64-native-linuxapp-gcc/96cc8aa56d544c9cb04380e3a9789da1/dpdk/mk/internal/rte.compile-pre.mk:114: testpmd.o] Error 1
  INSTALL-APP dpdk-procinfo
  CC test_bbdev_perf.o
  INSTALL-APP testacl
  INSTALL-MAP dpdk-procinfo.map
  CC pipeline_stub.o
--
  INSTALL-APP dpdk-pdump
  INSTALL-MAP dpdk-pdump.map
  CC test_resource.o
  CC pipeline_hash.o
  CC test_prefetch.o
make[4]: *** [/tmp/SUSE15-64_K4.12.14_GCC7.3.1/x86_64-native-linuxapp-gcc/96cc8aa56d544c9cb04380e3a9789da1/dpdk/mk/rte.subdir.mk:35: test-pmd] Error 2
make[4]: *** Waiting for unfinished jobs....
== Build app/test-crypto-perf
  CC test_bbdev_vector.o
  CC test_byteorder.o
  CC pipeline_lpm.o
--
  MKRES test_resource_c.res.o
  LD test
  INSTALL-APP test
  INSTALL-MAP test.map
make[5]: warning:  Clock skew detected.  Your build may be incomplete.
make[3]: *** [/tmp/SUSE15-64_K4.12.14_GCC7.3.1/x86_64-native-linuxapp-gcc/96cc8aa56d544c9cb04380e3a9789da1/dpdk/mk/rte.sdkbuild.mk:48: app] Error 2
make[2]: *** [/tmp/SUSE15-64_K4.12.14_GCC7.3.1/x86_64-native-linuxapp-gcc/96cc8aa56d544c9cb04380e3a9789da1/dpdk/mk/rte.sdkroot.mk:99: all] Error 2
make[1]: *** [/tmp/SUSE15-64_K4.12.14_GCC7.3.1/x86_64-native-linuxapp-gcc/96cc8aa56d544c9cb04380e3a9789da1/dpdk/mk/rte.sdkinstall.mk:61: pre_install] Error 2
make: *** [/tmp/SUSE15-64_K4.12.14_GCC7.3.1/x86_64-native-linuxapp-gcc/96cc8aa56d544c9cb04380e3a9789da1/dpdk/mk/rte.sdkroot.mk:77: install] Error 2


*Make Build Failed #7:
OS: RHEL76-64
Target: x86_64-native-linuxapp-gcc
    ^
/tmp/RHEL76-64_K3.10.0_GCC4.8.5/x86_64-native-linuxapp-gcc/96cc8aa56d544c9cb04380e3a9789da1/dpdk/app/test-pmd/testpmd.c:2163:4: error: nested extern declaration of ‘rte_eth_dev_set_ptypes’ [-Werror=nested-externs]
/tmp/RHEL76-64_K3.10.0_GCC4.8.5/x86_64-native-linuxapp-gcc/96cc8aa56d544c9cb04380e3a9789da1/dpdk/app/test-pmd/testpmd.c: At top level:
cc1: error: unrecognized command line option "-Wno-address-of-packed-member" [-Werror]
cc1: all warnings being treated as errors
make[5]: *** [testpmd.o] Error 1
make[4]: *** [test-pmd] Error 2
make[4]: *** Waiting for unfinished jobs....
  CC main.o
  CC config.o
  CC test_bbdev.o
  LD dpdk-procinfo
--
  MKRES test_resource_c.res.o
  LD test
  INSTALL-MAP test.map
  INSTALL-APP test
make[5]: warning:  Clock skew detected.  Your build may be incomplete.
make[3]: *** [app] Error 2
make[2]: *** [all] Error 2
make[1]: *** [pre_install] Error 2
make: *** [install] Error 2


*Make Build Failed #8:
OS: FC30-64
Target: x86_64-native-linuxapp-gcc
  INSTALL-MAP testacl.map
make[5]: warning:  Clock skew detected.  Your build may be incomplete.
  CC test_prefetch.o
  CC comp_perf_test_verify.o
cc1: all warnings being treated as errors
make[5]: *** [/tmp/FC30-64_K4.20_GCC9.1.1/x86_64-native-linuxapp-gcc/96cc8aa56d544c9cb04380e3a9789da1/dpdk/mk/internal/rte.compile-pre.mk:116: testpmd.o] Error 1
make[5]: *** Waiting for unfinished jobs....
== Build app/test-eventdev
  CC comp_perf_test_benchmark.o
  CC test_bbdev_vector.o
  CC pipeline_stub.o
  CC test_byteorder.o
  CC test_per_lcore.o
  CC test_atomic.o
make[4]: *** [/tmp/FC30-64_K4.20_GCC9.1.1/x86_64-native-linuxapp-gcc/96cc8aa56d544c9cb04380e3a9789da1/dpdk/mk/rte.subdir.mk:37: test-pmd] Error 2
make[4]: *** Waiting for unfinished jobs....
  CC pipeline_hash.o
  CC comp_perf_test_common.o
  CC main.o
  CC cperf_ops.o
--
  MKRES test_resource_c.res.o
  LD test
  INSTALL-APP test
  INSTALL-MAP test.map
make[5]: warning:  Clock skew detected.  Your build may be incomplete.
make[3]: *** [/tmp/FC30-64_K4.20_GCC9.1.1/x86_64-native-linuxapp-gcc/96cc8aa56d544c9cb04380e3a9789da1/dpdk/mk/rte.sdkbuild.mk:48: app] Error 2
make[2]: *** [/tmp/FC30-64_K4.20_GCC9.1.1/x86_64-native-linuxapp-gcc/96cc8aa56d544c9cb04380e3a9789da1/dpdk/mk/rte.sdkroot.mk:99: all] Error 2
make[1]: *** [/tmp/FC30-64_K4.20_GCC9.1.1/x86_64-native-linuxapp-gcc/96cc8aa56d544c9cb04380e3a9789da1/dpdk/mk/rte.sdkinstall.mk:61: pre_install] Error 2
make: *** [/tmp/FC30-64_K4.20_GCC9.1.1/x86_64-native-linuxapp-gcc/96cc8aa56d544c9cb04380e3a9789da1/dpdk/mk/rte.sdkroot.mk:77: install] Error 2


*Make Build Failed #9:
OS: RHEL80-64
Target: x86_64-native-linuxapp-gcc
  INSTALL-MAP dpdk-procinfo.map
  INSTALL-APP cmdline_test
/tmp/RHEL80-64_K3.10.0_GCC8.2.1/x86_64-native-linuxapp-gcc/96cc8aa56d544c9cb04380e3a9789da1/dpdk/app/test-pmd/testpmd.c: At top level:
cc1: error: unrecognized command line option ‘-Wno-address-of-packed-member’ [-Werror]
cc1: all warnings being treated as errors
make[5]: *** [/tmp/RHEL80-64_K3.10.0_GCC8.2.1/x86_64-native-linuxapp-gcc/96cc8aa56d544c9cb04380e3a9789da1/dpdk/mk/internal/rte.compile-pre.mk:114: testpmd.o] Error 1
make[4]: *** [/tmp/RHEL80-64_K3.10.0_GCC8.2.1/x86_64-native-linuxapp-gcc/96cc8aa56d544c9cb04380e3a9789da1/dpdk/mk/rte.subdir.mk:35: test-pmd] Error 2
make[4]: *** Waiting for unfinished jobs....
  INSTALL-MAP cmdline_test.map
  CC init.o
  CC test_prefetch.o
  CC runtime.o
--
  MKRES test_resource_c.res.o
  LD test
  INSTALL-APP test
  INSTALL-MAP test.map
make[5]: warning:  Clock skew detected.  Your build may be incomplete.
make[3]: *** [/tmp/RHEL80-64_K3.10.0_GCC8.2.1/x86_64-native-linuxapp-gcc/96cc8aa56d544c9cb04380e3a9789da1/dpdk/mk/rte.sdkbuild.mk:48: app] Error 2
make[2]: *** [/tmp/RHEL80-64_K3.10.0_GCC8.2.1/x86_64-native-linuxapp-gcc/96cc8aa56d544c9cb04380e3a9789da1/dpdk/mk/rte.sdkroot.mk:99: all] Error 2
make[1]: *** [/tmp/RHEL80-64_K3.10.0_GCC8.2.1/x86_64-native-linuxapp-gcc/96cc8aa56d544c9cb04380e3a9789da1/dpdk/mk/rte.sdkinstall.mk:61: pre_install] Error 2
make: *** [/tmp/RHEL80-64_K3.10.0_GCC8.2.1/x86_64-native-linuxapp-gcc/96cc8aa56d544c9cb04380e3a9789da1/dpdk/mk/rte.sdkroot.mk:77: install] Error 2


*Make Build Failed #10:
OS: SUSE15-64
Target: x86_64-native-linuxapp-clang
    ^
/tmp/SUSE15-64_K4.12.14_Clang5.0.1/x86_64-native-linuxapp-clang/96cc8aa56d544c9cb04380e3a9789da1/dpdk/app/test-pmd/testpmd.c:2163:4: error: this function declaration is not a prototype [-Werror,-Wstrict-prototypes]
                        rte_eth_dev_set_ptypes(pi, RTE_PTYPE_UNKNOWN, NULL, 0);
                        ^
2 errors generated.
make[5]: *** [/tmp/SUSE15-64_K4.12.14_Clang5.0.1/x86_64-native-linuxapp-clang/96cc8aa56d544c9cb04380e3a9789da1/dpdk/mk/internal/rte.compile-pre.mk:114: testpmd.o] Error 1
make[4]: *** [/tmp/SUSE15-64_K4.12.14_Clang5.0.1/x86_64-native-linuxapp-clang/96cc8aa56d544c9cb04380e3a9789da1/dpdk/mk/rte.subdir.mk:35: test-pmd] Error 2
make[4]: *** Waiting for unfinished jobs....
  CC comp_perf_options_parse.o
  LD cmdline_test
  CC test_bbdev.o
  LD dpdk-procinfo
--
  MKRES test_resource_c.res.o
  LD test
  INSTALL-APP test
  INSTALL-MAP test.map
make[5]: warning:  Clock skew detected.  Your build may be incomplete.
make[3]: *** [/tmp/SUSE15-64_K4.12.14_Clang5.0.1/x86_64-native-linuxapp-clang/96cc8aa56d544c9cb04380e3a9789da1/dpdk/mk/rte.sdkbuild.mk:48: app] Error 2
make[2]: *** [/tmp/SUSE15-64_K4.12.14_Clang5.0.1/x86_64-native-linuxapp-clang/96cc8aa56d544c9cb04380e3a9789da1/dpdk/mk/rte.sdkroot.mk:99: all] Error 2
make[1]: *** [/tmp/SUSE15-64_K4.12.14_Clang5.0.1/x86_64-native-linuxapp-clang/96cc8aa56d544c9cb04380e3a9789da1/dpdk/mk/rte.sdkinstall.mk:61: pre_install] Error 2
make: *** [/tmp/SUSE15-64_K4.12.14_Clang5.0.1/x86_64-native-linuxapp-clang/96cc8aa56d544c9cb04380e3a9789da1/dpdk/mk/rte.sdkroot.mk:77: install] Error 2


*Make Build Failed #11:
OS: FC30-64
Target: x86_64-native-linuxapp-clang
    ^
/tmp/FC30-64_K4.20_Clang8.0.0/x86_64-native-linuxapp-clang/96cc8aa56d544c9cb04380e3a9789da1/dpdk/app/test-pmd/testpmd.c:2163:4: error: this function declaration is not a prototype [-Werror,-Wstrict-prototypes]
                        rte_eth_dev_set_ptypes(pi, RTE_PTYPE_UNKNOWN, NULL, 0);
                        ^
2 errors generated.
make[5]: *** [/tmp/FC30-64_K4.20_Clang8.0.0/x86_64-native-linuxapp-clang/96cc8aa56d544c9cb04380e3a9789da1/dpdk/mk/internal/rte.compile-pre.mk:116: testpmd.o] Error 1
make[4]: *** [/tmp/FC30-64_K4.20_Clang8.0.0/x86_64-native-linuxapp-clang/96cc8aa56d544c9cb04380e3a9789da1/dpdk/mk/rte.subdir.mk:37: test-pmd] Error 2
make[4]: *** Waiting for unfinished jobs....
  CC test.o
  LD dpdk-pdump
  LD dpdk-procinfo
  LD testacl
--
  MKRES test_resource_c.res.o
  LD test
  INSTALL-APP test
  INSTALL-MAP test.map
make[5]: warning:  Clock skew detected.  Your build may be incomplete.
make[3]: *** [/tmp/FC30-64_K4.20_Clang8.0.0/x86_64-native-linuxapp-clang/96cc8aa56d544c9cb04380e3a9789da1/dpdk/mk/rte.sdkbuild.mk:48: app] Error 2
make[2]: *** [/tmp/FC30-64_K4.20_Clang8.0.0/x86_64-native-linuxapp-clang/96cc8aa56d544c9cb04380e3a9789da1/dpdk/mk/rte.sdkroot.mk:99: all] Error 2
make[1]: *** [/tmp/FC30-64_K4.20_Clang8.0.0/x86_64-native-linuxapp-clang/96cc8aa56d544c9cb04380e3a9789da1/dpdk/mk/rte.sdkinstall.mk:61: pre_install] Error 2
make: *** [/tmp/FC30-64_K4.20_Clang8.0.0/x86_64-native-linuxapp-clang/96cc8aa56d544c9cb04380e3a9789da1/dpdk/mk/rte.sdkroot.mk:77: install] Error 2


*Make Build Failed #12:
OS: UB1604-64
Target: x86_64-native-linuxapp-gcc
make[5]: warning:  Clock skew detected.  Your build may be incomplete.
  CC test_malloc.o
/tmp/UB1604-64_K4.4.0_GCC5.4.0/x86_64-native-linuxapp-gcc/96cc8aa56d544c9cb04380e3a9789da1/dpdk/app/test-pmd/testpmd.c: At top level:
cc1: error: unrecognized command line option ‘-Wno-address-of-packed-member’ [-Werror]
cc1: all warnings being treated as errors
/tmp/UB1604-64_K4.4.0_GCC5.4.0/x86_64-native-linuxapp-gcc/96cc8aa56d544c9cb04380e3a9789da1/dpdk/mk/internal/rte.compile-pre.mk:114: recipe for target 'testpmd.o' failed
make[5]: *** [testpmd.o] Error 1
make[5]: *** Waiting for unfinished jobs....
  CC test_cycles.o
  CC pipeline_stub.o
  CC pipeline_hash.o
  CC comp_perf_test_benchmark.o
--
  CC test_flow_classify.o
  LD dpdk-test-crypto-perf
/tmp/UB1604-64_K4.4.0_GCC5.4.0/x86_64-native-linuxapp-gcc/96cc8aa56d544c9cb04380e3a9789da1/dpdk/app/test-pmd/cmdline.c: At top level:
cc1: error: unrecognized command line option ‘-Wno-address-of-packed-member’ [-Werror]
cc1: all warnings being treated as errors
/tmp/UB1604-64_K4.4.0_GCC5.4.0/x86_64-native-linuxapp-gcc/96cc8aa56d544c9cb04380e3a9789da1/dpdk/mk/internal/rte.compile-pre.mk:114: recipe for target 'cmdline.o' failed
make[5]: *** [cmdline.o] Error 1
/tmp/UB1604-64_K4.4.0_GCC5.4.0/x86_64-native-linuxapp-gcc/96cc8aa56d544c9cb04380e3a9789da1/dpdk/mk/rte.subdir.mk:35: recipe for target 'test-pmd' failed
make[4]: *** [test-pmd] Error 2
make[4]: *** Waiting for unfinished jobs....
  CC test_rwlock.o
  INSTALL-APP testbbdev
  INSTALL-MAP testbbdev.map
make[5]: warning:  Clock skew detected.  Your build may be incomplete.
--
  MKRES test_resource_c.res.o
  LD test
  INSTALL-APP test
  INSTALL-MAP test.map
make[5]: warning:  Clock skew detected.  Your build may be incomplete.
/tmp/UB1604-64_K4.4.0_GCC5.4.0/x86_64-native-linuxapp-gcc/96cc8aa56d544c9cb04380e3a9789da1/dpdk/mk/rte.sdkbuild.mk:46: recipe for target 'app' failed
make[3]: *** [app] Error 2
/tmp/UB1604-64_K4.4.0_GCC5.4.0/x86_64-native-linuxapp-gcc/96cc8aa56d544c9cb04380e3a9789da1/dpdk/mk/rte.sdkroot.mk:98: recipe for target 'all' failed
make[2]: *** [all] Error 2
/tmp/UB1604-64_K4.4.0_GCC5.4.0/x86_64-native-linuxapp-gcc/96cc8aa56d544c9cb04380e3a9789da1/dpdk/mk/rte.sdkinstall.mk:60: recipe for target 'pre_install' failed
make[1]: *** [pre_install] Error 2
/tmp/UB1604-64_K4.4.0_GCC5.4.0/x86_64-native-linuxapp-gcc/96cc8aa56d544c9cb04380e3a9789da1/dpdk/mk/rte.sdkroot.mk:77: recipe for target 'install' failed
make: *** [install] Error 2


*Make Build Failed #13:
OS: UB1804-64
Target: x86_64-native-linuxapp-gcc
        rte_eth_dev_set_mtu
/tmp/UB1804-64_K4.15.0_GCC7.3.0/x86_64-native-linuxapp-gcc/96cc8aa56d544c9cb04380e3a9789da1/dpdk/app/test-pmd/cmdline.c:18973:8: error: nested extern declaration of ‘rte_eth_dev_set_ptypes’ [-Werror=nested-externs]
/tmp/UB1804-64_K4.15.0_GCC7.3.0/x86_64-native-linuxapp-gcc/96cc8aa56d544c9cb04380e3a9789da1/dpdk/app/test-pmd/testpmd.c: At top level:
cc1: error: unrecognized command line option ‘-Wno-address-of-packed-member’ [-Werror]
cc1: all warnings being treated as errors
/tmp/UB1804-64_K4.15.0_GCC7.3.0/x86_64-native-linuxapp-gcc/96cc8aa56d544c9cb04380e3a9789da1/dpdk/mk/internal/rte.compile-pre.mk:114: recipe for target 'testpmd.o' failed
make[5]: *** [testpmd.o] Error 1
make[5]: *** Waiting for unfinished jobs....
  CC test_bbdev_vector.o
== Build app/test-crypto-perf
  CC pipeline_stub.o
== Build app/test-eventdev
--
  CC test_pipeline_common.o
  CC test_pipeline_queue.o
/tmp/UB1804-64_K4.15.0_GCC7.3.0/x86_64-native-linuxapp-gcc/96cc8aa56d544c9cb04380e3a9789da1/dpdk/app/test-pmd/cmdline.c: At top level:
cc1: error: unrecognized command line option ‘-Wno-address-of-packed-member’ [-Werror]
cc1: all warnings being treated as errors
/tmp/UB1804-64_K4.15.0_GCC7.3.0/x86_64-native-linuxapp-gcc/96cc8aa56d544c9cb04380e3a9789da1/dpdk/mk/internal/rte.compile-pre.mk:114: recipe for target 'cmdline.o' failed
make[5]: *** [cmdline.o] Error 1
/tmp/UB1804-64_K4.15.0_GCC7.3.0/x86_64-native-linuxapp-gcc/96cc8aa56d544c9cb04380e3a9789da1/dpdk/mk/rte.subdir.mk:35: recipe for target 'test-pmd' failed
make[4]: *** [test-pmd] Error 2
make[4]: *** Waiting for unfinished jobs....
  CC test_pipeline_atq.o
  LD dpdk-test-crypto-perf
  INSTALL-APP testpipeline
  LD testbbdev
--
  MKRES test_resource_c.res.o
  LD test
  INSTALL-APP test
  INSTALL-MAP test.map
make[5]: warning:  Clock skew detected.  Your build may be incomplete.
/tmp/UB1804-64_K4.15.0_GCC7.3.0/x86_64-native-linuxapp-gcc/96cc8aa56d544c9cb04380e3a9789da1/dpdk/mk/rte.sdkbuild.mk:46: recipe for target 'app' failed
make[3]: *** [app] Error 2
/tmp/UB1804-64_K4.15.0_GCC7.3.0/x86_64-native-linuxapp-gcc/96cc8aa56d544c9cb04380e3a9789da1/dpdk/mk/rte.sdkroot.mk:98: recipe for target 'all' failed
make[2]: *** [all] Error 2
/tmp/UB1804-64_K4.15.0_GCC7.3.0/x86_64-native-linuxapp-gcc/96cc8aa56d544c9cb04380e3a9789da1/dpdk/mk/rte.sdkinstall.mk:60: recipe for target 'pre_install' failed
make[1]: *** [pre_install] Error 2
/tmp/UB1804-64_K4.15.0_GCC7.3.0/x86_64-native-linuxapp-gcc/96cc8aa56d544c9cb04380e3a9789da1/dpdk/mk/rte.sdkroot.mk:77: recipe for target 'install' failed
make: *** [install] Error 2


*Make Build Failed #14:
OS: FreeBSD12-64
Target: x86_64-native-bsdapp-clang
    ^
/tmp/FreeBSD12-64_K19.02_Clang6.0.1/x86_64-native-bsdapp-clang/96cc8aa56d544c9cb04380e3a9789da1/dpdk/app/test-pmd/testpmd.c:2163:4: error: this function declaration is not a prototype [-Werror,-Wstrict-prototypes]
                        rte_eth_dev_set_ptypes(pi, RTE_PTYPE_UNKNOWN, NULL, 0);
                        ^
2 errors generated.
gmake[5]: *** [/tmp/FreeBSD12-64_K19.02_Clang6.0.1/x86_64-native-bsdapp-clang/96cc8aa56d544c9cb04380e3a9789da1/dpdk/mk/internal/rte.compile-pre.mk:116: testpmd.o] Error 1
gmake[4]: *** [/tmp/FreeBSD12-64_K19.02_Clang6.0.1/x86_64-native-bsdapp-clang/96cc8aa56d544c9cb04380e3a9789da1/dpdk/mk/rte.subdir.mk:37: test-pmd] Error 2
gmake[4]: *** Waiting for unfinished jobs....
  CC init.o
  INSTALL-APP dpdk-pdump
  CC test_bbdev_perf.o
  INSTALL-APP testsad
--
  MKRES test_resource_c.res.o
  LD test
  INSTALL-MAP test.map
  INSTALL-APP test
gmake[5]: warning:  Clock skew detected.  Your build may be incomplete.
gmake[3]: *** [/tmp/FreeBSD12-64_K19.02_Clang6.0.1/x86_64-native-bsdapp-clang/96cc8aa56d544c9cb04380e3a9789da1/dpdk/mk/rte.sdkbuild.mk:48: app] Error 2
gmake[2]: *** [/tmp/FreeBSD12-64_K19.02_Clang6.0.1/x86_64-native-bsdapp-clang/96cc8aa56d544c9cb04380e3a9789da1/dpdk/mk/rte.sdkroot.mk:99: all] Error 2
gmake[1]: *** [/tmp/FreeBSD12-64_K19.02_Clang6.0.1/x86_64-native-bsdapp-clang/96cc8aa56d544c9cb04380e3a9789da1/dpdk/mk/rte.sdkinstall.mk:61: pre_install] Error 2
gmake: *** [/tmp/FreeBSD12-64_K19.02_Clang6.0.1/x86_64-native-bsdapp-clang/96cc8aa56d544c9cb04380e3a9789da1/dpdk/mk/rte.sdkroot.mk:77: install] Error 2


*Make Build Failed #15:
OS: CENTOS76-64
Target: x86_64-native-linuxapp-clang
/tmp/CENTOS76-64_K3.10.0_Clang3.4.2/x86_64-native-linuxapp-clang/96cc8aa56d544c9cb04380e3a9789da1/dpdk/app/test-pmd/testpmd.c:2163:4: note: did you mean 'rte_eth_dev_set_mtu'?
/tmp/CENTOS76-64_K3.10.0_Clang3.4.2/x86_64-native-linuxapp-clang/96cc8aa56d544c9cb04380e3a9789da1/dpdk/x86_64-native-linuxapp-clang/include/rte_ethdev.h:2574:5: note: 'rte_eth_dev_set_mtu' declared here
int rte_eth_dev_set_mtu(uint16_t port_id, uint16_t mtu);
    ^
1 error generated.
make[5]: *** [testpmd.o] Error 1
make[4]: *** [test-pmd] Error 2
make[4]: *** Waiting for unfinished jobs....
  CC test.o
  CC config.o
  CC test_bbdev.o
  CC comp_perf_options_parse.o
--
  MKRES test_resource_c.res.o
  LD test
  INSTALL-APP test
  INSTALL-MAP test.map
make[5]: warning:  Clock skew detected.  Your build may be incomplete.
make[3]: *** [app] Error 2
make[2]: *** [all] Error 2
make[1]: *** [pre_install] Error 2
make: *** [install] Error 2


*Make Build Failed #16:
OS: CENTOS76-64
Target: x86_64-native-linuxapp-gcc
    ^
/tmp/CENTOS76-64_K3.10.0_GCC4.8.5/x86_64-native-linuxapp-gcc/96cc8aa56d544c9cb04380e3a9789da1/dpdk/app/test-pmd/testpmd.c:2163:4: error: nested extern declaration of ‘rte_eth_dev_set_ptypes’ [-Werror=nested-externs]
/tmp/CENTOS76-64_K3.10.0_GCC4.8.5/x86_64-native-linuxapp-gcc/96cc8aa56d544c9cb04380e3a9789da1/dpdk/app/test-pmd/testpmd.c: At top level:
cc1: error: unrecognized command line option "-Wno-address-of-packed-member" [-Werror]
cc1: all warnings being treated as errors
make[5]: *** [testpmd.o] Error 1
make[4]: *** [test-pmd] Error 2
make[4]: *** Waiting for unfinished jobs....
  CC test_bbdev.o
  LD dpdk-pdump
  LD dpdk-procinfo
  LD testacl
--
  MKRES test_resource_c.res.o
  LD test
  INSTALL-APP test
  INSTALL-MAP test.map
make[5]: warning:  Clock skew detected.  Your build may be incomplete.
make[3]: *** [app] Error 2
make[2]: *** [all] Error 2
make[1]: *** [pre_install] Error 2
make: *** [install] Error 2


*Make Build Failed #17:
OS: FreeBSD12-64
Target: x86_64-native-bsdapp-gcc
gmake[5]: warning:  Clock skew detected.  Your build may be incomplete.
  CC runtime.o
  CC parameters.o
  CC cperf_test_vectors.o
cc1: all warnings being treated as errors
gmake[5]: *** [/tmp/FreeBSD12-64_K19.02_GCC7.3.0/x86_64-native-bsdapp-gcc/96cc8aa56d544c9cb04380e3a9789da1/dpdk/mk/internal/rte.compile-pre.mk:116: testpmd.o] Error 1
gmake[5]: *** Waiting for unfinished jobs....
  CC comp_perf_test_benchmark.o
  CC comp_perf_test_common.o
  CC test_byteorder.o
  CC test_per_lcore.o
  CC cperf_test_throughput.o
  CC pipeline_stub.o
  CC test_atomic.o
  CC test_barrier.o
  CC cperf_test_latency.o
gmake[4]: *** [/tmp/FreeBSD12-64_K19.02_GCC7.3.0/x86_64-native-bsdapp-gcc/96cc8aa56d544c9cb04380e3a9789da1/dpdk/mk/rte.subdir.mk:36: test-pmd] Error 2
== Build app/test-eventdev
gmake[4]: *** Waiting for unfinished jobs....
  CC pipeline_hash.o
  CC cperf_test_pmd_cyclecount.o
  CC test_malloc.o
--
  MKRES test_resource_c.res.o
  LD test
  INSTALL-MAP test.map
  INSTALL-APP test
gmake[5]: warning:  Clock skew detected.  Your build may be incomplete.
gmake[3]: *** [/tmp/FreeBSD12-64_K19.02_GCC7.3.0/x86_64-native-bsdapp-gcc/96cc8aa56d544c9cb04380e3a9789da1/dpdk/mk/rte.sdkbuild.mk:48: app] Error 2
gmake[2]: *** [/tmp/FreeBSD12-64_K19.02_GCC7.3.0/x86_64-native-bsdapp-gcc/96cc8aa56d544c9cb04380e3a9789da1/dpdk/mk/rte.sdkroot.mk:99: all] Error 2
gmake[1]: *** [/tmp/FreeBSD12-64_K19.02_GCC7.3.0/x86_64-native-bsdapp-gcc/96cc8aa56d544c9cb04380e3a9789da1/dpdk/mk/rte.sdkinstall.mk:61: pre_install] Error 2
gmake: *** [/tmp/FreeBSD12-64_K19.02_GCC7.3.0/x86_64-native-bsdapp-gcc/96cc8aa56d544c9cb04380e3a9789da1/dpdk/mk/rte.sdkroot.mk:77: install] Error 2


*Make Build Failed #18:
OS: FreeBSD12-64
Target: x86_64-native-bsdapp-gcc+debug
/tmp/FreeBSD12-64_K19.02_GCC7.3.0/x86_64-native-bsdapp-gcc+debug/96cc8aa56d544c9cb04380e3a9789da1/dpdk/app/test-pmd/testpmd.c: At top level:
cc1: error: unrecognized command line option '-Wno-address-of-packed-member' [-Werror]
cc1: all warnings being treated as errors
  CC test_byteorder.o
  CC parameters.o
gmake[5]: *** [/tmp/FreeBSD12-64_K19.02_GCC7.3.0/x86_64-native-bsdapp-gcc+debug/96cc8aa56d544c9cb04380e3a9789da1/dpdk/mk/internal/rte.compile-pre.mk:116: testpmd.o] Error 1
gmake[5]: *** Waiting for unfinished jobs....
  CC test_per_lcore.o
  CC pipeline_hash.o
  CC cperf_test_throughput.o
  CC comp_perf_test_benchmark.o
  CC test_atomic.o
  CC comp_perf_test_common.o
  CC test_bbdev_vector.o
  CC cperf_test_latency.o
== Build app/test-eventdev
gmake[4]: *** [/tmp/FreeBSD12-64_K19.02_GCC7.3.0/x86_64-native-bsdapp-gcc+debug/96cc8aa56d544c9cb04380e3a9789da1/dpdk/mk/rte.subdir.mk:37: test-pmd] Error 2
gmake[4]: *** Waiting for unfinished jobs....
  CC pipeline_lpm.o
  CC test_malloc.o
  CC test_barrier.o
  CC cperf_test_pmd_cyclecount.o
--
  MKRES test_resource_c.res.o
  LD test
  INSTALL-APP test
  INSTALL-MAP test.map
gmake[5]: warning:  Clock skew detected.  Your build may be incomplete.
gmake[3]: *** [/tmp/FreeBSD12-64_K19.02_GCC7.3.0/x86_64-native-bsdapp-gcc+debug/96cc8aa56d544c9cb04380e3a9789da1/dpdk/mk/rte.sdkbuild.mk:48: app] Error 2
gmake[2]: *** [/tmp/FreeBSD12-64_K19.02_GCC7.3.0/x86_64-native-bsdapp-gcc+debug/96cc8aa56d544c9cb04380e3a9789da1/dpdk/mk/rte.sdkroot.mk:99: all] Error 2
gmake[1]: *** [/tmp/FreeBSD12-64_K19.02_GCC7.3.0/x86_64-native-bsdapp-gcc+debug/96cc8aa56d544c9cb04380e3a9789da1/dpdk/mk/rte.sdkinstall.mk:61: pre_install] Error 2
gmake: *** [/tmp/FreeBSD12-64_K19.02_GCC7.3.0/x86_64-native-bsdapp-gcc+debug/96cc8aa56d544c9cb04380e3a9789da1/dpdk/mk/rte.sdkroot.mk:77: install] Error 2


*Make Build Failed #19:
OS: CENTOS76-64
Target: x86_64-native-linuxapp-gcc+debug
/tmp/CENTOS76-64_K3.10.0_GCC4.8.5/x86_64-native-linuxapp-gcc+debug/96cc8aa56d544c9cb04380e3a9789da1/dpdk/app/test-pmd/testpmd.c:2163:4: error: nested extern declaration of ‘rte_eth_dev_set_ptypes’ [-Werror=nested-externs]
  CC main.o
/tmp/CENTOS76-64_K3.10.0_GCC4.8.5/x86_64-native-linuxapp-gcc+debug/96cc8aa56d544c9cb04380e3a9789da1/dpdk/app/test-pmd/testpmd.c: At top level:
cc1: error: unrecognized command line option "-Wno-address-of-packed-member" [-Werror]
cc1: all warnings being treated as errors
make[5]: *** [testpmd.o] Error 1
  CC main.o
make[4]: *** [test-pmd] Error 2
make[4]: *** Waiting for unfinished jobs....
  CC config.o
  LD testacl
  CC commands.o
  CC main.o
--
  MKRES test_resource_c.res.o
  LD test
  INSTALL-MAP test.map
  INSTALL-APP test
make[5]: warning:  Clock skew detected.  Your build may be incomplete.
make[3]: *** [app] Error 2
make[2]: *** [all] Error 2
make[1]: *** [pre_install] Error 2
make: *** [install] Error 2


*Make Build Failed #20:
OS: FreeBSD12-64
Target: x86_64-native-bsdapp-gcc+shared
  CC comp_perf_test_benchmark.o
/tmp/FreeBSD12-64_K19.02_GCC7.3.0/x86_64-native-bsdapp-gcc+shared/96cc8aa56d544c9cb04380e3a9789da1/dpdk/app/test-pmd/testpmd.c: At top level:
  CC test_prefetch.o
cc1: error: unrecognized command line option '-Wno-address-of-packed-member' [-Werror]
cc1: all warnings being treated as errors
gmake[5]: *** [/tmp/FreeBSD12-64_K19.02_GCC7.3.0/x86_64-native-bsdapp-gcc+shared/96cc8aa56d544c9cb04380e3a9789da1/dpdk/mk/internal/rte.compile-pre.mk:114: testpmd.o] Error 1
gmake[5]: *** Waiting for unfinished jobs....
  CC cmdline.o
  CC comp_perf_test_common.o
  CC runtime.o
== Build app/test-eventdev
--
  CC test_timer_perf.o
/tmp/FreeBSD12-64_K19.02_GCC7.3.0/x86_64-native-bsdapp-gcc+shared/96cc8aa56d544c9cb04380e3a9789da1/dpdk/app/test-pmd/cmdline.c: At top level:
cc1: error: unrecognized command line option '-Wno-address-of-packed-member' [-Werror]
cc1: all warnings being treated as errors
  CC test_timer_racecond.o
gmake[5]: *** [/tmp/FreeBSD12-64_K19.02_GCC7.3.0/x86_64-native-bsdapp-gcc+shared/96cc8aa56d544c9cb04380e3a9789da1/dpdk/mk/internal/rte.compile-pre.mk:114: cmdline.o] Error 1
gmake[4]: *** [/tmp/FreeBSD12-64_K19.02_GCC7.3.0/x86_64-native-bsdapp-gcc+shared/96cc8aa56d544c9cb04380e3a9789da1/dpdk/mk/rte.subdir.mk:35: test-pmd] Error 2
  CC test_timer_secondary.o
gmake[4]: *** Waiting for unfinished jobs....
  CC test_mempool.o
  CC test_mempool_perf.o
  CC test_mbuf.o
--
  MKRES test_resource_c.res.o
  LD test
  INSTALL-APP test
  INSTALL-MAP test.map
gmake[5]: warning:  Clock skew detected.  Your build may be incomplete.
gmake[3]: *** [/tmp/FreeBSD12-64_K19.02_GCC7.3.0/x86_64-native-bsdapp-gcc+shared/96cc8aa56d544c9cb04380e3a9789da1/dpdk/mk/rte.sdkbuild.mk:48: app] Error 2
gmake[2]: *** [/tmp/FreeBSD12-64_K19.02_GCC7.3.0/x86_64-native-bsdapp-gcc+shared/96cc8aa56d544c9cb04380e3a9789da1/dpdk/mk/rte.sdkroot.mk:99: all] Error 2
gmake[1]: *** [/tmp/FreeBSD12-64_K19.02_GCC7.3.0/x86_64-native-bsdapp-gcc+shared/96cc8aa56d544c9cb04380e3a9789da1/dpdk/mk/rte.sdkinstall.mk:61: pre_install] Error 2
gmake: *** [/tmp/FreeBSD12-64_K19.02_GCC7.3.0/x86_64-native-bsdapp-gcc+shared/96cc8aa56d544c9cb04380e3a9789da1/dpdk/mk/rte.sdkroot.mk:77: install] Error 2


*Make Build Failed #21:
OS: CENTOS76-64
Target: x86_64-native-linuxapp-gcc+shared
    ^
/tmp/CENTOS76-64_K3.10.0_GCC4.8.5/x86_64-native-linuxapp-gcc+shared/96cc8aa56d544c9cb04380e3a9789da1/dpdk/app/test-pmd/testpmd.c:2163:4: error: nested extern declaration of ‘rte_eth_dev_set_ptypes’ [-Werror=nested-externs]
/tmp/CENTOS76-64_K3.10.0_GCC4.8.5/x86_64-native-linuxapp-gcc+shared/96cc8aa56d544c9cb04380e3a9789da1/dpdk/app/test-pmd/testpmd.c: At top level:
cc1: error: unrecognized command line option "-Wno-address-of-packed-member" [-Werror]
cc1: all warnings being treated as errors
make[5]: *** [testpmd.o] Error 1
make[4]: *** [test-pmd] Error 2
make[4]: *** Waiting for unfinished jobs....
  CC config.o
  CC comp_perf_options_parse.o
  LD cmdline_test
  LD testacl
--
  MKRES test_resource_c.res.o
  LD test
  INSTALL-APP test
  INSTALL-MAP test.map
make[5]: warning:  Clock skew detected.  Your build may be incomplete.
make[3]: *** [app] Error 2
make[2]: *** [all] Error 2
make[1]: *** [pre_install] Error 2
make: *** [install] Error 2


*Make Build Failed #22:
OS: CENTOS76-64
Target: x86_64-native-linuxapp-icc
testpmd.c:(.text+0x5298): undefined reference to `rte_eth_dev_set_ptypes'
cmdline.o: In function `cmd_set_port_ptypes_parsed':
cmdline.c:(.text+0x12251): undefined reference to `rte_eth_dev_set_ptypes'
  CC test_rwlock.o
  CC test_stack.o
make[5]: *** [testpmd] Error 1
make[4]: *** [test-pmd] Error 2
make[4]: *** Waiting for unfinished jobs....
  CC test_stack_perf.o
  CC test_timer.o
  LD dpdk-test-crypto-perf
  CC test_pipeline_atq.o
--
  MKRES test_resource_c.res.o
  LD test
  INSTALL-APP test
  INSTALL-MAP test.map
make[5]: warning:  Clock skew detected.  Your build may be incomplete.
make[3]: *** [app] Error 2
make[2]: *** [all] Error 2
make[1]: *** [pre_install] Error 2
make: *** [install] Error 2

*Meson Build Failed #1:
OS: UB1604-32
Target:build-gcc-static

find: ‘/tmp/UB1604-32_K4.4.0_GCC5.4.0/i686-native-linuxapp-gcc/96cc8aa56d544c9cb04380e3a9789da1/dpdk/build-x86-default/install-root’: No such file or directory
dirname: missing operand
Try 'dirname --help' for more information.
## Building cmdline
make: *** /tmp/UB1604-32_K4.4.0_GCC5.4.0/i686-native-linuxapp-gcc/96cc8aa56d544c9cb04380e3a9789da1/dpdk/build-x86-default/install-root/usr/local/share/dpdk/examples/cmdline: No such file or directory.  Stop.
## Building helloworld
make: *** /tmp/UB1604-32_K4.4.0_GCC5.4.0/i686-native-linuxapp-gcc/96cc8aa56d544c9cb04380e3a9789da1/dpdk/build-x86-default/install-root/usr/local/share/dpdk/examples/helloworld: No such file or directory.  Stop.
## Building l2fwd
make: *** /tmp/UB1604-32_K4.4.0_GCC5.4.0/i686-native-linuxapp-gcc/96cc8aa56d544c9cb04380e3a9789da1/dpdk/build-x86-default/install-root/usr/local/share/dpdk/examples/l2fwd: No such file or directory.  Stop.
## Building l3fwd
make: *** /tmp/UB1604-32_K4.4.0_GCC5.4.0/i686-native-linuxapp-gcc/96cc8aa56d544c9cb04380e3a9789da1/dpdk/build-x86-default/install-root/usr/local/share/dpdk/examples/l3fwd: No such file or directory.  Stop.
## Building skeleton
make: *** /tmp/UB1604-32_K4.4.0_GCC5.4.0/i686-native-linuxapp-gcc/96cc8aa56d544c9cb04380e3a9789da1/dpdk/build-x86-default/install-root/usr/local/share/dpdk/examples/skeleton: No such file or directory.  Stop.
## Building timer
make: *** /tmp/UB1604-32_K4.4.0_GCC5.4.0/i686-native-linuxapp-gcc/96cc8aa56d544c9cb04380e3a9789da1/dpdk/build-x86-default/install-root/usr/local/share/dpdk/examples/timer: No such file or directory.  Stop.


*Meson Build Failed #2:
OS: FC30-64
Target:build-gcc-static
[954/1964] Compiling C object 'examples/c590b3c@@dpdk-ipsec-secgw at exe/ipsec-secgw_sp4.c.o'.
[955/1964] Linking target drivers/librte_pmd_ice.so.1.1.
[956/1964] Compiling C object 'drivers/net/ixgbe/base/a7935d9@@ixgbe_base at sta/ixgbe_phy.c.o'.
[957/1964] Linking static target drivers/net/ixgbe/base/libixgbe_base.a.
[958/1964] Compiling C object 'examples/c590b3c@@dpdk-l2fwd at exe/l2fwd_main.c.o'.
FAILED: examples/c590b3c@@dpdk-l2fwd at exe/l2fwd_main.c.o 
cc -Iexamples/c590b3c@@dpdk-l2fwd at exe -Iexamples -I../examples -Iexamples/l2fwd -I../examples/l2fwd -I. -I../ -Iconfig -I../config -Ilib/librte_eal/common/include -I../lib/librte_eal/common/include -I../lib/librte_eal/linux/eal/include -Ilib/librte_eal/common -I../lib/librte_eal/common -Ilib/librte_eal/common/include/arch/x86 -I../lib/librte_eal/common/include/arch/x86 -Ilib/librte_eal -I../lib/librte_eal -Ilib/librte_kvargs -I../lib/librte_kvargs -Ilib/librte_mempool -I../lib/librte_mempool -Ilib/librte_ring -I../lib/librte_ring -Ilib/librte_net -I../lib/librte_net -Ilib/librte_mbuf -I../lib/librte_mbuf -Ilib/librte_ethdev -I../lib/librte_ethdev -Ilib/librte_meter -I../lib/librte_meter -Ilib/librte_cmdline -I../lib/librte_cmdline -fdiagnostics-color=always -pipe -D_FILE_OFFSET_BITS=64 -Wall -Winvalid-pch -Werror -O3 -include rte_config.h -Wextra -Wcast-qual -Wdeprecated -Wformat-nonliteral -Wformat-security -Wmissing-declarations -Wmissing-prototypes -Wnested-externs -Wold-style-definition -Wpointer-arith -Wsign-compare -Wstrict-prototypes -Wundef -Wwrite-strings -Wno-address-of-packed-member -Wno-packed-not-aligned -Wno-missing-field-initializers -D_GNU_SOURCE -march=nehalem -mno-avx512f -Wno-format-truncation -DALLOW_EXPERIMENTAL_API -MD -MQ 'examples/c590b3c@@dpdk-l2fwd at exe/l2fwd_main.c.o' -MF 'examples/c590b3c@@dpdk-l2fwd at exe/l2fwd_main.c.o.d' -o 'examples/c590b3c@@dpdk-l2fwd at exe/l2fwd_main.c.o' -c ../examples/l2fwd/main.c
../examples/l2fwd/main.c: In function ‘main’:
../examples/l2fwd/main.c:716:3: error: implicit declaration of function ‘rte_eth_dev_set_ptypes’; did you mean ‘rte_eth_dev_set_mtu’? [-Werror=implicit-function-declaration]
  716 |   rte_eth_dev_set_ptypes(portid, RTE_PTYPE_UNKNOWN,
      |   ^~~~~~~~~~~~~~~~~~~~~~
--
[961/1964] Compiling C object 'examples/c590b3c@@dpdk-ipv4_multicast at exe/ipv4_multicast_main.c.o'.
[962/1964] Compiling C object 'examples/c590b3c@@dpdk-l2fwd-event at exe/l2fwd-event_l2fwd_event_internal_port.c.o'.
[963/1964] Compiling C object 'examples/c590b3c@@dpdk-kni at exe/kni_main.c.o'.
[964/1964] Compiling C object 'examples/c590b3c@@dpdk-l2fwd-event at exe/l2fwd-event_l2fwd_poll.c.o'.
[965/1964] Compiling C object 'lib/76b5a35@@rte_pipeline at sta/librte_pipeline_rte_table_action.c.o'.
ninja: build stopped: subcommand failed.
find: ‘/tmp/FC30-64_K4.20_GCC9.1.1/x86_64-native-linuxapp-gcc/96cc8aa56d544c9cb04380e3a9789da1/dpdk/build-x86-default/install-root’: No such file or directory
dirname: missing operand
Try 'dirname --help' for more information.
## Building cmdline
gmake: *** /tmp/FC30-64_K4.20_GCC9.1.1/x86_64-native-linuxapp-gcc/96cc8aa56d544c9cb04380e3a9789da1/dpdk/build-x86-default/install-root/usr/local/share/dpdk/examples/cmdline: No such file or directory.  Stop.
## Building helloworld
gmake: *** /tmp/FC30-64_K4.20_GCC9.1.1/x86_64-native-linuxapp-gcc/96cc8aa56d544c9cb04380e3a9789da1/dpdk/build-x86-default/install-root/usr/local/share/dpdk/examples/helloworld: No such file or directory.  Stop.
## Building l2fwd
gmake: *** /tmp/FC30-64_K4.20_GCC9.1.1/x86_64-native-linuxapp-gcc/96cc8aa56d544c9cb04380e3a9789da1/dpdk/build-x86-default/install-root/usr/local/share/dpdk/examples/l2fwd: No such file or directory.  Stop.
## Building l3fwd
gmake: *** /tmp/FC30-64_K4.20_GCC9.1.1/x86_64-native-linuxapp-gcc/96cc8aa56d544c9cb04380e3a9789da1/dpdk/build-x86-default/install-root/usr/local/share/dpdk/examples/l3fwd: No such file or directory.  Stop.
## Building skeleton
gmake: *** /tmp/FC30-64_K4.20_GCC9.1.1/x86_64-native-linuxapp-gcc/96cc8aa56d544c9cb04380e3a9789da1/dpdk/build-x86-default/install-root/usr/local/share/dpdk/examples/skeleton: No such file or directory.  Stop.
## Building timer
gmake: *** /tmp/FC30-64_K4.20_GCC9.1.1/x86_64-native-linuxapp-gcc/96cc8aa56d544c9cb04380e3a9789da1/dpdk/build-x86-default/install-root/usr/local/share/dpdk/examples/timer: No such file or directory.  Stop.


*Meson Build Failed #3:
OS: SUSE15-64
Target:build-gcc-static
[1711/2011] Compiling C object 'app/test/3062f5d@@dpdk-test at exe/test_alarm.c.o'.
[1712/2011] Compiling C object 'app/a172ced@@dpdk-testpmd at exe/test-pmd_noisy_vnf.c.o'.
[1713/2011] Compiling C object 'app/a172ced@@dpdk-testpmd at exe/test-pmd_bpf_cmd.c.o'.
[1714/2011] Compiling C object 'app/test/3062f5d@@dpdk-test at exe/commands.c.o'.
[1715/2011] Compiling C object 'app/a172ced@@dpdk-testpmd at exe/test-pmd_cmdline.c.o'.
FAILED: app/a172ced@@dpdk-testpmd at exe/test-pmd_cmdline.c.o 
cc -Iapp/a172ced@@dpdk-testpmd at exe -Iapp -I../app -Ilib/librte_ethdev -I../lib/librte_ethdev -I. -I../ -Iconfig -I../config -Ilib/librte_eal/common/include -I../lib/librte_eal/common/include -I../lib/librte_eal/linux/eal/include -Ilib/librte_eal/common -I../lib/librte_eal/common -Ilib/librte_eal/common/include/arch/x86 -I../lib/librte_eal/common/include/arch/x86 -Ilib/librte_eal -I../lib/librte_eal -Ilib/librte_kvargs -I../lib/librte_kvargs -Ilib/librte_net -I../lib/librte_net -Ilib/librte_mbuf -I../lib/librte_mbuf -Ilib/librte_mempool -I../lib/librte_mempool -Ilib/librte_ring -I../lib/librte_ring -Ilib/librte_meter -I../lib/librte_meter -Ilib/librte_gro -I../lib/librte_gro -Ilib/librte_gso -I../lib/librte_gso -Ilib/librte_cmdline -I../lib/librte_cmdline -Ilib/librte_metrics -I../lib/librte_metrics -Idrivers/bus/pci -I../drivers/bus/pci -I../drivers/bus/pci/linux -Ilib/librte_pci -I../lib/librte_pci -Ilib/librte_pdump -I../lib/librte_pdump -Idrivers/net/bnxt -I../drivers/net/bnxt -Idrivers/bus/vdev -I../drivers/bus/vdev -Idrivers/net/i40e -I../drivers/net/i40e -Idrivers/net/i40e/base -I../drivers/net/i40e/base -Ilib/librte_hash -I../lib/librte_hash -Idrivers/net/ixgbe -I../drivers/net/ixgbe -Idrivers/net/ixgbe/base -I../drivers/net/ixgbe/base -Ilib/librte_security -I../lib/librte_security -Ilib/librte_cryptodev -I../lib/librte_cryptodev -Idrivers/net/softnic -I../drivers/net/softnic -Ilib/librte_pipeline -I../lib/librte_pipeline -Ilib/librte_port -I../lib/librte_port -Ilib/librte_sched -I../lib/librte_sched -Ilib/librte_ip_frag -I../lib/librte_ip_frag -Ilib/librte_eventdev -I../lib/librte_eventdev -Ilib/librte_timer -I../lib/librte_timer -Ilib/librte_kni -I../lib/librte_kni -Ilib/librte_table -I../lib/librte_table -Ilib/librte_lpm -I../lib/librte_lpm -Ilib/librte_acl -I../lib/librte_acl -Idrivers/bus/dpaa -I../drivers/bus/dpaa -I../drivers/bus/dpaa/include -I../drivers/bus/dpaa/base/qbman -Idrivers/common/dpaax -I../drivers/common/dpaax -Idrivers/mempool/dpaa -I../drivers/mempool/dpaa -Idrivers/net/dpaa -I../drivers/net/dpaa -Ilib/librte_bpf -I../lib/librte_bpf -fdiagnostics-color=always -pipe -D_FILE_OFFSET_BITS=64 -Wall -Winvalid-pch -Werror -O3 -include rte_config.h -Wextra -Wcast-qual -Wdeprecated -Wformat-nonliteral -Wformat-security -Wmissing-declarations -Wmissing-prototypes -Wnested-externs -Wold-style-definition -Wpointer-arith -Wsign-compare -Wstrict-prototypes -Wundef -Wwrite-strings -Wno-missing-field-initializers -D_GNU_SOURCE -march=nehalem -Wno-deprecated-declarations -DALLOW_EXPERIMENTAL_API -MD -MQ 'app/a172ced@@dpdk-testpmd at exe/test-pmd_cmdline.c.o' -MF 'app/a172ced@@dpdk-testpmd at exe/test-pmd_cmdline.c.o.d' -o 'app/a172ced@@dpdk-testpmd at exe/test-pmd_cmdline.c.o' -c ../app/test-pmd/cmdline.c
../app/test-pmd/cmdline.c: In function ‘cmd_set_port_ptypes_parsed’:
../app/test-pmd/cmdline.c:18973:8: error: implicit declaration of function ‘rte_eth_dev_set_ptypes’; did you mean ‘rte_eth_dev_set_mtu’? [-Werror=implicit-function-declaration]
  ret = rte_eth_dev_set_ptypes(port_id, ptype_mask, ptypes, ret);
        ^~~~~~~~~~~~~~~~~~~~~~
--
[1716/2011] Compiling C object 'app/test/3062f5d@@dpdk-test at exe/sample_packet_forward.c.o'.
[1717/2011] Compiling C object 'app/a172ced@@dpdk-test-sad at exe/test-sad_main.c.o'.
[1718/2011] Compiling C object 'app/test/3062f5d@@dpdk-test at exe/test_atomic.c.o'.
[1719/2011] Compiling C object 'app/a172ced@@dpdk-testpmd at exe/test-pmd_txonly.c.o'.
[1720/2011] Compiling C object 'app/a172ced@@dpdk-testpmd at exe/test-pmd_testpmd.c.o'.
FAILED: app/a172ced@@dpdk-testpmd at exe/test-pmd_testpmd.c.o 
cc -Iapp/a172ced@@dpdk-testpmd at exe -Iapp -I../app -Ilib/librte_ethdev -I../lib/librte_ethdev -I. -I../ -Iconfig -I../config -Ilib/librte_eal/common/include -I../lib/librte_eal/common/include -I../lib/librte_eal/linux/eal/include -Ilib/librte_eal/common -I../lib/librte_eal/common -Ilib/librte_eal/common/include/arch/x86 -I../lib/librte_eal/common/include/arch/x86 -Ilib/librte_eal -I../lib/librte_eal -Ilib/librte_kvargs -I../lib/librte_kvargs -Ilib/librte_net -I../lib/librte_net -Ilib/librte_mbuf -I../lib/librte_mbuf -Ilib/librte_mempool -I../lib/librte_mempool -Ilib/librte_ring -I../lib/librte_ring -Ilib/librte_meter -I../lib/librte_meter -Ilib/librte_gro -I../lib/librte_gro -Ilib/librte_gso -I../lib/librte_gso -Ilib/librte_cmdline -I../lib/librte_cmdline -Ilib/librte_metrics -I../lib/librte_metrics -Idrivers/bus/pci -I../drivers/bus/pci -I../drivers/bus/pci/linux -Ilib/librte_pci -I../lib/librte_pci -Ilib/librte_pdump -I../lib/librte_pdump -Idrivers/net/bnxt -I../drivers/net/bnxt -Idrivers/bus/vdev -I../drivers/bus/vdev -Idrivers/net/i40e -I../drivers/net/i40e -Idrivers/net/i40e/base -I../drivers/net/i40e/base -Ilib/librte_hash -I../lib/librte_hash -Idrivers/net/ixgbe -I../drivers/net/ixgbe -Idrivers/net/ixgbe/base -I../drivers/net/ixgbe/base -Ilib/librte_security -I../lib/librte_security -Ilib/librte_cryptodev -I../lib/librte_cryptodev -Idrivers/net/softnic -I../drivers/net/softnic -Ilib/librte_pipeline -I../lib/librte_pipeline -Ilib/librte_port -I../lib/librte_port -Ilib/librte_sched -I../lib/librte_sched -Ilib/librte_ip_frag -I../lib/librte_ip_frag -Ilib/librte_eventdev -I../lib/librte_eventdev -Ilib/librte_timer -I../lib/librte_timer -Ilib/librte_kni -I../lib/librte_kni -Ilib/librte_table -I../lib/librte_table -Ilib/librte_lpm -I../lib/librte_lpm -Ilib/librte_acl -I../lib/librte_acl -Idrivers/bus/dpaa -I../drivers/bus/dpaa -I../drivers/bus/dpaa/include -I../drivers/bus/dpaa/base/qbman -Idrivers/common/dpaax -I../drivers/common/dpaax -Idrivers/mempool/dpaa -I../drivers/mempool/dpaa -Idrivers/net/dpaa -I../drivers/net/dpaa -Ilib/librte_bpf -I../lib/librte_bpf -fdiagnostics-color=always -pipe -D_FILE_OFFSET_BITS=64 -Wall -Winvalid-pch -Werror -O3 -include rte_config.h -Wextra -Wcast-qual -Wdeprecated -Wformat-nonliteral -Wformat-security -Wmissing-declarations -Wmissing-prototypes -Wnested-externs -Wold-style-definition -Wpointer-arith -Wsign-compare -Wstrict-prototypes -Wundef -Wwrite-strings -Wno-missing-field-initializers -D_GNU_SOURCE -march=nehalem -Wno-deprecated-declarations -DALLOW_EXPERIMENTAL_API -MD -MQ 'app/a172ced@@dpdk-testpmd at exe/test-pmd_testpmd.c.o' -MF 'app/a172ced@@dpdk-testpmd at exe/test-pmd_testpmd.c.o.d' -o 'app/a172ced@@dpdk-testpmd at exe/test-pmd_testpmd.c.o' -c ../app/test-pmd/testpmd.c
../app/test-pmd/testpmd.c: In function ‘start_port’:
../app/test-pmd/testpmd.c:2163:4: error: implicit declaration of function ‘rte_eth_dev_set_ptypes’; did you mean ‘rte_eth_dev_set_mtu’? [-Werror=implicit-function-declaration]
    rte_eth_dev_set_ptypes(pi, RTE_PTYPE_UNKNOWN, NULL, 0);
    ^~~~~~~~~~~~~~~~~~~~~~
    rte_eth_dev_set_mtu
../app/test-pmd/testpmd.c:2163:4: error: nested extern declaration of ‘rte_eth_dev_set_ptypes’ [-Werror=nested-externs]
cc1: all warnings being treated as errors
[1721/2011] Compiling C object 'app/test/3062f5d@@dpdk-test at exe/packet_burst_generator.c.o'.
[1722/2011] Compiling C object 'app/test/3062f5d@@dpdk-test at exe/test_acl.c.o'.
ninja: build stopped: subcommand failed.
find: ‘/tmp/SUSE15-64_K4.12.14_GCC7.3.1/x86_64-native-linuxapp-gcc/96cc8aa56d544c9cb04380e3a9789da1/dpdk/build-x86-default/install-root’: No such file or directory
dirname: missing operand
Try 'dirname --help' for more information.
## Building cmdline
gmake: *** /tmp/SUSE15-64_K4.12.14_GCC7.3.1/x86_64-native-linuxapp-gcc/96cc8aa56d544c9cb04380e3a9789da1/dpdk/build-x86-default/install-root/usr/local/share/dpdk/examples/cmdline: No such file or directory.  Stop.
## Building helloworld
gmake: *** /tmp/SUSE15-64_K4.12.14_GCC7.3.1/x86_64-native-linuxapp-gcc/96cc8aa56d544c9cb04380e3a9789da1/dpdk/build-x86-default/install-root/usr/local/share/dpdk/examples/helloworld: No such file or directory.  Stop.
## Building l2fwd
gmake: *** /tmp/SUSE15-64_K4.12.14_GCC7.3.1/x86_64-native-linuxapp-gcc/96cc8aa56d544c9cb04380e3a9789da1/dpdk/build-x86-default/install-root/usr/local/share/dpdk/examples/l2fwd: No such file or directory.  Stop.
## Building l3fwd
gmake: *** /tmp/SUSE15-64_K4.12.14_GCC7.3.1/x86_64-native-linuxapp-gcc/96cc8aa56d544c9cb04380e3a9789da1/dpdk/build-x86-default/install-root/usr/local/share/dpdk/examples/l3fwd: No such file or directory.  Stop.
## Building skeleton
gmake: *** /tmp/SUSE15-64_K4.12.14_GCC7.3.1/x86_64-native-linuxapp-gcc/96cc8aa56d544c9cb04380e3a9789da1/dpdk/build-x86-default/install-root/usr/local/share/dpdk/examples/skeleton: No such file or directory.  Stop.
## Building timer
gmake: *** /tmp/SUSE15-64_K4.12.14_GCC7.3.1/x86_64-native-linuxapp-gcc/96cc8aa56d544c9cb04380e3a9789da1/dpdk/build-x86-default/install-root/usr/local/share/dpdk/examples/timer: No such file or directory.  Stop.


*Meson Build Failed #4:
OS: UB1804-64
Target:build-gcc-static

find: ‘/tmp/UB1804-64_K4.15.0_GCC7.3.0/x86_64-native-linuxapp-gcc/96cc8aa56d544c9cb04380e3a9789da1/dpdk/build-x86-default/install-root’: No such file or directory
dirname: missing operand
Try 'dirname --help' for more information.
## Building cmdline
make: *** /tmp/UB1804-64_K4.15.0_GCC7.3.0/x86_64-native-linuxapp-gcc/96cc8aa56d544c9cb04380e3a9789da1/dpdk/build-x86-default/install-root/usr/local/share/dpdk/examples/cmdline: No such file or directory.  Stop.
## Building helloworld
make: *** /tmp/UB1804-64_K4.15.0_GCC7.3.0/x86_64-native-linuxapp-gcc/96cc8aa56d544c9cb04380e3a9789da1/dpdk/build-x86-default/install-root/usr/local/share/dpdk/examples/helloworld: No such file or directory.  Stop.
## Building l2fwd
make: *** /tmp/UB1804-64_K4.15.0_GCC7.3.0/x86_64-native-linuxapp-gcc/96cc8aa56d544c9cb04380e3a9789da1/dpdk/build-x86-default/install-root/usr/local/share/dpdk/examples/l2fwd: No such file or directory.  Stop.
## Building l3fwd
make: *** /tmp/UB1804-64_K4.15.0_GCC7.3.0/x86_64-native-linuxapp-gcc/96cc8aa56d544c9cb04380e3a9789da1/dpdk/build-x86-default/install-root/usr/local/share/dpdk/examples/l3fwd: No such file or directory.  Stop.
## Building skeleton
make: *** /tmp/UB1804-64_K4.15.0_GCC7.3.0/x86_64-native-linuxapp-gcc/96cc8aa56d544c9cb04380e3a9789da1/dpdk/build-x86-default/install-root/usr/local/share/dpdk/examples/skeleton: No such file or directory.  Stop.
## Building timer
make: *** /tmp/UB1804-64_K4.15.0_GCC7.3.0/x86_64-native-linuxapp-gcc/96cc8aa56d544c9cb04380e3a9789da1/dpdk/build-x86-default/install-root/usr/local/share/dpdk/examples/timer: No such file or directory.  Stop.


*Meson Build Failed #5:
OS: FreeBSD12-64
Target:build-gcc-static
ninja: error: manifest 'build.ninja' still dirty after 100 tries

find: /tmp/FreeBSD12-64_K19.02_GCC7.3.0/x86_64-native-bsdapp-gcc/96cc8aa56d544c9cb04380e3a9789da1/dpdk/build-x86-default/install-root: No such file or directory
usage: dirname string [...]
## Building cmdline
gmake: *** /tmp/FreeBSD12-64_K19.02_GCC7.3.0/x86_64-native-bsdapp-gcc/96cc8aa56d544c9cb04380e3a9789da1/dpdk/build-x86-default/install-root/usr/local/share/dpdk/examples/cmdline: No such file or directory.  Stop.
## Building helloworld
gmake: *** /tmp/FreeBSD12-64_K19.02_GCC7.3.0/x86_64-native-bsdapp-gcc/96cc8aa56d544c9cb04380e3a9789da1/dpdk/build-x86-default/install-root/usr/local/share/dpdk/examples/helloworld: No such file or directory.  Stop.
## Building l2fwd
gmake: *** /tmp/FreeBSD12-64_K19.02_GCC7.3.0/x86_64-native-bsdapp-gcc/96cc8aa56d544c9cb04380e3a9789da1/dpdk/build-x86-default/install-root/usr/local/share/dpdk/examples/l2fwd: No such file or directory.  Stop.
## Building l3fwd
gmake: *** /tmp/FreeBSD12-64_K19.02_GCC7.3.0/x86_64-native-bsdapp-gcc/96cc8aa56d544c9cb04380e3a9789da1/dpdk/build-x86-default/install-root/usr/local/share/dpdk/examples/l3fwd: No such file or directory.  Stop.
## Building skeleton
gmake: *** /tmp/FreeBSD12-64_K19.02_GCC7.3.0/x86_64-native-bsdapp-gcc/96cc8aa56d544c9cb04380e3a9789da1/dpdk/build-x86-default/install-root/usr/local/share/dpdk/examples/skeleton: No such file or directory.  Stop.
## Building timer
gmake: *** /tmp/FreeBSD12-64_K19.02_GCC7.3.0/x86_64-native-bsdapp-gcc/96cc8aa56d544c9cb04380e3a9789da1/dpdk/build-x86-default/install-root/usr/local/share/dpdk/examples/timer: No such file or directory.  Stop.

DPDK STV team


More information about the test-report mailing list