[dpdk-test-report] |FAILURE| pw60269[v3, 2/3] lib/rcu: add resource reclamation APIs

sys_stv at intel.com sys_stv at intel.com
Tue Oct 1 09:16:23 CEST 2019


Test-Label: Intel-compilation
Test-Status: FAILURE
http://dpdk.org/patch/60269

_Compilation issues_

Submitter: Honnappa Nagarahalli <honnappa.nagarahalli at arm.com>
Date: 2019-10-01 06:29:16
Reply_mail: 20191001062917.35578-3-honnappa.nagarahalli at arm.com
DPDK git baseline: Repo:dpdk, CommitID: bd253daa7717835f88bbc58b09a94d0060380396

Makefile build Summary: 22 Builds Done, 15 Successful, 7 Failures

Meson build Summary: 7 Builds Done, 7 Successful, 0 Failures

               +==============================================+===========+==========+
               |                   Makefile                   |   Meson   | Document |
+--------------+------+-------+------+------------+-----------+-----------+----------+
| os           | gcc  | clang | icc  | gcc+shared | gcc+debug | gcc/clang | pdf/html |
+--------------+------+-------+------+------------+-----------+-----------+----------+
| RHEL76-64    | FAIL |       |      |            |           |           |          |
| CENTOS76-64  | pass | pass  | pass | FAIL       | pass      |           |          |
| UB1804-64    | pass | pass  | pass |            |           | pass      | pass     |
| UB1604-32    | pass |       |      |            |           | pass      |          |
| UB1904-64    | FAIL |       |      |            |           |           |          |
| UB1604-64    | pass | pass  |      |            |           |           |          |
| FC30-64      | pass | pass  |      |            |           | pass      |          |
| WIN10-64     |      |       |      |            |           | pass      |          |
| FreeBSD12-64 | FAIL | FAIL  |      | FAIL       | pass      | pass      |          |
| RHEL80-64    | pass |       |      |            |           |           |          |
| SUSE15-64    | FAIL | pass  |      |            |           | pass      |          |
+--------------+------+-------+------+------------+-----------+-----------+----------+

Test environment and configuration as below:

** Makefile build **


OS: RHEL76-64
	Kernel Version: 3.10.0-957.el7.x86_64
	CPU info: Intel(R) Xeon(R) CPU E5-2699 v4 @ 2.20GHz
	GCC Version: gcc (GCC) 4.8.5 20150623 (Red Hat 4.8.5-36)
	Clang Version: NA
	x86_64-native-linuxapp-gcc


OS: CENTOS76-64
	Kernel Version: 3.10.0-957.10.1.el7.x86_64
	CPU info: Intel(R) Xeon(R) CPU E5-2699 v4 @ 2.20GHz
	GCC Version: gcc (GCC) 4.8.5 20150623 (Red Hat 4.8.5-36)
	Clang Version: 3.4.2 (tags/RELEASE_34/dot2-final)
	x86_64-native-linuxapp-gcc+shared
	x86_64-native-linuxapp-clang
	x86_64-native-linuxapp-gcc+debug
	x86_64-native-linuxapp-gcc
	x86_64-native-linuxapp-icc


OS: UB1804-64
	Kernel Version: 4.15.0-20-generic
	CPU info: Intel(R) Xeon(R) CPU E5-2699 v3 @ 2.30GHz
	GCC Version: gcc (Ubuntu 7.3.0-16ubuntu3) 7.3.0
	Clang Version: 6.0.0-1ubuntu2 (tags/RELEASE_600/final)
	x86_64-native-linuxapp-clang
	x86_64-native-linuxapp-icc
	x86_64-native-linuxapp-gcc


OS: UB1904-64
	Kernel Version: 5.0.0-13-generic
	CPU info: Intel(R) Xeon(R) CPU E5-2699 v3 @ 2.30GHz
	GCC Version: gcc (Ubuntu 8.3.0-6ubuntu1) 8.3.0
	Clang Version: 8.0.0-3 (tags/RELEASE_800/final)
	x86_64-native-linuxapp-gcc


OS: UB1604-32
	Kernel Version: 4.4.0-131-generic
	CPU info: Intel(R) Xeon(R) CPU E5-2699 v3 @ 2.30GHz
	GCC Version: gcc (Ubuntu 5.4.0-6ubuntu1~16.04.11) 5.4.0 20160609
	Clang Version: 3.8.0-2ubuntu4 (tags/RELEASE_380/final)
	i686-native-linuxapp-gcc


OS: UB1604-64
	Kernel Version: 4.4.0-47-generic
	CPU info: Intel(R) Xeon(R) CPU E5-2699 v3 @ 2.30GHz
	GCC Version: gcc (Ubuntu 5.4.0-6ubuntu1~16.04.10) 5.4.0 20160609
	Clang Version: 3.8.0-2ubuntu4 (tags/RELEASE_380/final)
	x86_64-native-linuxapp-clang
	x86_64-native-linuxapp-gcc


OS: FC30-64
	Kernel Version: 5.1.7-300.fc30.x86_64
	CPU info: Intel(R) Xeon(R) CPU E5-2699 v4 @ 2.20GHz
	GCC Version: gcc (GCC) 9.1.1 20190503 (Red Hat 9.1.1-1)
	Clang Version: 8.0.0 (Fedora 8.0.0-1.fc30)
	x86_64-native-linuxapp-gcc
	x86_64-native-linuxapp-clang


OS: FreeBSD12-64
	Kernel Version: 12.0-RC3
	CPU info: Intel(R) Xeon(R) CPU E5-2699 v4 @ 2.20GHz (2194.97-MHz K8-class CPU)
	GCC Version: gcc (FreeBSD Ports Collection) 7.3.0
	Clang Version: 6.0.1 (tags/RELEASE_601/final 335540) (based on LLVM 6.0.1)
	x86_64-native-bsdapp-clang
	x86_64-native-bsdapp-gcc
	x86_64-native-bsdapp-gcc+shared
	x86_64-native-bsdapp-gcc+debug


OS: RHEL80-64
	Kernel Version: 4.18.0-80.el8.x86_64
	CPU info: Intel(R) Xeon(R) CPU E5-2699 v4 @ 2.20GHz
	GCC Version: gcc (GCC) 8.2.1 20180905 (Red Hat 8.2.1-3)
	Clang Version: 6.0.1 (tags/RELEASE_601/final)
	x86_64-native-linuxapp-gcc


OS: SUSE15-64
	Kernel Version: 4.12.14-lp150.11-default
	CPU info: Intel(R) Xeon(R) CPU E5-2699 v4 @ 2.20GHz
	GCC Version: gcc (SUSE Linux) 7.3.1 20180323 [gcc-7-branch revision 258812]
	Clang Version: 5.0.1 (tags/RELEASE_501/final 312548)
	x86_64-native-linuxapp-gcc
	x86_64-native-linuxapp-clang


** Meson build **


OS: UB1804-64
	Kernel Version: 4.15.0-20-generic
	CPU info: Intel(R) Xeon(R) CPU E5-2699 v4 @ 2.20GHz
	GCC Version: gcc (Ubuntu 7.3.0-27ubuntu1~18.04) 7.3.0
	Clang Version: 6.0.0-1ubuntu2 (tags/RELEASE_600/final)
	x86_64-native-linuxapp-doc
	build-gcc-static
	build-gcc-shared
	build-clang-static
	build-clang-shared
	build-x86-default


OS: UB1604-32
	Kernel Version: 4.4.0-131-generic
	CPU info: Intel(R) Xeon(R) CPU E5-2699 v4 @ 2.20GHz
	GCC Version: gcc (Ubuntu 5.4.0-6ubuntu1~16.04.11) 5.4.0 20160609
	Clang Version: 3.8.0-2ubuntu4 (tags/RELEASE_380/final)
	build-gcc-static
	build-gcc-shared
	build-clang-static
	build-clang-shared
	build-x86-default


OS: FC30-64
	Kernel Version: 5.0.9-301.fc30.x86_64
	CPU info: Intel(R) Xeon(R) CPU E5-2699 v4 @ 2.20GHz
	GCC Version: gcc (GCC) 9.1.1 20190503 (Red Hat 9.1.1-1)
	Clang Version: 8.0.0 (Fedora 8.0.0-1.fc30)
	build-gcc-static
	build-gcc-shared
	build-clang-static
	build-clang-shared
	build-x86-default


OS: WIN10-64
	Kernel Version: N/A
	CPU info: N/A
	GCC Version: N/A
	Clang Version: Clang 8.0.0
	x86_64-windows-clang


OS: FreeBSD12-64
	Kernel Version: 12.0-RC3
	CPU info: Intel(R) Xeon(R) CPU E5-2699 v4 @ 2.20GHz (2194.99-MHz K8-class CPU)
	GCC Version: gcc (FreeBSD Ports Collection) 7.3.0
	Clang Version: 6.0.1 (tags/RELEASE_601/final 335540) (based on LLVM 6.0.1)
	build-gcc-static
	build-gcc-shared
	build-clang-static
	build-clang-shared
	build-x86-default


OS: SUSE15-64
	Kernel Version: 4.12.14-lp150.11-default
	CPU info: Intel(R) Xeon(R) CPU E5-2699 v4 @ 2.20GHz
	GCC Version: gcc (SUSE Linux) 7.3.1 20180323 [gcc-7-branch revision 258812]
	Clang Version: 5.0.1 (tags/RELEASE_501/final 312548)
	build-gcc-static
	build-gcc-shared
	build-clang-static
	build-clang-shared
	build-x86-default


*Make Build Failed #1:
OS: UB1904-64
Target: x86_64-native-linuxapp-gcc
  SYMLINK-FILE include/rte_ring_generic.h
  CC rte_pci.o
  CC rte_jobstats.o
In file included from /tmp/UB1904-64_K4.18.0_GCC8.3.0/x86_64-native-linuxapp-gcc/b59cd6f8276447779387ff72d91d65f3/dpdk/lib/librte_rcu/rte_rcu_qsbr.h:37,
                 from /tmp/UB1904-64_K4.18.0_GCC8.3.0/x86_64-native-linuxapp-gcc/b59cd6f8276447779387ff72d91d65f3/dpdk/lib/librte_rcu/rte_rcu_qsbr.c:23:
/tmp/UB1904-64_K4.18.0_GCC8.3.0/x86_64-native-linuxapp-gcc/b59cd6f8276447779387ff72d91d65f3/dpdk/x86_64-native-linuxapp-gcc/include/rte_ring.h:311:10: fatal error: rte_ring_generic.h: No such file or directory
 #include "rte_ring_generic.h"
          ^~~~~~~~~~~~~~~~~~~~
compilation terminated.
make[5]: *** [/tmp/UB1904-64_K4.18.0_GCC8.3.0/x86_64-native-linuxapp-gcc/b59cd6f8276447779387ff72d91d65f3/dpdk/mk/internal/rte.compile-pre.mk:116: rte_rcu_qsbr.o] Error 1
make[4]: *** [/tmp/UB1904-64_K4.18.0_GCC8.3.0/x86_64-native-linuxapp-gcc/b59cd6f8276447779387ff72d91d65f3/dpdk/mk/rte.subdir.mk:37: librte_rcu] Error 2
make[4]: *** Waiting for unfinished jobs....
  CC rte_metrics.o
  SYMLINK-FILE include/rte_stack_lf_generic.h
  SYMLINK-FILE include/rte_acl.h
  SYMLINK-FILE include/rte_stack_lf_c11.h
--
  INSTALL-LIB librte_stack.a
  AR librte_timer.a
  INSTALL-LIB librte_timer.a
  AR librte_acl.a
  INSTALL-LIB librte_acl.a
make[3]: *** [/tmp/UB1904-64_K4.18.0_GCC8.3.0/x86_64-native-linuxapp-gcc/b59cd6f8276447779387ff72d91d65f3/dpdk/mk/rte.sdkbuild.mk:48: lib] Error 2
make[2]: *** [/tmp/UB1904-64_K4.18.0_GCC8.3.0/x86_64-native-linuxapp-gcc/b59cd6f8276447779387ff72d91d65f3/dpdk/mk/rte.sdkroot.mk:99: all] Error 2
make[1]: *** [/tmp/UB1904-64_K4.18.0_GCC8.3.0/x86_64-native-linuxapp-gcc/b59cd6f8276447779387ff72d91d65f3/dpdk/mk/rte.sdkinstall.mk:61: pre_install] Error 2
make: *** [/tmp/UB1904-64_K4.18.0_GCC8.3.0/x86_64-native-linuxapp-gcc/b59cd6f8276447779387ff72d91d65f3/dpdk/mk/rte.sdkroot.mk:77: install] Error 2


*Make Build Failed #2:
OS: SUSE15-64
Target: x86_64-native-linuxapp-gcc
  SYMLINK-FILE include/rte_ring.h
  CC rte_cfgfile.o
  SYMLINK-FILE include/rte_stack_std.h
  CC tb_mem.o
In file included from /tmp/SUSE15-64_K4.12.14_GCC7.3.1/x86_64-native-linuxapp-gcc/b59cd6f8276447779387ff72d91d65f3/dpdk/lib/librte_rcu/rte_rcu_qsbr.c:23:0:
/tmp/SUSE15-64_K4.12.14_GCC7.3.1/x86_64-native-linuxapp-gcc/b59cd6f8276447779387ff72d91d65f3/dpdk/lib/librte_rcu/rte_rcu_qsbr.h:37:10: fatal error: rte_ring.h: No such file or directory
 #include <rte_ring.h>
          ^~~~~~~~~~~~
compilation terminated.
make[5]: *** [/tmp/SUSE15-64_K4.12.14_GCC7.3.1/x86_64-native-linuxapp-gcc/b59cd6f8276447779387ff72d91d65f3/dpdk/mk/internal/rte.compile-pre.mk:116: rte_rcu_qsbr.o] Error 1
make[4]: *** [/tmp/SUSE15-64_K4.12.14_GCC7.3.1/x86_64-native-linuxapp-gcc/b59cd6f8276447779387ff72d91d65f3/dpdk/mk/rte.subdir.mk:37: librte_rcu] Error 2
make[4]: *** Waiting for unfinished jobs....
  SYMLINK-FILE include/rte_ring_generic.h
  CC rte_acl.o
  SYMLINK-FILE include/rte_ring_c11_mem.h
  SYMLINK-FILE include/rte_stack_lf.h
--
  INSTALL-LIB librte_stack.a
  AR librte_timer.a
  INSTALL-LIB librte_timer.a
  AR librte_acl.a
  INSTALL-LIB librte_acl.a
make[3]: *** [/tmp/SUSE15-64_K4.12.14_GCC7.3.1/x86_64-native-linuxapp-gcc/b59cd6f8276447779387ff72d91d65f3/dpdk/mk/rte.sdkbuild.mk:48: lib] Error 2
make[2]: *** [/tmp/SUSE15-64_K4.12.14_GCC7.3.1/x86_64-native-linuxapp-gcc/b59cd6f8276447779387ff72d91d65f3/dpdk/mk/rte.sdkroot.mk:99: all] Error 2
make[1]: *** [/tmp/SUSE15-64_K4.12.14_GCC7.3.1/x86_64-native-linuxapp-gcc/b59cd6f8276447779387ff72d91d65f3/dpdk/mk/rte.sdkinstall.mk:61: pre_install] Error 2
make: *** [/tmp/SUSE15-64_K4.12.14_GCC7.3.1/x86_64-native-linuxapp-gcc/b59cd6f8276447779387ff72d91d65f3/dpdk/mk/rte.sdkroot.mk:77: install] Error 2


*Make Build Failed #3:
OS: RHEL76-64
Target: x86_64-native-linuxapp-gcc
  SYMLINK-FILE include/rte_ring_generic.h
  CC rte_metrics.o
  CC rte_cfgfile.o
In file included from /tmp/RHEL76-64_K3.10.0_GCC4.8.5/x86_64-native-linuxapp-gcc/b59cd6f8276447779387ff72d91d65f3/dpdk/lib/librte_rcu/rte_rcu_qsbr.h:37:0,
                 from /tmp/RHEL76-64_K3.10.0_GCC4.8.5/x86_64-native-linuxapp-gcc/b59cd6f8276447779387ff72d91d65f3/dpdk/lib/librte_rcu/rte_rcu_qsbr.c:23:
/tmp/RHEL76-64_K3.10.0_GCC4.8.5/x86_64-native-linuxapp-gcc/b59cd6f8276447779387ff72d91d65f3/dpdk/x86_64-native-linuxapp-gcc/include/rte_ring.h:311:30: fatal error: rte_ring_generic.h: No such file or directory
 #include "rte_ring_generic.h"
                              ^
compilation terminated.
  CC rte_jobstats.o
  SYMLINK-FILE include/rte_acl_osdep.h
--
  SYMLINK-FILE include/rte_acl.h
  CC rte_ring.o
  SYMLINK-FILE include/rte_stack_lf.h
  CC tb_mem.o
The bug is not reproducible, so it is likely a hardware or OS problem.
make[5]: *** [rte_rcu_qsbr.o] Error 1
  AR librte_pci.a
make[4]: *** [librte_rcu] Error 2
make[4]: *** Waiting for unfinished jobs....
  SYMLINK-FILE include/rte_stack_lf_generic.h
  SYMLINK-FILE include/rte_stack_lf_c11.h
  INSTALL-LIB librte_pci.a
  CC rte_stack.o
--
  INSTALL-LIB librte_stack.a
  AR librte_timer.a
  INSTALL-LIB librte_timer.a
  AR librte_acl.a
  INSTALL-LIB librte_acl.a
make[3]: *** [lib] Error 2
make[2]: *** [all] Error 2
make[1]: *** [pre_install] Error 2
make: *** [install] Error 2


*Make Build Failed #4:
OS: FreeBSD12-64
Target: x86_64-native-bsdapp-clang
  CC rte_rcu_qsbr.o
  SYMLINK-FILE include/rte_acl.h
  SYMLINK-FILE include/rte_stack_lf.h
In file included from /tmp/FreeBSD12-64_K19.02_Clang6.0.1/x86_64-native-bsdapp-clang/b59cd6f8276447779387ff72d91d65f3/dpdk/lib/librte_rcu/rte_rcu_qsbr.c:23:
In file included from /tmp/FreeBSD12-64_K19.02_Clang6.0.1/x86_64-native-bsdapp-clang/b59cd6f8276447779387ff72d91d65f3/dpdk/lib/librte_rcu/rte_rcu_qsbr.h:37:
/tmp/FreeBSD12-64_K19.02_Clang6.0.1/x86_64-native-bsdapp-clang/b59cd6f8276447779387ff72d91d65f3/dpdk/x86_64-native-bsdapp-clang/include/rte_ring.h:311:10: fatal error: 'rte_ring_generic.h' file not found
#include "rte_ring_generic.h"
         ^~~~~~~~~~~~~~~~~~~~
1 error generated.
gmake[5]: *** [/tmp/FreeBSD12-64_K19.02_Clang6.0.1/x86_64-native-bsdapp-clang/b59cd6f8276447779387ff72d91d65f3/dpdk/mk/internal/rte.compile-pre.mk:116: rte_rcu_qsbr.o] Error 1
gmake[4]: *** [/tmp/FreeBSD12-64_K19.02_Clang6.0.1/x86_64-native-bsdapp-clang/b59cd6f8276447779387ff72d91d65f3/dpdk/mk/rte.subdir.mk:37: librte_rcu] Error 2
  SYMLINK-FILE include/rte_ring_c11_mem.h
gmake[4]: *** Waiting for unfinished jobs....
  SYMLINK-FILE include/rte_jobstats.h
  CC rte_timer.o
  SYMLINK-FILE include/rte_stack_lf_generic.h
--
  INSTALL-LIB librte_stack.a
  AR librte_timer.a
  INSTALL-LIB librte_timer.a
  AR librte_acl.a
  INSTALL-LIB librte_acl.a
gmake[3]: *** [/tmp/FreeBSD12-64_K19.02_Clang6.0.1/x86_64-native-bsdapp-clang/b59cd6f8276447779387ff72d91d65f3/dpdk/mk/rte.sdkbuild.mk:48: lib] Error 2
gmake[2]: *** [/tmp/FreeBSD12-64_K19.02_Clang6.0.1/x86_64-native-bsdapp-clang/b59cd6f8276447779387ff72d91d65f3/dpdk/mk/rte.sdkroot.mk:99: all] Error 2
gmake[1]: *** [/tmp/FreeBSD12-64_K19.02_Clang6.0.1/x86_64-native-bsdapp-clang/b59cd6f8276447779387ff72d91d65f3/dpdk/mk/rte.sdkinstall.mk:61: pre_install] Error 2
gmake: *** [/tmp/FreeBSD12-64_K19.02_Clang6.0.1/x86_64-native-bsdapp-clang/b59cd6f8276447779387ff72d91d65f3/dpdk/mk/rte.sdkroot.mk:77: install] Error 2


*Make Build Failed #5:
OS: FreeBSD12-64
Target: x86_64-native-bsdapp-gcc
  SYMLINK-FILE include/rte_acl.h
  CC rte_rcu_qsbr.o
  CC tb_mem.o
In file included from /tmp/FreeBSD12-64_K19.02_GCC7.3.0/x86_64-native-bsdapp-gcc/b59cd6f8276447779387ff72d91d65f3/dpdk/lib/librte_rcu/rte_rcu_qsbr.h:37:0,
                 from /tmp/FreeBSD12-64_K19.02_GCC7.3.0/x86_64-native-bsdapp-gcc/b59cd6f8276447779387ff72d91d65f3/dpdk/lib/librte_rcu/rte_rcu_qsbr.c:23:
/tmp/FreeBSD12-64_K19.02_GCC7.3.0/x86_64-native-bsdapp-gcc/b59cd6f8276447779387ff72d91d65f3/dpdk/x86_64-native-bsdapp-gcc/include/rte_ring.h:311:10: fatal error: rte_ring_generic.h: No such file or directory
 #include "rte_ring_generic.h"
          ^~~~~~~~~~~~~~~~~~~~
compilation terminated.
gmake[5]: *** [/tmp/FreeBSD12-64_K19.02_GCC7.3.0/x86_64-native-bsdapp-gcc/b59cd6f8276447779387ff72d91d65f3/dpdk/mk/internal/rte.compile-pre.mk:116: rte_rcu_qsbr.o] Error 1
gmake[4]: *** [/tmp/FreeBSD12-64_K19.02_GCC7.3.0/x86_64-native-bsdapp-gcc/b59cd6f8276447779387ff72d91d65f3/dpdk/mk/rte.subdir.mk:37: librte_rcu] Error 2
gmake[4]: *** Waiting for unfinished jobs....
  CC rte_metrics.o
  CC rte_acl.o
  AR librte_pci.a
  SYMLINK-FILE include/rte_ring_c11_mem.h
--
  INSTALL-LIB librte_stack.a
  AR librte_timer.a
  INSTALL-LIB librte_timer.a
  AR librte_acl.a
  INSTALL-LIB librte_acl.a
gmake[3]: *** [/tmp/FreeBSD12-64_K19.02_GCC7.3.0/x86_64-native-bsdapp-gcc/b59cd6f8276447779387ff72d91d65f3/dpdk/mk/rte.sdkbuild.mk:48: lib] Error 2
gmake[2]: *** [/tmp/FreeBSD12-64_K19.02_GCC7.3.0/x86_64-native-bsdapp-gcc/b59cd6f8276447779387ff72d91d65f3/dpdk/mk/rte.sdkroot.mk:99: all] Error 2
gmake[1]: *** [/tmp/FreeBSD12-64_K19.02_GCC7.3.0/x86_64-native-bsdapp-gcc/b59cd6f8276447779387ff72d91d65f3/dpdk/mk/rte.sdkinstall.mk:61: pre_install] Error 2
gmake: *** [/tmp/FreeBSD12-64_K19.02_GCC7.3.0/x86_64-native-bsdapp-gcc/b59cd6f8276447779387ff72d91d65f3/dpdk/mk/rte.sdkroot.mk:77: install] Error 2


*Make Build Failed #6:
OS: FreeBSD12-64
Target: x86_64-native-bsdapp-gcc+shared
rte_rcu_qsbr.o: In function `rte_rcu_qsbr_dq_create':
rte_rcu_qsbr.c:(.text.experimental+0x632): undefined reference to `rte_ring_create'
rte_rcu_qsbr.o: In function `rte_rcu_qsbr_dq_delete':
rte_rcu_qsbr.c:(.text.experimental+0xce1): undefined reference to `rte_ring_free'
collect2: error: ld returned 1 exit status
gmake[5]: *** [/tmp/FreeBSD12-64_K19.02_GCC7.3.0/x86_64-native-bsdapp-gcc+shared/b59cd6f8276447779387ff72d91d65f3/dpdk/mk/rte.lib.mk:102: librte_rcu.so.1.1] Error 1
gmake[4]: *** [/tmp/FreeBSD12-64_K19.02_GCC7.3.0/x86_64-native-bsdapp-gcc+shared/b59cd6f8276447779387ff72d91d65f3/dpdk/mk/rte.subdir.mk:35: librte_rcu] Error 2
gmake[4]: *** Waiting for unfinished jobs....
  LD librte_timer.so.1.1
  INSTALL-LIB librte_timer.so.1.1
  SYMLINK-FILE include/rte_mempool.h
  CC rte_mempool.o
--
  INSTALL-LIB librte_mempool.so.5.1
  LD librte_acl.so.2.1
  INSTALL-LIB librte_acl.so.2.1
  LD librte_hash.so.2.1
  INSTALL-LIB librte_hash.so.2.1
gmake[3]: *** [/tmp/FreeBSD12-64_K19.02_GCC7.3.0/x86_64-native-bsdapp-gcc+shared/b59cd6f8276447779387ff72d91d65f3/dpdk/mk/rte.sdkbuild.mk:48: lib] Error 2
gmake[2]: *** [/tmp/FreeBSD12-64_K19.02_GCC7.3.0/x86_64-native-bsdapp-gcc+shared/b59cd6f8276447779387ff72d91d65f3/dpdk/mk/rte.sdkroot.mk:99: all] Error 2
gmake[1]: *** [/tmp/FreeBSD12-64_K19.02_GCC7.3.0/x86_64-native-bsdapp-gcc+shared/b59cd6f8276447779387ff72d91d65f3/dpdk/mk/rte.sdkinstall.mk:61: pre_install] Error 2
gmake: *** [/tmp/FreeBSD12-64_K19.02_GCC7.3.0/x86_64-native-bsdapp-gcc+shared/b59cd6f8276447779387ff72d91d65f3/dpdk/mk/rte.sdkroot.mk:77: install] Error 2


*Make Build Failed #7:
OS: CENTOS76-64
Target: x86_64-native-linuxapp-gcc+shared
rte_rcu_qsbr.o: In function `rte_rcu_qsbr_dq_create':
rte_rcu_qsbr.c:(.text.experimental+0x62b): undefined reference to `rte_ring_create'
rte_rcu_qsbr.o: In function `rte_rcu_qsbr_dq_delete':
rte_rcu_qsbr.c:(.text.experimental+0xcd1): undefined reference to `rte_ring_free'
collect2: error: ld returned 1 exit status
make[5]: *** [librte_rcu.so.1.1] Error 1
make[4]: *** [librte_rcu] Error 2
make[4]: *** Waiting for unfinished jobs....
  SYMLINK-FILE include/rte_hash.h
  SYMLINK-FILE include/rte_hash_crc.h
  LD librte_acl.so.2.1
  SYMLINK-FILE include/rte_jhash.h
--
  CC power_pstate_cpufreq.o
  LD librte_power.so.1.1
  INSTALL-LIB librte_power.so.1.1
  LD librte_hash.so.2.1
  INSTALL-LIB librte_hash.so.2.1
make[3]: *** [lib] Error 2
make[2]: *** [all] Error 2
make[1]: *** [pre_install] Error 2
make: *** [install] Error 2

DPDK STV team


More information about the test-report mailing list