[dpdk-test-report] |FAILURE| pw58394[15/20] crypto/dpaa2_sec/hw: Support snow-f8

sys_stv at intel.com sys_stv at intel.com
Mon Sep 2 15:09:59 CEST 2019


Test-Label: Intel-compilation
Test-Status: FAILURE
http://dpdk.org/patch/58394

_Compilation issues_

Submitter: Akhil Goyal <akhil.goyal at nxp.com>
Date: 2019-09-02 12:17:29
Reply_mail: 20190902121734.926-16-akhil.goyal at nxp.com
DPDK git baseline: Repo:dpdk-next-crypto, CommitID: e7fd5a3bbe5636e93a66fd5086f182756624c97a

Makefile build Summary: 22 Builds Done, 17 Successful, 5 Failures

Meson build Summary: 7 Builds Done, 3 Successful, 4 Failures

               +==============================================+===========+==========+
               |                   Makefile                   |   Meson   | Document |
+--------------+------+-------+------+------------+-----------+-----------+----------+
| os           | gcc  | clang | icc  | gcc+shared | gcc+debug | gcc/clang | pdf/html |
+--------------+------+-------+------+------------+-----------+-----------+----------+
| RHEL76-64    | pass |       |      |            |           |           |          |
| CENTOS76-64  | pass | FAIL  | pass | pass       | pass      |           |          |
| UB1804-64    | pass | FAIL  | pass |            |           | FAIL      | pass     |
| UB1604-32    | pass |       |      |            |           | FAIL      |          |
| UB1904-64    | pass |       |      |            |           |           |          |
| UB1604-64    | pass | FAIL  |      |            |           |           |          |
| FC30-64      | pass | FAIL  |      |            |           | FAIL      |          |
| WIN10-64     |      |       |      |            |           | pass      |          |
| FreeBSD12-64 | pass | pass  |      | pass       | pass      | pass      |          |
| RHEL80-64    | pass |       |      |            |           |           |          |
| SUSE15-64    | pass | FAIL  |      |            |           | FAIL      |          |
+--------------+------+-------+------+------------+-----------+-----------+----------+

Test environment and configuration as below:

** Makefile build **


OS: RHEL76-64
	Kernel Version: 3.10.0-957.el7.x86_64
	CPU info: Intel(R) Xeon(R) CPU E5-2699 v4 @ 2.20GHz
	GCC Version: gcc (GCC) 4.8.5 20150623 (Red Hat 4.8.5-36)
	Clang Version: NA
	x86_64-native-linuxapp-gcc


OS: CENTOS76-64
	Kernel Version: 3.10.0-957.10.1.el7.x86_64
	CPU info: Intel(R) Xeon(R) CPU E5-2699 v4 @ 2.20GHz
	GCC Version: gcc (GCC) 4.8.5 20150623 (Red Hat 4.8.5-36)
	Clang Version: 3.4.2 (tags/RELEASE_34/dot2-final)
	x86_64-native-linuxapp-clang
	x86_64-native-linuxapp-gcc+debug
	x86_64-native-linuxapp-gcc
	x86_64-native-linuxapp-gcc+shared
	x86_64-native-linuxapp-icc


OS: UB1804-64
	Kernel Version: 4.15.0-20-generic
	CPU info: Intel(R) Xeon(R) CPU E5-2699 v3 @ 2.30GHz
	GCC Version: gcc (Ubuntu 7.3.0-27ubuntu1~18.04) 7.3.0
	Clang Version: 6.0.0-1ubuntu2 (tags/RELEASE_600/final)
	x86_64-native-linuxapp-icc
	x86_64-native-linuxapp-clang
	x86_64-native-linuxapp-gcc


OS: UB1904-64
	Kernel Version: 5.0.0-13-generic
	CPU info: Intel(R) Xeon(R) CPU E5-2699 v3 @ 2.30GHz
	GCC Version: gcc (Ubuntu 8.3.0-6ubuntu1) 8.3.0
	Clang Version: 8.0.0-3 (tags/RELEASE_800/final)
	x86_64-native-linuxapp-gcc


OS: UB1604-32
	Kernel Version: 4.4.0-131-generic
	CPU info: Intel(R) Xeon(R) CPU E5-2699 v3 @ 2.30GHz
	GCC Version: gcc (Ubuntu 5.4.0-6ubuntu1~16.04.11) 5.4.0 20160609
	Clang Version: 3.8.0-2ubuntu4 (tags/RELEASE_380/final)
	i686-native-linuxapp-gcc


OS: UB1604-64
	Kernel Version: 4.4.0-47-generic
	CPU info: Intel(R) Xeon(R) CPU E5-2699 v3 @ 2.30GHz
	GCC Version: gcc (Ubuntu 5.4.0-6ubuntu1~16.04.10) 5.4.0 20160609
	Clang Version: 3.8.0-2ubuntu4 (tags/RELEASE_380/final)
	x86_64-native-linuxapp-clang
	x86_64-native-linuxapp-gcc


OS: FC30-64
	Kernel Version: 5.1.7-300.fc30.x86_64
	CPU info: Intel(R) Xeon(R) CPU E5-2699 v4 @ 2.20GHz
	GCC Version: gcc (GCC) 9.1.1 20190503 (Red Hat 9.1.1-1)
	Clang Version: 8.0.0 (Fedora 8.0.0-1.fc30)
	x86_64-native-linuxapp-gcc
	x86_64-native-linuxapp-clang


OS: FreeBSD12-64
	Kernel Version: 12.0-RC3
	CPU info: Intel(R) Xeon(R) CPU E5-2699 v4 @ 2.20GHz (2194.97-MHz K8-class CPU)
	GCC Version: gcc (FreeBSD Ports Collection) 7.3.0
	Clang Version: 6.0.1 (tags/RELEASE_601/final 335540) (based on LLVM 6.0.1)
	x86_64-native-bsdapp-clang
	x86_64-native-bsdapp-gcc+debug
	x86_64-native-bsdapp-gcc+shared
	x86_64-native-bsdapp-gcc


OS: RHEL80-64
	Kernel Version: 4.18.0-80.el8.x86_64
	CPU info: Intel(R) Xeon(R) CPU E5-2699 v4 @ 2.20GHz
	GCC Version: gcc (GCC) 8.2.1 20180905 (Red Hat 8.2.1-3)
	Clang Version: 6.0.1 (tags/RELEASE_601/final)
	x86_64-native-linuxapp-gcc


OS: SUSE15-64
	Kernel Version: 4.12.14-lp150.11-default
	CPU info: Intel(R) Xeon(R) CPU E5-2699 v4 @ 2.20GHz
	GCC Version: gcc (SUSE Linux) 7.3.1 20180323 [gcc-7-branch revision 258812]
	Clang Version: 5.0.1 (tags/RELEASE_501/final 312548)
	x86_64-native-linuxapp-gcc
	x86_64-native-linuxapp-clang


** Meson build **


OS: UB1804-64
	Kernel Version: 4.15.0-20-generic
	CPU info: Intel(R) Xeon(R) CPU E5-2699 v4 @ 2.20GHz
	GCC Version: gcc (Ubuntu 7.3.0-27ubuntu1~18.04) 7.3.0
	Clang Version: 6.0.0-1ubuntu2 (tags/RELEASE_600/final)
	x86_64-native-linuxapp-doc
	build-gcc-static
	build-gcc-shared
	build-clang-static
	build-clang-shared
	build-x86-default


OS: UB1604-32
	Kernel Version: 4.4.0-131-generic
	CPU info: Intel(R) Xeon(R) CPU E5-2699 v4 @ 2.20GHz
	GCC Version: gcc (Ubuntu 5.4.0-6ubuntu1~16.04.11) 5.4.0 20160609
	Clang Version: 3.8.0-2ubuntu4 (tags/RELEASE_380/final)
	build-gcc-static
	build-gcc-shared
	build-clang-static
	build-clang-shared
	build-x86-default


OS: FC30-64
	Kernel Version: 5.0.9-301.fc30.x86_64
	CPU info: Intel(R) Xeon(R) CPU E5-2699 v4 @ 2.20GHz
	GCC Version: gcc (GCC) 9.1.1 20190503 (Red Hat 9.1.1-1)
	Clang Version: 8.0.0 (Fedora 8.0.0-1.fc30)
	build-gcc-static
	build-gcc-shared
	build-clang-static
	build-clang-shared
	build-x86-default


OS: WIN10-64
	Kernel Version: N/A
	CPU info: N/A
	GCC Version: N/A
	Clang Version: Clang 8.0.0
	x86_64-windows-clang


OS: FreeBSD12-64
	Kernel Version: 12.0-RC3
	CPU info: Intel(R) Xeon(R) CPU E5-2699 v4 @ 2.20GHz (2194.99-MHz K8-class CPU)
	GCC Version: gcc (FreeBSD Ports Collection) 7.3.0
	Clang Version: 6.0.1 (tags/RELEASE_601/final 335540) (based on LLVM 6.0.1)
	build-gcc-static
	build-gcc-shared
	build-clang-static
	build-clang-shared
	build-x86-default


OS: SUSE15-64
	Kernel Version: 4.12.14-lp150.11-default
	CPU info: Intel(R) Xeon(R) CPU E5-2699 v4 @ 2.20GHz
	GCC Version: gcc (SUSE Linux) 7.3.1 20180323 [gcc-7-branch revision 258812]
	Clang Version: 5.0.1 (tags/RELEASE_501/final 312548)
	build-gcc-static
	build-gcc-shared
	build-clang-static
	build-clang-shared
	build-x86-default


*Make Build Failed #1:
OS: UB1604-64
Target: x86_64-native-linuxapp-clang
                                        ~~~~~~~~~~~~^~~~~~~
/tmp/UB1604-64_K4.4.0_Clang3.8.0/x86_64-native-linuxapp-clang/ce7926d9d21c44c29d1531673ff35cea/dpdk/drivers/crypto/dpaa2_sec/dpaa2_sec_dpseci.c:2965:18: error: implicit conversion from enumeration type 'enum rte_security_pdcp_sn_size' to different enumeration type 'enum pdcp_sn_size' [-Werror,-Wenum-conversion]
                                        pdcp_xform->sn_size,
                                        ~~~~~~~~~~~~^~~~~~~
2 errors generated.
/tmp/UB1604-64_K4.4.0_Clang3.8.0/x86_64-native-linuxapp-clang/ce7926d9d21c44c29d1531673ff35cea/dpdk/mk/internal/rte.compile-pre.mk:114: recipe for target 'dpaa2_sec_dpseci.o' failed
make[6]: *** [dpaa2_sec_dpseci.o] Error 1
/tmp/UB1604-64_K4.4.0_Clang3.8.0/x86_64-native-linuxapp-clang/ce7926d9d21c44c29d1531673ff35cea/dpdk/mk/rte.subdir.mk:35: recipe for target 'dpaa2_sec' failed
make[5]: *** [dpaa2_sec] Error 2
make[5]: *** Waiting for unfinished jobs....
  PMDINFO null_crypto_pmd.o.pmd.c
  CC qat_sym.o
  CC null_crypto_pmd.o.pmd.o
  CC otx_cryptodev_capabilities.o
--
  CC rte_eth_bond_pmd.o.pmd.o
  CC sge.o
  LD rte_eth_bond_pmd.o
  AR librte_pmd_octeontx_crypto.a
  INSTALL-LIB librte_pmd_octeontx_crypto.a
/tmp/UB1604-64_K4.4.0_Clang3.8.0/x86_64-native-linuxapp-clang/ce7926d9d21c44c29d1531673ff35cea/dpdk/mk/rte.subdir.mk:35: recipe for target 'crypto' failed
make[4]: *** [crypto] Error 2
make[4]: *** Waiting for unfinished jobs....
  PMDINFO dpaa2_ethdev.o.pmd.c
  CC dpaa2_ethdev.o.pmd.o
  CC rte_eth_bond_args.o
  CC rte_eth_bond_8023ad.o
--
  LD virtio_user_ethdev.o
  AR librte_pmd_virtio.a
  INSTALL-LIB librte_pmd_virtio.a
  AR librte_pmd_softnic.a
  INSTALL-LIB librte_pmd_softnic.a
/tmp/UB1604-64_K4.4.0_Clang3.8.0/x86_64-native-linuxapp-clang/ce7926d9d21c44c29d1531673ff35cea/dpdk/mk/rte.sdkbuild.mk:46: recipe for target 'drivers' failed
make[3]: *** [drivers] Error 2
/tmp/UB1604-64_K4.4.0_Clang3.8.0/x86_64-native-linuxapp-clang/ce7926d9d21c44c29d1531673ff35cea/dpdk/mk/rte.sdkroot.mk:98: recipe for target 'all' failed
make[2]: *** [all] Error 2
/tmp/UB1604-64_K4.4.0_Clang3.8.0/x86_64-native-linuxapp-clang/ce7926d9d21c44c29d1531673ff35cea/dpdk/mk/rte.sdkinstall.mk:60: recipe for target 'pre_install' failed
make[1]: *** [pre_install] Error 2
/tmp/UB1604-64_K4.4.0_Clang3.8.0/x86_64-native-linuxapp-clang/ce7926d9d21c44c29d1531673ff35cea/dpdk/mk/rte.sdkroot.mk:77: recipe for target 'install' failed
make: *** [install] Error 2


*Make Build Failed #2:
OS: UB1804-64
Target: x86_64-native-linuxapp-clang
                                        ~~~~~~~~~~~~^~~~~~~
/tmp/UB1804-64_K4.15.0_Clang6.0.0/x86_64-native-linuxapp-clang/ce7926d9d21c44c29d1531673ff35cea/dpdk/drivers/crypto/dpaa2_sec/dpaa2_sec_dpseci.c:2965:18: error: implicit conversion from enumeration type 'enum rte_security_pdcp_sn_size' to different enumeration type 'enum pdcp_sn_size' [-Werror,-Wenum-conversion]
                                        pdcp_xform->sn_size,
                                        ~~~~~~~~~~~~^~~~~~~
2 errors generated.
/tmp/UB1804-64_K4.15.0_Clang6.0.0/x86_64-native-linuxapp-clang/ce7926d9d21c44c29d1531673ff35cea/dpdk/mk/internal/rte.compile-pre.mk:114: recipe for target 'dpaa2_sec_dpseci.o' failed
make[6]: *** [dpaa2_sec_dpseci.o] Error 1
/tmp/UB1804-64_K4.15.0_Clang6.0.0/x86_64-native-linuxapp-clang/ce7926d9d21c44c29d1531673ff35cea/dpdk/mk/rte.subdir.mk:35: recipe for target 'dpaa2_sec' failed
make[5]: *** [dpaa2_sec] Error 2
make[5]: *** Waiting for unfinished jobs....
  CC null_crypto_pmd_ops.o
  CC cxgbevf_ethdev.o
  SYMLINK-FILE include/rte_pmd_dpaa2.h
  PMDINFO cxgbe_ethdev.o.pmd.c
--
  CC rte_eth_bond_flow.o
  AR librte_pmd_crypto_scheduler.a
  CC sge.o
  INSTALL-LIB librte_pmd_crypto_scheduler.a
== Build drivers/net/failsafe
/tmp/UB1804-64_K4.15.0_Clang6.0.0/x86_64-native-linuxapp-clang/ce7926d9d21c44c29d1531673ff35cea/dpdk/mk/rte.subdir.mk:35: recipe for target 'crypto' failed
make[4]: *** [crypto] Error 2
make[4]: *** Waiting for unfinished jobs....
== Build drivers/net/fm10k
  PMDINFO enetc_ethdev.o.pmd.c
  CC enetc_ethdev.o.pmd.o
  CC e1000_82542.o
--
  CC hunt_nic.o
  CC medford_nic.o
  CC medford2_nic.o
  AR librte_pmd_sfc_efx.a
  INSTALL-LIB librte_pmd_sfc_efx.a
/tmp/UB1804-64_K4.15.0_Clang6.0.0/x86_64-native-linuxapp-clang/ce7926d9d21c44c29d1531673ff35cea/dpdk/mk/rte.sdkbuild.mk:46: recipe for target 'drivers' failed
make[3]: *** [drivers] Error 2
/tmp/UB1804-64_K4.15.0_Clang6.0.0/x86_64-native-linuxapp-clang/ce7926d9d21c44c29d1531673ff35cea/dpdk/mk/rte.sdkroot.mk:98: recipe for target 'all' failed
make[2]: *** [all] Error 2
/tmp/UB1804-64_K4.15.0_Clang6.0.0/x86_64-native-linuxapp-clang/ce7926d9d21c44c29d1531673ff35cea/dpdk/mk/rte.sdkinstall.mk:60: recipe for target 'pre_install' failed
make[1]: *** [pre_install] Error 2
/tmp/UB1804-64_K4.15.0_Clang6.0.0/x86_64-native-linuxapp-clang/ce7926d9d21c44c29d1531673ff35cea/dpdk/mk/rte.sdkroot.mk:77: recipe for target 'install' failed
make: *** [install] Error 2


*Make Build Failed #3:
OS: FC30-64
Target: x86_64-native-linuxapp-clang
/tmp/FC30-64_K4.20_Clang8.0.0/x86_64-native-linuxapp-clang/ce7926d9d21c44c29d1531673ff35cea/dpdk/drivers/crypto/dpaa2_sec/dpaa2_sec_dpseci.c:2965:18: error: implicit conversion from enumeration type 'enum rte_security_pdcp_sn_size' to different enumeration type 'enum pdcp_sn_size' [-Werror,-Wenum-conversion]
                                        pdcp_xform->sn_size,
                                        ~~~~~~~~~~~~^~~~~~~
2 errors generated.
  AR librte_pmd_fpga_lte_fec.a
make[6]: *** [/tmp/FC30-64_K4.20_Clang8.0.0/x86_64-native-linuxapp-clang/ce7926d9d21c44c29d1531673ff35cea/dpdk/mk/internal/rte.compile-pre.mk:114: dpaa2_sec_dpseci.o] Error 1
make[5]: *** [/tmp/FC30-64_K4.20_Clang8.0.0/x86_64-native-linuxapp-clang/ce7926d9d21c44c29d1531673ff35cea/dpdk/mk/rte.subdir.mk:37: dpaa2_sec] Error 2
make[5]: *** Waiting for unfinished jobs....
  CC qat_logs.o
  INSTALL-LIB librte_pmd_fpga_lte_fec.a
  CC qat_qp.o
  CC otx_cryptodev_ops.o
--
  LD rte_eth_bond_pmd.o
  CC mc/dpdmux.o
  CC sge.o
  AR librte_pmd_octeontx_crypto.a
  INSTALL-LIB librte_pmd_octeontx_crypto.a
make[4]: *** [/tmp/FC30-64_K4.20_Clang8.0.0/x86_64-native-linuxapp-clang/ce7926d9d21c44c29d1531673ff35cea/dpdk/mk/rte.subdir.mk:35: crypto] Error 2
make[4]: *** Waiting for unfinished jobs....
  CC rte_eth_bond_8023ad.o
  CC ena_eth_com.o
  CC cxgbe_filter.o
  AR librte_pmd_dpaa2.a
--
  CC hunt_nic.o
  CC medford_nic.o
  CC medford2_nic.o
  AR librte_pmd_sfc_efx.a
  INSTALL-LIB librte_pmd_sfc_efx.a
make[3]: *** [/tmp/FC30-64_K4.20_Clang8.0.0/x86_64-native-linuxapp-clang/ce7926d9d21c44c29d1531673ff35cea/dpdk/mk/rte.sdkbuild.mk:46: drivers] Error 2
make[2]: *** [/tmp/FC30-64_K4.20_Clang8.0.0/x86_64-native-linuxapp-clang/ce7926d9d21c44c29d1531673ff35cea/dpdk/mk/rte.sdkroot.mk:99: all] Error 2
make[1]: *** [/tmp/FC30-64_K4.20_Clang8.0.0/x86_64-native-linuxapp-clang/ce7926d9d21c44c29d1531673ff35cea/dpdk/mk/rte.sdkinstall.mk:61: pre_install] Error 2
make: *** [/tmp/FC30-64_K4.20_Clang8.0.0/x86_64-native-linuxapp-clang/ce7926d9d21c44c29d1531673ff35cea/dpdk/mk/rte.sdkroot.mk:77: install] Error 2


*Make Build Failed #4:
OS: SUSE15-64
Target: x86_64-native-linuxapp-clang
                                        ~~~~~~~~~~~~^~~~~~~
/tmp/SUSE15-64_K4.12.14_Clang5.0.1/x86_64-native-linuxapp-clang/ce7926d9d21c44c29d1531673ff35cea/dpdk/drivers/crypto/dpaa2_sec/dpaa2_sec_dpseci.c:2965:18: error: implicit conversion from enumeration type 'enum rte_security_pdcp_sn_size' to different enumeration type 'enum pdcp_sn_size' [-Werror,-Wenum-conversion]
                                        pdcp_xform->sn_size,
                                        ~~~~~~~~~~~~^~~~~~~
2 errors generated.
make[6]: *** [/tmp/SUSE15-64_K4.12.14_Clang5.0.1/x86_64-native-linuxapp-clang/ce7926d9d21c44c29d1531673ff35cea/dpdk/mk/internal/rte.compile-pre.mk:114: dpaa2_sec_dpseci.o] Error 1
make[5]: *** [/tmp/SUSE15-64_K4.12.14_Clang5.0.1/x86_64-native-linuxapp-clang/ce7926d9d21c44c29d1531673ff35cea/dpdk/mk/rte.subdir.mk:37: dpaa2_sec] Error 2
make[5]: *** Waiting for unfinished jobs....
  CC rte_eth_bond_8023ad.o
  CC caam_jr.o
  CC rte_eth_bond_alb.o
  PMDINFO rte_eth_bond_pmd.o.pmd.c
--
  PMDINFO failsafe.o.pmd.c
  CC failsafe.o.pmd.o
  AR librte_pmd_caam_jr.a
  LD failsafe.o
  INSTALL-LIB librte_pmd_caam_jr.a
make[4]: *** [/tmp/SUSE15-64_K4.12.14_Clang5.0.1/x86_64-native-linuxapp-clang/ce7926d9d21c44c29d1531673ff35cea/dpdk/mk/rte.subdir.mk:35: crypto] Error 2
make[4]: *** Waiting for unfinished jobs....
  CC e1000_82571.o
  CC enic_main.o
  CC failsafe_args.o
  CC dpaa2_ethdev.o
--
  CC hunt_nic.o
  CC medford_nic.o
  CC medford2_nic.o
  AR librte_pmd_sfc_efx.a
  INSTALL-LIB librte_pmd_sfc_efx.a
make[3]: *** [/tmp/SUSE15-64_K4.12.14_Clang5.0.1/x86_64-native-linuxapp-clang/ce7926d9d21c44c29d1531673ff35cea/dpdk/mk/rte.sdkbuild.mk:46: drivers] Error 2
make[2]: *** [/tmp/SUSE15-64_K4.12.14_Clang5.0.1/x86_64-native-linuxapp-clang/ce7926d9d21c44c29d1531673ff35cea/dpdk/mk/rte.sdkroot.mk:99: all] Error 2
make[1]: *** [/tmp/SUSE15-64_K4.12.14_Clang5.0.1/x86_64-native-linuxapp-clang/ce7926d9d21c44c29d1531673ff35cea/dpdk/mk/rte.sdkinstall.mk:61: pre_install] Error 2
make: *** [/tmp/SUSE15-64_K4.12.14_Clang5.0.1/x86_64-native-linuxapp-clang/ce7926d9d21c44c29d1531673ff35cea/dpdk/mk/rte.sdkroot.mk:77: install] Error 2


*Make Build Failed #5:
OS: CENTOS76-64
Target: x86_64-native-linuxapp-clang
                                        ~~~~~~~~~~~~^~~~~~~
/tmp/CENTOS76-64_K3.10.0_Clang3.4.2/x86_64-native-linuxapp-clang/ce7926d9d21c44c29d1531673ff35cea/dpdk/drivers/crypto/dpaa2_sec/dpaa2_sec_dpseci.c:2965:18: error: implicit conversion from enumeration type 'enum rte_security_pdcp_sn_size' to different enumeration type 'enum pdcp_sn_size' [-Werror,-Wenum-conversion]
                                        pdcp_xform->sn_size,
                                        ~~~~~~~~~~~~^~~~~~~
2 errors generated.
make[6]: *** [dpaa2_sec_dpseci.o] Error 1
make[5]: *** [dpaa2_sec] Error 2
make[5]: *** Waiting for unfinished jobs....
  CC rte_eth_bond_api.o
  CC rte_eth_bond_pmd.o
  CC scheduler_failover.o
  CC rte_eth_bond_args.o
--
== Build drivers/net/enetc
  CC ena_ethdev.o
  AR librte_pmd_dpaa_sec.a
  INSTALL-LIB librte_pmd_dpaa_sec.a
  CC elink.o
make[4]: *** [crypto] Error 2
make[4]: *** Waiting for unfinished jobs....
  CC e1000_82541.o
== Build drivers/net/enic
  CC dpaa2_rxtx.o
  CC cxgbe_filter.o
--
  CC medford2_nic.o
  AR librte_pmd_softnic.a
  INSTALL-LIB librte_pmd_softnic.a
  AR librte_pmd_sfc_efx.a
  INSTALL-LIB librte_pmd_sfc_efx.a
make[3]: *** [drivers] Error 2
make[2]: *** [all] Error 2
make[1]: *** [pre_install] Error 2
make: *** [install] Error 2

*Meson Build Failed #1:
OS: SUSE15-64
Target:build-gcc-static
[1206/1831] Linking static target drivers/libtmp_rte_pmd_caam_jr.a.
[1207/1831] Compiling C object 'drivers/a715181@@tmp_rte_pmd_ccp at sta/crypto_ccp_ccp_pmd_ops.c.o'.
[1208/1831] Generating rte_pmd_caam_jr.pmd.c with a custom command.
[1209/1831] Compiling C object 'drivers/a715181@@tmp_rte_pmd_ccp at sta/crypto_ccp_rte_ccp_pmd.c.o'.
[1210/1831] Compiling C object 'drivers/a715181@@tmp_rte_pmd_dpaa2_sec at sta/crypto_dpaa2_sec_dpaa2_sec_dpseci.c.o'.
FAILED: drivers/a715181@@tmp_rte_pmd_dpaa2_sec at sta/crypto_dpaa2_sec_dpaa2_sec_dpseci.c.o 
clang -Idrivers/a715181@@tmp_rte_pmd_dpaa2_sec at sta -Idrivers -I../drivers -Idrivers/crypto/dpaa2_sec -I../drivers/crypto/dpaa2_sec -I../drivers/crypto/dpaa2_sec/mc -I../drivers/crypto/dpaa2_sec/hw -Ilib/librte_cryptodev -I../lib/librte_cryptodev -I. -I../ -Iconfig -I../config -Ilib/librte_eal/common/include -I../lib/librte_eal/common/include -I../lib/librte_eal/linux/eal/include -Ilib/librte_eal/common -I../lib/librte_eal/common -Ilib/librte_eal/common/include/arch/x86 -I../lib/librte_eal/common/include/arch/x86 -Ilib/librte_eal -I../lib/librte_eal -Ilib/librte_kvargs -I../lib/librte_kvargs -Ilib/librte_mbuf -I../lib/librte_mbuf -Ilib/librte_mempool -I../lib/librte_mempool -Ilib/librte_ring -I../lib/librte_ring -Ilib/librte_security -I../lib/librte_security -Idrivers/mempool/dpaa2 -I../drivers/mempool/dpaa2 -Idrivers/bus/fslmc -I../drivers/bus/fslmc -I../drivers/bus/fslmc/mc -I../drivers/bus/fslmc/qbman/include -I../drivers/bus/fslmc/portal -Idrivers/common/dpaax -I../drivers/common/dpaax -Ilib/librte_eventdev -I../lib/librte_eventdev -Ilib/librte_ethdev -I../lib/librte_ethdev -Ilib/librte_net -I../lib/librte_net -Ilib/librte_meter -I../lib/librte_meter -Ilib/librte_hash -I../lib/librte_hash -Ilib/librte_timer -I../lib/librte_timer -Xclang -fcolor-diagnostics -pipe -D_FILE_OFFSET_BITS=64 -Wall -Winvalid-pch -Werror -O3 -include rte_config.h -Wunused-parameter -Wsign-compare -Wcast-qual -Wno-address-of-packed-member -D_GNU_SOURCE -fPIC -march=native -DALLOW_EXPERIMENTAL_API -MD -MQ 'drivers/a715181@@tmp_rte_pmd_dpaa2_sec at sta/crypto_dpaa2_sec_dpaa2_sec_dpseci.c.o' -MF 'drivers/a715181@@tmp_rte_pmd_dpaa2_sec at sta/crypto_dpaa2_sec_dpaa2_sec_dpseci.c.o.d' -o 'drivers/a715181@@tmp_rte_pmd_dpaa2_sec at sta/crypto_dpaa2_sec_dpaa2_sec_dpseci.c.o' -c ../drivers/crypto/dpaa2_sec/dpaa2_sec_dpseci.c
../drivers/crypto/dpaa2_sec/dpaa2_sec_dpseci.c:2955:18: error: implicit conversion from enumeration type 'enum rte_security_pdcp_sn_size' to different enumeration type 'enum pdcp_sn_size' [-Werror,-Wenum-conversion]
                                        pdcp_xform->sn_size,
                                        ~~~~~~~~~~~~^~~~~~~
../drivers/crypto/dpaa2_sec/dpaa2_sec_dpseci.c:2965:18: error: implicit conversion from enumeration type 'enum rte_security_pdcp_sn_size' to different enumeration type 'enum pdcp_sn_size' [-Werror,-Wenum-conversion]
--
[1213/1831] Compiling C object 'drivers/a715181@@tmp_rte_pmd_null_crypto at sta/crypto_null_null_crypto_pmd_ops.c.o'.
[1214/1831] Compiling C object 'drivers/a715181@@tmp_rte_pmd_octeontx_crypto at sta/crypto_octeontx_otx_cryptodev.c.o'.
[1215/1831] Compiling C object 'drivers/a715181@@tmp_rte_pmd_octeontx_crypto at sta/crypto_octeontx_otx_cryptodev_capabilities.c.o'.
[1216/1831] Compiling C object 'drivers/a715181@@tmp_rte_pmd_ccp at sta/crypto_ccp_ccp_crypto.c.o'.
[1217/1831] Compiling C object 'drivers/a715181@@tmp_rte_pmd_dpaa_sec at sta/crypto_dpaa_sec_dpaa_sec.c.o'.
ninja: build stopped: subcommand failed.
meson --werror -Dexamples=all --default-library=shared /tmp/SUSE15-64_K4.12.14_GCC7.3.1/x86_64-native-linuxapp-gcc/ce7926d9d21c44c29d1531673ff35cea/dpdk/devtools/.. build-clang-shared
The Meson build system
Version: 0.50.1
Source dir: /tmp/SUSE15-64_K4.12.14_GCC7.3.1/x86_64-native-linuxapp-gcc/ce7926d9d21c44c29d1531673ff35cea/dpdk
Build dir: /tmp/SUSE15-64_K4.12.14_GCC7.3.1/x86_64-native-linuxapp-gcc/ce7926d9d21c44c29d1531673ff35cea/dpdk/build-clang-shared
--
[1233/1855] Linking target drivers/librte_pmd_aesni_mb.so.1.1.
[1234/1855] Compiling C object 'drivers/a715181@@tmp_rte_pmd_ccp at sta/crypto_ccp_rte_ccp_pmd.c.o'.
[1235/1855] Compiling C object 'drivers/a715181@@tmp_rte_pmd_ccp at sta/crypto_ccp_ccp_pmd_ops.c.o'.
[1236/1855] Compiling C object 'drivers/a715181@@tmp_rte_pmd_null_crypto at sta/crypto_null_null_crypto_pmd_ops.c.o'.
[1237/1855] Compiling C object 'drivers/a715181@@tmp_rte_pmd_dpaa2_sec at sta/crypto_dpaa2_sec_dpaa2_sec_dpseci.c.o'.
FAILED: drivers/a715181@@tmp_rte_pmd_dpaa2_sec at sta/crypto_dpaa2_sec_dpaa2_sec_dpseci.c.o 
clang -Idrivers/a715181@@tmp_rte_pmd_dpaa2_sec at sta -Idrivers -I../drivers -Idrivers/crypto/dpaa2_sec -I../drivers/crypto/dpaa2_sec -I../drivers/crypto/dpaa2_sec/mc -I../drivers/crypto/dpaa2_sec/hw -Ilib/librte_cryptodev -I../lib/librte_cryptodev -I. -I../ -Iconfig -I../config -Ilib/librte_eal/common/include -I../lib/librte_eal/common/include -I../lib/librte_eal/linux/eal/include -Ilib/librte_eal/common -I../lib/librte_eal/common -Ilib/librte_eal/common/include/arch/x86 -I../lib/librte_eal/common/include/arch/x86 -Ilib/librte_eal -I../lib/librte_eal -Ilib/librte_kvargs -I../lib/librte_kvargs -Ilib/librte_mbuf -I../lib/librte_mbuf -Ilib/librte_mempool -I../lib/librte_mempool -Ilib/librte_ring -I../lib/librte_ring -Ilib/librte_security -I../lib/librte_security -Idrivers/mempool/dpaa2 -I../drivers/mempool/dpaa2 -Idrivers/bus/fslmc -I../drivers/bus/fslmc -I../drivers/bus/fslmc/mc -I../drivers/bus/fslmc/qbman/include -I../drivers/bus/fslmc/portal -Idrivers/common/dpaax -I../drivers/common/dpaax -Ilib/librte_eventdev -I../lib/librte_eventdev -Ilib/librte_ethdev -I../lib/librte_ethdev -Ilib/librte_net -I../lib/librte_net -Ilib/librte_meter -I../lib/librte_meter -Ilib/librte_hash -I../lib/librte_hash -Ilib/librte_timer -I../lib/librte_timer -Xclang -fcolor-diagnostics -pipe -D_FILE_OFFSET_BITS=64 -Wall -Winvalid-pch -Werror -O3 -include rte_config.h -Wunused-parameter -Wsign-compare -Wcast-qual -Wno-address-of-packed-member -D_GNU_SOURCE -fPIC -march=native -DALLOW_EXPERIMENTAL_API -MD -MQ 'drivers/a715181@@tmp_rte_pmd_dpaa2_sec at sta/crypto_dpaa2_sec_dpaa2_sec_dpseci.c.o' -MF 'drivers/a715181@@tmp_rte_pmd_dpaa2_sec at sta/crypto_dpaa2_sec_dpaa2_sec_dpseci.c.o.d' -o 'drivers/a715181@@tmp_rte_pmd_dpaa2_sec at sta/crypto_dpaa2_sec_dpaa2_sec_dpseci.c.o' -c ../drivers/crypto/dpaa2_sec/dpaa2_sec_dpseci.c
../drivers/crypto/dpaa2_sec/dpaa2_sec_dpseci.c:2955:18: error: implicit conversion from enumeration type 'enum rte_security_pdcp_sn_size' to different enumeration type 'enum pdcp_sn_size' [-Werror,-Wenum-conversion]
                                        pdcp_xform->sn_size,
                                        ~~~~~~~~~~~~^~~~~~~
../drivers/crypto/dpaa2_sec/dpaa2_sec_dpseci.c:2965:18: error: implicit conversion from enumeration type 'enum rte_security_pdcp_sn_size' to different enumeration type 'enum pdcp_sn_size' [-Werror,-Wenum-conversion]
--
[1240/1855] Compiling C object 'drivers/a715181@@tmp_rte_pmd_octeontx_crypto at sta/crypto_octeontx_otx_cryptodev.c.o'.
[1241/1855] Compiling C object 'drivers/a715181@@tmp_rte_pmd_caam_jr at sta/crypto_caam_jr_caam_jr.c.o'.
[1242/1855] Compiling C object 'drivers/a715181@@tmp_rte_pmd_octeontx_crypto at sta/crypto_octeontx_otx_cryptodev_hw_access.c.o'.
[1243/1855] Compiling C object 'drivers/a715181@@tmp_rte_pmd_dpaa_sec at sta/crypto_dpaa_sec_dpaa_sec.c.o'.
[1244/1855] Compiling C object 'drivers/a715181@@tmp_rte_pmd_ccp at sta/crypto_ccp_ccp_crypto.c.o'.
ninja: build stopped: subcommand failed.
meson --werror -Dexamples=all -Dlibdir=lib -Dmachine=nehalem --default-library=shared /tmp/SUSE15-64_K4.12.14_GCC7.3.1/x86_64-native-linuxapp-gcc/ce7926d9d21c44c29d1531673ff35cea/dpdk/devtools/.. build-x86-default
The Meson build system
Version: 0.50.1
Source dir: /tmp/SUSE15-64_K4.12.14_GCC7.3.1/x86_64-native-linuxapp-gcc/ce7926d9d21c44c29d1531673ff35cea/dpdk
Build dir: /tmp/SUSE15-64_K4.12.14_GCC7.3.1/x86_64-native-linuxapp-gcc/ce7926d9d21c44c29d1531673ff35cea/dpdk/build-x86-default


*Meson Build Failed #2:
OS: FC30-64
Target:build-gcc-static
[1187/1784] Compiling C object 'drivers/a715181@@tmp_rte_pmd_octeontx_crypto at sta/crypto_octeontx_otx_cryptodev_capabilities.c.o'.
[1188/1784] Compiling C object 'drivers/a715181@@tmp_rte_pmd_octeontx_crypto at sta/crypto_octeontx_otx_cryptodev.c.o'.
[1189/1784] Compiling C object 'drivers/a715181@@tmp_rte_pmd_null_crypto at sta/crypto_null_null_crypto_pmd.c.o'.
[1190/1784] Compiling C object 'drivers/a715181@@tmp_rte_pmd_null_crypto at sta/crypto_null_null_crypto_pmd_ops.c.o'.
[1191/1784] Compiling C object 'drivers/a715181@@tmp_rte_pmd_dpaa2_sec at sta/crypto_dpaa2_sec_dpaa2_sec_dpseci.c.o'.
FAILED: drivers/a715181@@tmp_rte_pmd_dpaa2_sec at sta/crypto_dpaa2_sec_dpaa2_sec_dpseci.c.o 
clang -Idrivers/a715181@@tmp_rte_pmd_dpaa2_sec at sta -Idrivers -I../drivers -Idrivers/crypto/dpaa2_sec -I../drivers/crypto/dpaa2_sec -I../drivers/crypto/dpaa2_sec/mc -I../drivers/crypto/dpaa2_sec/hw -Ilib/librte_cryptodev -I../lib/librte_cryptodev -I. -I../ -Iconfig -I../config -Ilib/librte_eal/common/include -I../lib/librte_eal/common/include -I../lib/librte_eal/linux/eal/include -Ilib/librte_eal/common -I../lib/librte_eal/common -Ilib/librte_eal/common/include/arch/x86 -I../lib/librte_eal/common/include/arch/x86 -Ilib/librte_eal -I../lib/librte_eal -Ilib/librte_kvargs -I../lib/librte_kvargs -Ilib/librte_mbuf -I../lib/librte_mbuf -Ilib/librte_mempool -I../lib/librte_mempool -Ilib/librte_ring -I../lib/librte_ring -Ilib/librte_security -I../lib/librte_security -Idrivers/mempool/dpaa2 -I../drivers/mempool/dpaa2 -Idrivers/bus/fslmc -I../drivers/bus/fslmc -I../drivers/bus/fslmc/mc -I../drivers/bus/fslmc/qbman/include -I../drivers/bus/fslmc/portal -Idrivers/common/dpaax -I../drivers/common/dpaax -Ilib/librte_eventdev -I../lib/librte_eventdev -Ilib/librte_ethdev -I../lib/librte_ethdev -Ilib/librte_net -I../lib/librte_net -Ilib/librte_meter -I../lib/librte_meter -Ilib/librte_hash -I../lib/librte_hash -Ilib/librte_timer -I../lib/librte_timer -Xclang -fcolor-diagnostics -pipe -D_FILE_OFFSET_BITS=64 -Wall -Winvalid-pch -Werror -O3 -include rte_config.h -Wunused-parameter -Wsign-compare -Wcast-qual -Wno-address-of-packed-member -D_GNU_SOURCE -fPIC -march=native -mno-avx512f -DALLOW_EXPERIMENTAL_API -MD -MQ 'drivers/a715181@@tmp_rte_pmd_dpaa2_sec at sta/crypto_dpaa2_sec_dpaa2_sec_dpseci.c.o' -MF 'drivers/a715181@@tmp_rte_pmd_dpaa2_sec at sta/crypto_dpaa2_sec_dpaa2_sec_dpseci.c.o.d' -o 'drivers/a715181@@tmp_rte_pmd_dpaa2_sec at sta/crypto_dpaa2_sec_dpaa2_sec_dpseci.c.o' -c ../drivers/crypto/dpaa2_sec/dpaa2_sec_dpseci.c
../drivers/crypto/dpaa2_sec/dpaa2_sec_dpseci.c:2955:18: error: implicit conversion from enumeration type 'enum rte_security_pdcp_sn_size' to different enumeration type 'enum pdcp_sn_size' [-Werror,-Wenum-conversion]
                                        pdcp_xform->sn_size,
                                        ~~~~~~~~~~~~^~~~~~~
../drivers/crypto/dpaa2_sec/dpaa2_sec_dpseci.c:2965:18: error: implicit conversion from enumeration type 'enum rte_security_pdcp_sn_size' to different enumeration type 'enum pdcp_sn_size' [-Werror,-Wenum-conversion]
--
[1194/1784] Compiling C object 'drivers/a715181@@tmp_rte_pmd_octeontx_crypto at sta/crypto_octeontx_otx_cryptodev_mbox.c.o'.
[1195/1784] Compiling C object 'drivers/a715181@@tmp_rte_pmd_crypto_scheduler at sta/crypto_scheduler_rte_cryptodev_scheduler.c.o'.
[1196/1784] Compiling C object 'drivers/a715181@@tmp_rte_pmd_caam_jr at sta/crypto_caam_jr_caam_jr.c.o'.
[1197/1784] Compiling C object 'drivers/a715181@@tmp_rte_pmd_dpaa_sec at sta/crypto_dpaa_sec_dpaa_sec.c.o'.
[1198/1784] Compiling C object 'drivers/a715181@@tmp_rte_pmd_octeontx_crypto at sta/crypto_octeontx_otx_cryptodev_ops.c.o'.
ninja: build stopped: subcommand failed.
meson --werror -Dexamples=all --default-library=shared /tmp/FC30-64_K4.20_GCC9.1.1/x86_64-native-linuxapp-gcc/ce7926d9d21c44c29d1531673ff35cea/dpdk/devtools/.. build-clang-shared
The Meson build system
Version: 0.50.1
Source dir: /tmp/FC30-64_K4.20_GCC9.1.1/x86_64-native-linuxapp-gcc/ce7926d9d21c44c29d1531673ff35cea/dpdk
Build dir: /tmp/FC30-64_K4.20_GCC9.1.1/x86_64-native-linuxapp-gcc/ce7926d9d21c44c29d1531673ff35cea/dpdk/build-clang-shared
--
[1206/1808] Compiling C object 'drivers/a715181@@rte_pmd_vmxnet3 at sha/meson-generated_.._rte_pmd_vmxnet3.pmd.c.o'.
[1207/1808] Linking static target drivers/librte_pmd_vmxnet3.a.
[1208/1808] Compiling C object 'drivers/a715181@@tmp_rte_pmd_caam_jr at sta/crypto_caam_jr_caam_jr_uio.c.o'.
[1209/1808] Linking target drivers/librte_pmd_vmxnet3.so.1.1.
[1210/1808] Compiling C object 'drivers/a715181@@tmp_rte_pmd_dpaa2_sec at sta/crypto_dpaa2_sec_dpaa2_sec_dpseci.c.o'.
FAILED: drivers/a715181@@tmp_rte_pmd_dpaa2_sec at sta/crypto_dpaa2_sec_dpaa2_sec_dpseci.c.o 
clang -Idrivers/a715181@@tmp_rte_pmd_dpaa2_sec at sta -Idrivers -I../drivers -Idrivers/crypto/dpaa2_sec -I../drivers/crypto/dpaa2_sec -I../drivers/crypto/dpaa2_sec/mc -I../drivers/crypto/dpaa2_sec/hw -Ilib/librte_cryptodev -I../lib/librte_cryptodev -I. -I../ -Iconfig -I../config -Ilib/librte_eal/common/include -I../lib/librte_eal/common/include -I../lib/librte_eal/linux/eal/include -Ilib/librte_eal/common -I../lib/librte_eal/common -Ilib/librte_eal/common/include/arch/x86 -I../lib/librte_eal/common/include/arch/x86 -Ilib/librte_eal -I../lib/librte_eal -Ilib/librte_kvargs -I../lib/librte_kvargs -Ilib/librte_mbuf -I../lib/librte_mbuf -Ilib/librte_mempool -I../lib/librte_mempool -Ilib/librte_ring -I../lib/librte_ring -Ilib/librte_security -I../lib/librte_security -Idrivers/mempool/dpaa2 -I../drivers/mempool/dpaa2 -Idrivers/bus/fslmc -I../drivers/bus/fslmc -I../drivers/bus/fslmc/mc -I../drivers/bus/fslmc/qbman/include -I../drivers/bus/fslmc/portal -Idrivers/common/dpaax -I../drivers/common/dpaax -Ilib/librte_eventdev -I../lib/librte_eventdev -Ilib/librte_ethdev -I../lib/librte_ethdev -Ilib/librte_net -I../lib/librte_net -Ilib/librte_meter -I../lib/librte_meter -Ilib/librte_hash -I../lib/librte_hash -Ilib/librte_timer -I../lib/librte_timer -Xclang -fcolor-diagnostics -pipe -D_FILE_OFFSET_BITS=64 -Wall -Winvalid-pch -Werror -O3 -include rte_config.h -Wunused-parameter -Wsign-compare -Wcast-qual -Wno-address-of-packed-member -D_GNU_SOURCE -fPIC -march=native -mno-avx512f -DALLOW_EXPERIMENTAL_API -MD -MQ 'drivers/a715181@@tmp_rte_pmd_dpaa2_sec at sta/crypto_dpaa2_sec_dpaa2_sec_dpseci.c.o' -MF 'drivers/a715181@@tmp_rte_pmd_dpaa2_sec at sta/crypto_dpaa2_sec_dpaa2_sec_dpseci.c.o.d' -o 'drivers/a715181@@tmp_rte_pmd_dpaa2_sec at sta/crypto_dpaa2_sec_dpaa2_sec_dpseci.c.o' -c ../drivers/crypto/dpaa2_sec/dpaa2_sec_dpseci.c
../drivers/crypto/dpaa2_sec/dpaa2_sec_dpseci.c:2955:18: error: implicit conversion from enumeration type 'enum rte_security_pdcp_sn_size' to different enumeration type 'enum pdcp_sn_size' [-Werror,-Wenum-conversion]
                                        pdcp_xform->sn_size,
                                        ~~~~~~~~~~~~^~~~~~~
../drivers/crypto/dpaa2_sec/dpaa2_sec_dpseci.c:2965:18: error: implicit conversion from enumeration type 'enum rte_security_pdcp_sn_size' to different enumeration type 'enum pdcp_sn_size' [-Werror,-Wenum-conversion]
--
[1213/1808] Compiling C object 'drivers/a715181@@tmp_rte_pmd_null_crypto at sta/crypto_null_null_crypto_pmd_ops.c.o'.
[1214/1808] Compiling C object 'drivers/a715181@@tmp_rte_pmd_octeontx_crypto at sta/crypto_octeontx_otx_cryptodev_hw_access.c.o'.
[1215/1808] Compiling C object 'drivers/a715181@@tmp_rte_pmd_octeontx_crypto at sta/crypto_octeontx_otx_cryptodev.c.o'.
[1216/1808] Compiling C object 'drivers/a715181@@tmp_rte_pmd_caam_jr at sta/crypto_caam_jr_caam_jr.c.o'.
[1217/1808] Compiling C object 'drivers/a715181@@tmp_rte_pmd_dpaa_sec at sta/crypto_dpaa_sec_dpaa_sec.c.o'.
ninja: build stopped: subcommand failed.
meson --werror -Dexamples=all -Dlibdir=lib -Dmachine=nehalem --default-library=shared /tmp/FC30-64_K4.20_GCC9.1.1/x86_64-native-linuxapp-gcc/ce7926d9d21c44c29d1531673ff35cea/dpdk/devtools/.. build-x86-default
The Meson build system
Version: 0.50.1
Source dir: /tmp/FC30-64_K4.20_GCC9.1.1/x86_64-native-linuxapp-gcc/ce7926d9d21c44c29d1531673ff35cea/dpdk
Build dir: /tmp/FC30-64_K4.20_GCC9.1.1/x86_64-native-linuxapp-gcc/ce7926d9d21c44c29d1531673ff35cea/dpdk/build-x86-default


*Meson Build Failed #3:
OS: UB1604-32
Target:build-gcc-static
[1056/1656] Compiling C object 'drivers/a715181@@rte_pmd_vmxnet3 at sha/meson-generated_.._rte_pmd_vmxnet3.pmd.c.o'.
[1057/1656] Compiling C object 'drivers/a715181@@tmp_rte_pmd_dpaa2_sec at sta/crypto_dpaa2_sec_mc_dpseci.c.o'.
[1058/1656] Generating rte_pmd_virtio.pmd.c with a custom command.
[1059/1656] Linking static target drivers/librte_pmd_vmxnet3.a.
[1060/1656] Compiling C object 'drivers/a715181@@tmp_rte_pmd_dpaa2_sec at sta/crypto_dpaa2_sec_dpaa2_sec_dpseci.c.o'.
FAILED: drivers/a715181@@tmp_rte_pmd_dpaa2_sec at sta/crypto_dpaa2_sec_dpaa2_sec_dpseci.c.o 
clang -Idrivers/a715181@@tmp_rte_pmd_dpaa2_sec at sta -Idrivers -I../drivers -Idrivers/crypto/dpaa2_sec -I../drivers/crypto/dpaa2_sec -I../drivers/crypto/dpaa2_sec/mc -I../drivers/crypto/dpaa2_sec/hw -Ilib/librte_cryptodev -I../lib/librte_cryptodev -I. -I../ -Iconfig -I../config -Ilib/librte_eal/common/include -I../lib/librte_eal/common/include -I../lib/librte_eal/linux/eal/include -Ilib/librte_eal/common -I../lib/librte_eal/common -Ilib/librte_eal/common/include/arch/x86 -I../lib/librte_eal/common/include/arch/x86 -Ilib/librte_eal -I../lib/librte_eal -Ilib/librte_kvargs -I../lib/librte_kvargs -Ilib/librte_mbuf -I../lib/librte_mbuf -Ilib/librte_mempool -I../lib/librte_mempool -Ilib/librte_ring -I../lib/librte_ring -Ilib/librte_security -I../lib/librte_security -Idrivers/mempool/dpaa2 -I../drivers/mempool/dpaa2 -Idrivers/bus/fslmc -I../drivers/bus/fslmc -I../drivers/bus/fslmc/mc -I../drivers/bus/fslmc/qbman/include -I../drivers/bus/fslmc/portal -Idrivers/common/dpaax -I../drivers/common/dpaax -Ilib/librte_eventdev -I../lib/librte_eventdev -Ilib/librte_ethdev -I../lib/librte_ethdev -Ilib/librte_net -I../lib/librte_net -Ilib/librte_meter -I../lib/librte_meter -Ilib/librte_hash -I../lib/librte_hash -Ilib/librte_timer -I../lib/librte_timer -Xclang -fcolor-diagnostics -pipe -D_FILE_OFFSET_BITS=64 -Wall -Winvalid-pch -Werror -O3 -include rte_config.h -Wunused-parameter -Wsign-compare -Wcast-qual -Wno-pointer-to-int-cast -D_GNU_SOURCE -fPIC -march=native -DALLOW_EXPERIMENTAL_API -MD -MQ 'drivers/a715181@@tmp_rte_pmd_dpaa2_sec at sta/crypto_dpaa2_sec_dpaa2_sec_dpseci.c.o' -MF 'drivers/a715181@@tmp_rte_pmd_dpaa2_sec at sta/crypto_dpaa2_sec_dpaa2_sec_dpseci.c.o.d' -o 'drivers/a715181@@tmp_rte_pmd_dpaa2_sec at sta/crypto_dpaa2_sec_dpaa2_sec_dpseci.c.o' -c ../drivers/crypto/dpaa2_sec/dpaa2_sec_dpseci.c
../drivers/crypto/dpaa2_sec/dpaa2_sec_dpseci.c:2955:18: error: implicit conversion from enumeration type 'enum rte_security_pdcp_sn_size' to different enumeration type 'enum pdcp_sn_size' [-Werror,-Wenum-conversion]
                                        pdcp_xform->sn_size,
                                        ~~~~~~~~~~~~^~~~~~~
../drivers/crypto/dpaa2_sec/dpaa2_sec_dpseci.c:2965:18: error: implicit conversion from enumeration type 'enum rte_security_pdcp_sn_size' to different enumeration type 'enum pdcp_sn_size' [-Werror,-Wenum-conversion]
--
[1061/1656] Linking target drivers/librte_pmd_vmxnet3.so.1.1.
[1062/1656] Compiling C object 'drivers/a715181@@rte_pmd_virtio at sha/meson-generated_.._rte_pmd_virtio.pmd.c.o'.
[1063/1656] Compiling C object 'drivers/a715181@@rte_pmd_virtio at sta/meson-generated_.._rte_pmd_virtio.pmd.c.o'.
[1064/1656] Compiling C object 'drivers/a715181@@tmp_rte_pmd_caam_jr at sta/crypto_caam_jr_caam_jr.c.o'.
[1065/1656] Compiling C object 'drivers/a715181@@tmp_rte_pmd_dpaa_sec at sta/crypto_dpaa_sec_dpaa_sec.c.o'.
ninja: build stopped: subcommand failed.
meson --werror -Dexamples=all --default-library=shared /tmp/UB1604-32_K4.4.0_GCC5.4.0/i686-native-linuxapp-gcc/ce7926d9d21c44c29d1531673ff35cea/dpdk/devtools/.. build-clang-shared
The Meson build system
Version: 0.50.1
Source dir: /tmp/UB1604-32_K4.4.0_GCC5.4.0/i686-native-linuxapp-gcc/ce7926d9d21c44c29d1531673ff35cea/dpdk
Build dir: /tmp/UB1604-32_K4.4.0_GCC5.4.0/i686-native-linuxapp-gcc/ce7926d9d21c44c29d1531673ff35cea/dpdk/build-clang-shared
--
[1086/1680] Linking static target drivers/librte_pmd_vmxnet3.a.
[1087/1680] Compiling C object 'drivers/a715181@@rte_pmd_vmxnet3 at sha/meson-generated_.._rte_pmd_vmxnet3.pmd.c.o'.
[1088/1680] Linking target drivers/librte_pmd_vmxnet3.so.1.1.
[1089/1680] Compiling C object 'drivers/a715181@@tmp_rte_pmd_null_crypto at sta/crypto_null_null_crypto_pmd.c.o'.
[1090/1680] Compiling C object 'drivers/a715181@@tmp_rte_pmd_dpaa2_sec at sta/crypto_dpaa2_sec_dpaa2_sec_dpseci.c.o'.
FAILED: drivers/a715181@@tmp_rte_pmd_dpaa2_sec at sta/crypto_dpaa2_sec_dpaa2_sec_dpseci.c.o 
clang -Idrivers/a715181@@tmp_rte_pmd_dpaa2_sec at sta -Idrivers -I../drivers -Idrivers/crypto/dpaa2_sec -I../drivers/crypto/dpaa2_sec -I../drivers/crypto/dpaa2_sec/mc -I../drivers/crypto/dpaa2_sec/hw -Ilib/librte_cryptodev -I../lib/librte_cryptodev -I. -I../ -Iconfig -I../config -Ilib/librte_eal/common/include -I../lib/librte_eal/common/include -I../lib/librte_eal/linux/eal/include -Ilib/librte_eal/common -I../lib/librte_eal/common -Ilib/librte_eal/common/include/arch/x86 -I../lib/librte_eal/common/include/arch/x86 -Ilib/librte_eal -I../lib/librte_eal -Ilib/librte_kvargs -I../lib/librte_kvargs -Ilib/librte_mbuf -I../lib/librte_mbuf -Ilib/librte_mempool -I../lib/librte_mempool -Ilib/librte_ring -I../lib/librte_ring -Ilib/librte_security -I../lib/librte_security -Idrivers/mempool/dpaa2 -I../drivers/mempool/dpaa2 -Idrivers/bus/fslmc -I../drivers/bus/fslmc -I../drivers/bus/fslmc/mc -I../drivers/bus/fslmc/qbman/include -I../drivers/bus/fslmc/portal -Idrivers/common/dpaax -I../drivers/common/dpaax -Ilib/librte_eventdev -I../lib/librte_eventdev -Ilib/librte_ethdev -I../lib/librte_ethdev -Ilib/librte_net -I../lib/librte_net -Ilib/librte_meter -I../lib/librte_meter -Ilib/librte_hash -I../lib/librte_hash -Ilib/librte_timer -I../lib/librte_timer -Xclang -fcolor-diagnostics -pipe -D_FILE_OFFSET_BITS=64 -Wall -Winvalid-pch -Werror -O3 -include rte_config.h -Wunused-parameter -Wsign-compare -Wcast-qual -Wno-pointer-to-int-cast -D_GNU_SOURCE -fPIC -march=native -DALLOW_EXPERIMENTAL_API -MD -MQ 'drivers/a715181@@tmp_rte_pmd_dpaa2_sec at sta/crypto_dpaa2_sec_dpaa2_sec_dpseci.c.o' -MF 'drivers/a715181@@tmp_rte_pmd_dpaa2_sec at sta/crypto_dpaa2_sec_dpaa2_sec_dpseci.c.o.d' -o 'drivers/a715181@@tmp_rte_pmd_dpaa2_sec at sta/crypto_dpaa2_sec_dpaa2_sec_dpseci.c.o' -c ../drivers/crypto/dpaa2_sec/dpaa2_sec_dpseci.c
../drivers/crypto/dpaa2_sec/dpaa2_sec_dpseci.c:2955:18: error: implicit conversion from enumeration type 'enum rte_security_pdcp_sn_size' to different enumeration type 'enum pdcp_sn_size' [-Werror,-Wenum-conversion]
                                        pdcp_xform->sn_size,
                                        ~~~~~~~~~~~~^~~~~~~
../drivers/crypto/dpaa2_sec/dpaa2_sec_dpseci.c:2965:18: error: implicit conversion from enumeration type 'enum rte_security_pdcp_sn_size' to different enumeration type 'enum pdcp_sn_size' [-Werror,-Wenum-conversion]
--
[1091/1680] Compiling C object 'drivers/a715181@@tmp_rte_pmd_octeontx_crypto at sta/crypto_octeontx_otx_cryptodev.c.o'.
[1092/1680] Compiling C object 'drivers/a715181@@tmp_rte_pmd_null_crypto at sta/crypto_null_null_crypto_pmd_ops.c.o'.
[1093/1680] Compiling C object 'drivers/a715181@@tmp_rte_pmd_octeontx_crypto at sta/crypto_octeontx_otx_cryptodev_capabilities.c.o'.
[1094/1680] Compiling C object 'drivers/a715181@@tmp_rte_pmd_caam_jr at sta/crypto_caam_jr_caam_jr.c.o'.
[1095/1680] Compiling C object 'drivers/a715181@@tmp_rte_pmd_dpaa_sec at sta/crypto_dpaa_sec_dpaa_sec.c.o'.
ninja: build stopped: subcommand failed.
meson --werror -Dexamples=all -Dlibdir=lib -Dmachine=nehalem --default-library=shared /tmp/UB1604-32_K4.4.0_GCC5.4.0/i686-native-linuxapp-gcc/ce7926d9d21c44c29d1531673ff35cea/dpdk/devtools/.. build-x86-default
The Meson build system
Version: 0.50.1
Source dir: /tmp/UB1604-32_K4.4.0_GCC5.4.0/i686-native-linuxapp-gcc/ce7926d9d21c44c29d1531673ff35cea/dpdk
Build dir: /tmp/UB1604-32_K4.4.0_GCC5.4.0/i686-native-linuxapp-gcc/ce7926d9d21c44c29d1531673ff35cea/dpdk/build-x86-default


*Meson Build Failed #4:
OS: UB1804-64
Target:build-gcc-static
[1181/1791] Compiling C object 'drivers/a715181@@rte_pmd_vmxnet3 at sta/meson-generated_.._rte_pmd_vmxnet3.pmd.c.o'.
[1182/1791] Compiling C object 'drivers/a715181@@rte_pmd_vmxnet3 at sha/meson-generated_.._rte_pmd_vmxnet3.pmd.c.o'.
[1183/1791] Linking static target drivers/librte_pmd_vmxnet3.a.
[1184/1791] Linking target drivers/librte_pmd_vmxnet3.so.1.1.
[1185/1791] Compiling C object 'drivers/a715181@@tmp_rte_pmd_dpaa2_sec at sta/crypto_dpaa2_sec_dpaa2_sec_dpseci.c.o'.
FAILED: drivers/a715181@@tmp_rte_pmd_dpaa2_sec at sta/crypto_dpaa2_sec_dpaa2_sec_dpseci.c.o 
clang -Idrivers/a715181@@tmp_rte_pmd_dpaa2_sec at sta -Idrivers -I../drivers -Idrivers/crypto/dpaa2_sec -I../drivers/crypto/dpaa2_sec -I../drivers/crypto/dpaa2_sec/mc -I../drivers/crypto/dpaa2_sec/hw -Ilib/librte_cryptodev -I../lib/librte_cryptodev -I. -I../ -Iconfig -I../config -Ilib/librte_eal/common/include -I../lib/librte_eal/common/include -I../lib/librte_eal/linux/eal/include -Ilib/librte_eal/common -I../lib/librte_eal/common -Ilib/librte_eal/common/include/arch/x86 -I../lib/librte_eal/common/include/arch/x86 -Ilib/librte_eal -I../lib/librte_eal -Ilib/librte_kvargs -I../lib/librte_kvargs -Ilib/librte_mbuf -I../lib/librte_mbuf -Ilib/librte_mempool -I../lib/librte_mempool -Ilib/librte_ring -I../lib/librte_ring -Ilib/librte_security -I../lib/librte_security -Idrivers/mempool/dpaa2 -I../drivers/mempool/dpaa2 -Idrivers/bus/fslmc -I../drivers/bus/fslmc -I../drivers/bus/fslmc/mc -I../drivers/bus/fslmc/qbman/include -I../drivers/bus/fslmc/portal -Idrivers/common/dpaax -I../drivers/common/dpaax -Ilib/librte_eventdev -I../lib/librte_eventdev -Ilib/librte_ethdev -I../lib/librte_ethdev -Ilib/librte_net -I../lib/librte_net -Ilib/librte_meter -I../lib/librte_meter -Ilib/librte_hash -I../lib/librte_hash -Ilib/librte_timer -I../lib/librte_timer -Xclang -fcolor-diagnostics -pipe -D_FILE_OFFSET_BITS=64 -Wall -Winvalid-pch -Werror -O3 -include rte_config.h -Wunused-parameter -Wsign-compare -Wcast-qual -Wno-address-of-packed-member -D_GNU_SOURCE -fPIC -march=native -mno-avx512f -DALLOW_EXPERIMENTAL_API -MD -MQ 'drivers/a715181@@tmp_rte_pmd_dpaa2_sec at sta/crypto_dpaa2_sec_dpaa2_sec_dpseci.c.o' -MF 'drivers/a715181@@tmp_rte_pmd_dpaa2_sec at sta/crypto_dpaa2_sec_dpaa2_sec_dpseci.c.o.d' -o 'drivers/a715181@@tmp_rte_pmd_dpaa2_sec at sta/crypto_dpaa2_sec_dpaa2_sec_dpseci.c.o' -c ../drivers/crypto/dpaa2_sec/dpaa2_sec_dpseci.c
../drivers/crypto/dpaa2_sec/dpaa2_sec_dpseci.c:2955:18: error: implicit conversion from enumeration type 'enum rte_security_pdcp_sn_size' to different enumeration type 'enum pdcp_sn_size' [-Werror,-Wenum-conversion]
                                        pdcp_xform->sn_size,
                                        ~~~~~~~~~~~~^~~~~~~
../drivers/crypto/dpaa2_sec/dpaa2_sec_dpseci.c:2965:18: error: implicit conversion from enumeration type 'enum rte_security_pdcp_sn_size' to different enumeration type 'enum pdcp_sn_size' [-Werror,-Wenum-conversion]
--
[1186/1791] Compiling C object 'drivers/a715181@@tmp_rte_pmd_null_crypto at sta/crypto_null_null_crypto_pmd_ops.c.o'.
[1187/1791] Compiling C object 'drivers/a715181@@tmp_rte_pmd_null_crypto at sta/crypto_null_null_crypto_pmd.c.o'.
[1188/1791] Compiling C object 'drivers/a715181@@tmp_rte_pmd_octeontx_crypto at sta/crypto_octeontx_otx_cryptodev_capabilities.c.o'.
[1189/1791] Compiling C object 'drivers/a715181@@tmp_rte_pmd_caam_jr at sta/crypto_caam_jr_caam_jr.c.o'.
[1190/1791] Compiling C object 'drivers/a715181@@tmp_rte_pmd_dpaa_sec at sta/crypto_dpaa_sec_dpaa_sec.c.o'.
ninja: build stopped: subcommand failed.
meson --werror -Dexamples=all --default-library=shared /tmp/UB1804-64_K4.15.0_GCC7.3.0/x86_64-native-linuxapp-gcc/ce7926d9d21c44c29d1531673ff35cea/dpdk/devtools/.. build-clang-shared
The Meson build system
Version: 0.50.0
Source dir: /tmp/UB1804-64_K4.15.0_GCC7.3.0/x86_64-native-linuxapp-gcc/ce7926d9d21c44c29d1531673ff35cea/dpdk
Build dir: /tmp/UB1804-64_K4.15.0_GCC7.3.0/x86_64-native-linuxapp-gcc/ce7926d9d21c44c29d1531673ff35cea/dpdk/build-clang-shared
--
[1205/1815] Compiling C object 'drivers/a715181@@rte_pmd_vmxnet3 at sta/meson-generated_.._rte_pmd_vmxnet3.pmd.c.o'.
[1206/1815] Compiling C object 'drivers/a715181@@rte_pmd_vmxnet3 at sha/meson-generated_.._rte_pmd_vmxnet3.pmd.c.o'.
[1207/1815] Linking static target drivers/librte_pmd_vmxnet3.a.
[1208/1815] Linking target drivers/librte_pmd_vmxnet3.so.1.1.
[1209/1815] Compiling C object 'drivers/a715181@@tmp_rte_pmd_dpaa2_sec at sta/crypto_dpaa2_sec_dpaa2_sec_dpseci.c.o'.
FAILED: drivers/a715181@@tmp_rte_pmd_dpaa2_sec at sta/crypto_dpaa2_sec_dpaa2_sec_dpseci.c.o 
clang -Idrivers/a715181@@tmp_rte_pmd_dpaa2_sec at sta -Idrivers -I../drivers -Idrivers/crypto/dpaa2_sec -I../drivers/crypto/dpaa2_sec -I../drivers/crypto/dpaa2_sec/mc -I../drivers/crypto/dpaa2_sec/hw -Ilib/librte_cryptodev -I../lib/librte_cryptodev -I. -I../ -Iconfig -I../config -Ilib/librte_eal/common/include -I../lib/librte_eal/common/include -I../lib/librte_eal/linux/eal/include -Ilib/librte_eal/common -I../lib/librte_eal/common -Ilib/librte_eal/common/include/arch/x86 -I../lib/librte_eal/common/include/arch/x86 -Ilib/librte_eal -I../lib/librte_eal -Ilib/librte_kvargs -I../lib/librte_kvargs -Ilib/librte_mbuf -I../lib/librte_mbuf -Ilib/librte_mempool -I../lib/librte_mempool -Ilib/librte_ring -I../lib/librte_ring -Ilib/librte_security -I../lib/librte_security -Idrivers/mempool/dpaa2 -I../drivers/mempool/dpaa2 -Idrivers/bus/fslmc -I../drivers/bus/fslmc -I../drivers/bus/fslmc/mc -I../drivers/bus/fslmc/qbman/include -I../drivers/bus/fslmc/portal -Idrivers/common/dpaax -I../drivers/common/dpaax -Ilib/librte_eventdev -I../lib/librte_eventdev -Ilib/librte_ethdev -I../lib/librte_ethdev -Ilib/librte_net -I../lib/librte_net -Ilib/librte_meter -I../lib/librte_meter -Ilib/librte_hash -I../lib/librte_hash -Ilib/librte_timer -I../lib/librte_timer -Xclang -fcolor-diagnostics -pipe -D_FILE_OFFSET_BITS=64 -Wall -Winvalid-pch -Werror -O3 -include rte_config.h -Wunused-parameter -Wsign-compare -Wcast-qual -Wno-address-of-packed-member -D_GNU_SOURCE -fPIC -march=native -mno-avx512f -DALLOW_EXPERIMENTAL_API -MD -MQ 'drivers/a715181@@tmp_rte_pmd_dpaa2_sec at sta/crypto_dpaa2_sec_dpaa2_sec_dpseci.c.o' -MF 'drivers/a715181@@tmp_rte_pmd_dpaa2_sec at sta/crypto_dpaa2_sec_dpaa2_sec_dpseci.c.o.d' -o 'drivers/a715181@@tmp_rte_pmd_dpaa2_sec at sta/crypto_dpaa2_sec_dpaa2_sec_dpseci.c.o' -c ../drivers/crypto/dpaa2_sec/dpaa2_sec_dpseci.c
../drivers/crypto/dpaa2_sec/dpaa2_sec_dpseci.c:2955:18: error: implicit conversion from enumeration type 'enum rte_security_pdcp_sn_size' to different enumeration type 'enum pdcp_sn_size' [-Werror,-Wenum-conversion]
                                        pdcp_xform->sn_size,
                                        ~~~~~~~~~~~~^~~~~~~
../drivers/crypto/dpaa2_sec/dpaa2_sec_dpseci.c:2965:18: error: implicit conversion from enumeration type 'enum rte_security_pdcp_sn_size' to different enumeration type 'enum pdcp_sn_size' [-Werror,-Wenum-conversion]
--
[1210/1815] Compiling C object 'drivers/a715181@@tmp_rte_pmd_null_crypto at sta/crypto_null_null_crypto_pmd_ops.c.o'.
[1211/1815] Compiling C object 'drivers/a715181@@tmp_rte_pmd_null_crypto at sta/crypto_null_null_crypto_pmd.c.o'.
[1212/1815] Compiling C object 'drivers/a715181@@tmp_rte_pmd_octeontx_crypto at sta/crypto_octeontx_otx_cryptodev_capabilities.c.o'.
[1213/1815] Compiling C object 'drivers/a715181@@tmp_rte_pmd_caam_jr at sta/crypto_caam_jr_caam_jr.c.o'.
[1214/1815] Compiling C object 'drivers/a715181@@tmp_rte_pmd_dpaa_sec at sta/crypto_dpaa_sec_dpaa_sec.c.o'.
ninja: build stopped: subcommand failed.
meson --werror -Dexamples=all -Dlibdir=lib -Dmachine=nehalem --default-library=shared /tmp/UB1804-64_K4.15.0_GCC7.3.0/x86_64-native-linuxapp-gcc/ce7926d9d21c44c29d1531673ff35cea/dpdk/devtools/.. build-x86-default
The Meson build system
Version: 0.50.0
Source dir: /tmp/UB1804-64_K4.15.0_GCC7.3.0/x86_64-native-linuxapp-gcc/ce7926d9d21c44c29d1531673ff35cea/dpdk
Build dir: /tmp/UB1804-64_K4.15.0_GCC7.3.0/x86_64-native-linuxapp-gcc/ce7926d9d21c44c29d1531673ff35cea/dpdk/build-x86-default

DPDK STV team


More information about the test-report mailing list