[dpdk-test-report] |FAILURE| pw58863-58872 [PATCH] [01/10] security: introduce CPU Crypto action type and API

dpdklab at iol.unh.edu dpdklab at iol.unh.edu
Fri Sep 6 16:30:59 CEST 2019


Test-Label: Performance-Testing
Test-Status: FAILURE
http://dpdk.org/patch/58863

_build patch failure_

Submitter: Fan Zhang <roy.fan.zhang at intel.com>
Date: Friday, September 06 2019 13:13:21 
Applied on: CommitID:0710d87b7f5d0a2cd01861d44c4689efd4714b5f
Apply patch set 58863-58872 failed:

Configuration done using x86_64-native-linuxapp-gcc
== Build lib
== Build lib/librte_kvargs
== Build lib/librte_eal
== Build lib/librte_eal/common
== Build lib/librte_eal/linux
== Build lib/librte_eal/linux/eal
== Build lib/librte_pci
== Build lib/librte_ring
== Build lib/librte_stack
== Build lib/librte_mempool
== Build lib/librte_mbuf
== Build lib/librte_timer
== Build lib/librte_cfgfile
== Build lib/librte_net
== Build lib/librte_cmdline
== Build lib/librte_meter
== Build lib/librte_ethdev
== Build lib/librte_bbdev
== Build lib/librte_cryptodev
== Build lib/librte_security
== Build lib/librte_compressdev
== Build lib/librte_hash
== Build lib/librte_eventdev
== Build lib/librte_rawdev
== Build lib/librte_vhost
== Build lib/librte_efd
== Build lib/librte_lpm
== Build lib/librte_acl
== Build lib/librte_member
== Build lib/librte_ip_frag
== Build lib/librte_gro
== Build lib/librte_jobstats
== Build lib/librte_metrics
== Build lib/librte_bitratestats
== Build lib/librte_latencystats
== Build lib/librte_power
== Build lib/librte_sched
== Build lib/librte_kni
== Build lib/librte_port
== Build lib/librte_table
== Build lib/librte_flow_classify
== Build lib/librte_distributor
== Build lib/librte_pipeline
== Build lib/librte_reorder
== Build lib/librte_pdump
== Build lib/librte_gso
== Build lib/librte_bpf
== Build lib/librte_ipsec
== Build lib/librte_rcu
== Build buildtools
== Build buildtools/pmdinfogen
== Build kernel
== Build kernel/linux
== Build kernel/linux/igb_uio
  Building modules, stage 2.
  MODPOST 1 modules
== Build kernel/linux/kni
  Building modules, stage 2.
  MODPOST 1 modules
== Build drivers
== Build drivers/common
== Build drivers/common/cpt
== Build drivers/common/octeontx
== Build drivers/common/octeontx2
== Build drivers/common/dpaax
== Build drivers/bus
== Build drivers/bus/dpaa
== Build drivers/bus/fslmc
== Build drivers/bus/ifpga
== Build drivers/bus/pci
== Build drivers/bus/vdev
== Build drivers/bus/vmbus
== Build drivers/mempool
== Build drivers/mempool/bucket
== Build drivers/mempool/dpaa
== Build drivers/mempool/dpaa2
== Build drivers/mempool/ring
== Build drivers/mempool/stack
== Build drivers/mempool/octeontx
== Build drivers/mempool/octeontx2
== Build drivers/net
== Build drivers/net/af_packet
== Build drivers/net/ark
== Build drivers/net/atlantic
== Build drivers/net/avp
== Build drivers/net/axgbe
== Build drivers/net/bonding
== Build drivers/net/cxgbe
== Build drivers/net/dpaa
== Build drivers/net/dpaa2
== Build drivers/net/e1000
== Build drivers/net/ena
== Build drivers/net/enetc
== Build drivers/net/enic
== Build drivers/net/failsafe
== Build drivers/net/fm10k
== Build drivers/net/hinic
== Build drivers/net/i40e
== Build drivers/net/iavf
== Build drivers/net/ice
== Build drivers/net/ipn3ke
== Build drivers/net/ixgbe
== Build drivers/net/liquidio
== Build drivers/net/memif
== Build drivers/net/netvsc
== Build drivers/net/nfp
== Build drivers/net/bnxt
== Build drivers/net/null
== Build drivers/net/octeontx
== Build drivers/net/octeontx2
== Build drivers/net/qede
== Build drivers/net/ring
== Build drivers/net/sfc
== Build drivers/net/tap
== Build drivers/net/thunderx
== Build drivers/net/vdev_netvsc
== Build drivers/net/virtio
== Build drivers/net/vmxnet3
== Build drivers/net/kni
== Build drivers/net/softnic
== Build drivers/net/vhost
== Build drivers/net/ifc
== Build drivers/baseband
== Build drivers/baseband/null
== Build drivers/baseband/turbo_sw
== Build drivers/baseband/fpga_lte_fec
== Build drivers/crypto
== Build drivers/crypto/octeontx
== Build drivers/crypto/scheduler
== Build drivers/crypto/null
== Build drivers/crypto/dpaa2_sec
== Build drivers/crypto/dpaa_sec
== Build drivers/crypto/caam_jr
== Build drivers/crypto/virtio
== Build drivers/common/qat
== Build drivers/compress
== Build drivers/compress/octeontx
== Build drivers/event
== Build drivers/event/skeleton
== Build drivers/event/sw
== Build drivers/event/dsw
== Build drivers/event/octeontx
== Build drivers/event/octeontx2
== Build drivers/event/dpaa
== Build drivers/event/dpaa2
== Build drivers/event/opdl
== Build drivers/raw
== Build drivers/raw/skeleton
== Build drivers/raw/dpaa2_cmdif
== Build drivers/raw/dpaa2_qdma
== Build drivers/raw/ifpga
== Build drivers/raw/ioat
== Build drivers/raw/ntb
== Build drivers/raw/octeontx2_dma
== Build app
== Build app/test
  MKRES test_resource_c.res.o
  CC test_security_cpu_crypto.o
/var/lib/jenkins/workspace/Apply-Custom-Patch-Set/dpdk/app/test/test_security_cpu_crypto.c: In function ‘cpu_crypto_test_aead_perf’:
/var/lib/jenkins/workspace/Apply-Custom-Patch-Set/dpdk/app/test/test_security_cpu_crypto.c:353:9: error: array subscript is above array bounds [-Werror=array-bounds]
   memcpy(data->aad + 18, test_data->aad.data, test_data->aad.len);
         ^
/var/lib/jenkins/workspace/Apply-Custom-Patch-Set/dpdk/app/test/test_security_cpu_crypto.c:353:9: error: array subscript is above array bounds [-Werror=array-bounds]
   memcpy(data->aad + 18, test_data->aad.data, test_data->aad.len);
         ^
/var/lib/jenkins/workspace/Apply-Custom-Patch-Set/dpdk/app/test/test_security_cpu_crypto.c: In function ‘cpu_crypto_test_aead_perf.constprop.11’:
/var/lib/jenkins/workspace/Apply-Custom-Patch-Set/dpdk/app/test/test_security_cpu_crypto.c:353:9: error: array subscript is above array bounds [-Werror=array-bounds]
   memcpy(data->aad + 18, test_data->aad.data, test_data->aad.len);
         ^
/var/lib/jenkins/workspace/Apply-Custom-Patch-Set/dpdk/app/test/test_security_cpu_crypto.c:353:9: error: array subscript is above array bounds [-Werror=array-bounds]
   memcpy(data->aad + 18, test_data->aad.data, test_data->aad.len);
         ^
/var/lib/jenkins/workspace/Apply-Custom-Patch-Set/dpdk/app/test/test_security_cpu_crypto.c: In function ‘cpu_crypto_test_aead.part.3’:
/var/lib/jenkins/workspace/Apply-Custom-Patch-Set/dpdk/app/test/test_security_cpu_crypto.c:353:9: error: array subscript is above array bounds [-Werror=array-bounds]
   memcpy(data->aad + 18, test_data->aad.data, test_data->aad.len);
         ^
/var/lib/jenkins/workspace/Apply-Custom-Patch-Set/dpdk/app/test/test_security_cpu_crypto.c: At top level:
cc1: error: unrecognized command line option "-Wno-address-of-packed-member" [-Werror]
cc1: all warnings being treated as errors
make[5]: *** [test_security_cpu_crypto.o] Error 1
make[4]: *** [test] Error 2
make[3]: *** [app] Error 2
make[2]: *** [all] Error 2
make[1]: *** [pre_install] Error 2
make: *** [install] Error 2

https://lab.dpdk.org/results/dashboard/patchsets/7400/

UNH-IOL DPDK Performance Test Lab


More information about the test-report mailing list