[dpdk-test-report] |FAILURE| pw58747[v3, 02/54] ethdev: change rte_eth_dev_info_get() return value to int

sys_stv at intel.com sys_stv at intel.com
Fri Sep 6 18:49:35 CEST 2019


Test-Label: Intel-compilation
Test-Status: FAILURE
http://dpdk.org/patch/58747

_Compilation issues_

Submitter: Andrew Rybchenko <arybchenko at solarflare.com>
Date: 2019-09-06 07:30:14
Reply_mail: 1567755066-31389-3-git-send-email-arybchenko at solarflare.com
DPDK git baseline: Repo:dpdk, CommitID: e7fd5a3bbe5636e93a66fd5086f182756624c97a

Makefile build Summary: 22 Builds Done, 0 Successful, 22 Failures

Meson build Summary: 7 Builds Done, 2 Successful, 5 Failures

               +==============================================+===========+==========+
               |                   Makefile                   |   Meson   | Document |
+--------------+------+-------+------+------------+-----------+-----------+----------+
| os           | gcc  | clang | icc  | gcc+shared | gcc+debug | gcc/clang | pdf/html |
+--------------+------+-------+------+------------+-----------+-----------+----------+
| RHEL76-64    | FAIL |       |      |            |           |           |          |
| CENTOS76-64  | FAIL | FAIL  | FAIL | FAIL       | FAIL      |           |          |
| UB1804-64    | FAIL | FAIL  | FAIL |            |           | FAIL      | pass     |
| UB1604-32    | FAIL |       |      |            |           | FAIL      |          |
| UB1904-64    | FAIL |       |      |            |           |           |          |
| UB1604-64    | FAIL | FAIL  |      |            |           |           |          |
| FC30-64      | FAIL | FAIL  |      |            |           | FAIL      |          |
| WIN10-64     |      |       |      |            |           | pass      |          |
| FreeBSD12-64 | FAIL | FAIL  |      | FAIL       | FAIL      | FAIL      |          |
| RHEL80-64    | FAIL |       |      |            |           |           |          |
| SUSE15-64    | FAIL | FAIL  |      |            |           | FAIL      |          |
+--------------+------+-------+------+------------+-----------+-----------+----------+

Test environment and configuration as below:

** Makefile build **


OS: RHEL76-64
	Kernel Version: 3.10.0-957.el7.x86_64
	CPU info: Intel(R) Xeon(R) CPU E5-2699 v4 @ 2.20GHz
	GCC Version: gcc (GCC) 4.8.5 20150623 (Red Hat 4.8.5-36)
	Clang Version: NA
	x86_64-native-linuxapp-gcc


OS: CENTOS76-64
	Kernel Version: 3.10.0-957.10.1.el7.x86_64
	CPU info: Intel(R) Xeon(R) CPU E5-2699 v4 @ 2.20GHz
	GCC Version: gcc (GCC) 4.8.5 20150623 (Red Hat 4.8.5-36)
	Clang Version: 3.4.2 (tags/RELEASE_34/dot2-final)
	x86_64-native-linuxapp-clang
	x86_64-native-linuxapp-gcc
	x86_64-native-linuxapp-icc
	x86_64-native-linuxapp-gcc+debug
	x86_64-native-linuxapp-gcc+shared


OS: UB1804-64
	Kernel Version: 4.15.0-20-generic
	CPU info: Intel(R) Xeon(R) CPU E5-2699 v3 @ 2.30GHz
	GCC Version: gcc (Ubuntu 7.3.0-27ubuntu1~18.04) 7.3.0
	Clang Version: 6.0.0-1ubuntu2 (tags/RELEASE_600/final)
	x86_64-native-linuxapp-icc
	x86_64-native-linuxapp-clang
	x86_64-native-linuxapp-gcc


OS: UB1904-64
	Kernel Version: 5.0.0-13-generic
	CPU info: Intel(R) Xeon(R) CPU E5-2699 v3 @ 2.30GHz
	GCC Version: gcc (Ubuntu 8.3.0-6ubuntu1) 8.3.0
	Clang Version: 8.0.0-3 (tags/RELEASE_800/final)
	x86_64-native-linuxapp-gcc


OS: UB1604-32
	Kernel Version: 4.4.0-131-generic
	CPU info: Intel(R) Xeon(R) CPU E5-2699 v3 @ 2.30GHz
	GCC Version: gcc (Ubuntu 5.4.0-6ubuntu1~16.04.11) 5.4.0 20160609
	Clang Version: 3.8.0-2ubuntu4 (tags/RELEASE_380/final)
	i686-native-linuxapp-gcc


OS: UB1604-64
	Kernel Version: 4.4.0-47-generic
	CPU info: Intel(R) Xeon(R) CPU E5-2699 v3 @ 2.30GHz
	GCC Version: gcc (Ubuntu 5.4.0-6ubuntu1~16.04.10) 5.4.0 20160609
	Clang Version: 3.8.0-2ubuntu4 (tags/RELEASE_380/final)
	x86_64-native-linuxapp-clang
	x86_64-native-linuxapp-gcc


OS: FC30-64
	Kernel Version: 5.1.7-300.fc30.x86_64
	CPU info: Intel(R) Xeon(R) CPU E5-2699 v4 @ 2.20GHz
	GCC Version: gcc (GCC) 9.1.1 20190503 (Red Hat 9.1.1-1)
	Clang Version: 8.0.0 (Fedora 8.0.0-1.fc30)
	x86_64-native-linuxapp-gcc
	x86_64-native-linuxapp-clang


OS: FreeBSD12-64
	Kernel Version: 12.0-RC3
	CPU info: Intel(R) Xeon(R) CPU E5-2699 v4 @ 2.20GHz (2194.97-MHz K8-class CPU)
	GCC Version: gcc (FreeBSD Ports Collection) 7.3.0
	Clang Version: 6.0.1 (tags/RELEASE_601/final 335540) (based on LLVM 6.0.1)
	x86_64-native-bsdapp-gcc+debug
	x86_64-native-bsdapp-gcc
	x86_64-native-bsdapp-clang
	x86_64-native-bsdapp-gcc+shared


OS: RHEL80-64
	Kernel Version: 4.18.0-80.el8.x86_64
	CPU info: Intel(R) Xeon(R) CPU E5-2699 v4 @ 2.20GHz
	GCC Version: gcc (GCC) 8.2.1 20180905 (Red Hat 8.2.1-3)
	Clang Version: 6.0.1 (tags/RELEASE_601/final)
	x86_64-native-linuxapp-gcc


OS: SUSE15-64
	Kernel Version: 4.12.14-lp150.11-default
	CPU info: Intel(R) Xeon(R) CPU E5-2699 v4 @ 2.20GHz
	GCC Version: gcc (SUSE Linux) 7.3.1 20180323 [gcc-7-branch revision 258812]
	Clang Version: 5.0.1 (tags/RELEASE_501/final 312548)
	x86_64-native-linuxapp-gcc
	x86_64-native-linuxapp-clang


** Meson build **


OS: UB1804-64
	Kernel Version: 4.15.0-20-generic
	CPU info: Intel(R) Xeon(R) CPU E5-2699 v4 @ 2.20GHz
	GCC Version: gcc (Ubuntu 7.3.0-27ubuntu1~18.04) 7.3.0
	Clang Version: 6.0.0-1ubuntu2 (tags/RELEASE_600/final)
	x86_64-native-linuxapp-doc
	build-gcc-static
	build-gcc-shared
	build-clang-static
	build-clang-shared
	build-x86-default


OS: UB1604-32
	Kernel Version: 4.4.0-131-generic
	CPU info: Intel(R) Xeon(R) CPU E5-2699 v4 @ 2.20GHz
	GCC Version: gcc (Ubuntu 5.4.0-6ubuntu1~16.04.11) 5.4.0 20160609
	Clang Version: 3.8.0-2ubuntu4 (tags/RELEASE_380/final)
	build-gcc-static
	build-gcc-shared
	build-clang-static
	build-clang-shared
	build-x86-default


OS: FC30-64
	Kernel Version: 5.0.9-301.fc30.x86_64
	CPU info: Intel(R) Xeon(R) CPU E5-2699 v4 @ 2.20GHz
	GCC Version: gcc (GCC) 9.1.1 20190503 (Red Hat 9.1.1-1)
	Clang Version: 8.0.0 (Fedora 8.0.0-1.fc30)
	build-gcc-static
	build-gcc-shared
	build-clang-static
	build-clang-shared
	build-x86-default


OS: WIN10-64
	Kernel Version: N/A
	CPU info: N/A
	GCC Version: N/A
	Clang Version: Clang 8.0.0
	x86_64-windows-clang


OS: FreeBSD12-64
	Kernel Version: 12.0-RC3
	CPU info: Intel(R) Xeon(R) CPU E5-2699 v4 @ 2.20GHz (2194.99-MHz K8-class CPU)
	GCC Version: gcc (FreeBSD Ports Collection) 7.3.0
	Clang Version: 6.0.1 (tags/RELEASE_601/final 335540) (based on LLVM 6.0.1)
	build-gcc-static
	build-gcc-shared
	build-clang-static
	build-clang-shared
	build-x86-default


OS: SUSE15-64
	Kernel Version: 4.12.14-lp150.11-default
	CPU info: Intel(R) Xeon(R) CPU E5-2699 v4 @ 2.20GHz
	GCC Version: gcc (SUSE Linux) 7.3.1 20180323 [gcc-7-branch revision 258812]
	Clang Version: 5.0.1 (tags/RELEASE_501/final 312548)
	build-gcc-static
	build-gcc-shared
	build-clang-static
	build-clang-shared
	build-x86-default


*Make Build Failed #1:
OS: UB1604-64
Target: x86_64-native-linuxapp-clang
            ^
/tmp/UB1604-64_K4.4.0_Clang3.8.0/x86_64-native-linuxapp-clang/b34fabe9464043f7a12be6a19e71b855/dpdk/drivers/net/atlantic/atl_ethdev.c:1611:6: error: assigning to 'int' from incompatible type 'void'
        ret = atl_dev_info_get(dev, &dev_info);
            ^ ~~~~~~~~~~~~~~~~~~~~~~~~~~~~~~~~
4 errors generated.
/tmp/UB1604-64_K4.4.0_Clang3.8.0/x86_64-native-linuxapp-clang/b34fabe9464043f7a12be6a19e71b855/dpdk/mk/internal/rte.compile-pre.mk:114: recipe for target 'atl_ethdev.o' failed
make[6]: *** [atl_ethdev.o] Error 1
/tmp/UB1604-64_K4.4.0_Clang3.8.0/x86_64-native-linuxapp-clang/b34fabe9464043f7a12be6a19e71b855/dpdk/mk/rte.subdir.mk:35: recipe for target 'atlantic' failed
make[5]: *** [atlantic] Error 2
make[5]: *** Waiting for unfinished jobs....
== Build drivers/crypto/dpaa_sec
  CC ark_pktgen.o
  PMDINFO avp_ethdev.o.pmd.c
  CC avp_ethdev.o.pmd.o
--
  CC virtio_rxtx.o
  CC virtio_cryptodev.o
  AR librte_pmd_axgbe.a
  INSTALL-LIB librte_pmd_axgbe.a
make[6]: warning:  Clock skew detected.  Your build may be incomplete.
/tmp/UB1604-64_K4.4.0_Clang3.8.0/x86_64-native-linuxapp-clang/b34fabe9464043f7a12be6a19e71b855/dpdk/mk/rte.subdir.mk:35: recipe for target 'net' failed
make[4]: *** [net] Error 2
make[4]: *** Waiting for unfinished jobs....
  CC mc/dpseci.o
  PMDINFO virtio_cryptodev.o.pmd.c
  CC virtio_cryptodev.o.pmd.o
  LD virtio_cryptodev.o
--
  PMDINFO dpaa2_sec_dpseci.o.pmd.c
  CC dpaa2_sec_dpseci.o.pmd.o
  LD dpaa2_sec_dpseci.o
  AR librte_pmd_dpaa2_sec.a
  INSTALL-LIB librte_pmd_dpaa2_sec.a
/tmp/UB1604-64_K4.4.0_Clang3.8.0/x86_64-native-linuxapp-clang/b34fabe9464043f7a12be6a19e71b855/dpdk/mk/rte.sdkbuild.mk:46: recipe for target 'drivers' failed
make[3]: *** [drivers] Error 2
/tmp/UB1604-64_K4.4.0_Clang3.8.0/x86_64-native-linuxapp-clang/b34fabe9464043f7a12be6a19e71b855/dpdk/mk/rte.sdkroot.mk:98: recipe for target 'all' failed
make[2]: *** [all] Error 2
/tmp/UB1604-64_K4.4.0_Clang3.8.0/x86_64-native-linuxapp-clang/b34fabe9464043f7a12be6a19e71b855/dpdk/mk/rte.sdkinstall.mk:60: recipe for target 'pre_install' failed
make[1]: *** [pre_install] Error 2
/tmp/UB1604-64_K4.4.0_Clang3.8.0/x86_64-native-linuxapp-clang/b34fabe9464043f7a12be6a19e71b855/dpdk/mk/rte.sdkroot.mk:77: recipe for target 'install' failed
make: *** [install] Error 2


*Make Build Failed #2:
OS: UB1604-32
Target: i686-native-linuxapp-gcc
             ^
  PMDINFO dpaa_sec.o.pmd.c
  CC dpaa_sec.o.pmd.o
cc1: error: unrecognized command line option ‘-Wno-address-of-packed-member’ [-Werror]
cc1: all warnings being treated as errors
/tmp/UB1604-32_K4.4.0_GCC5.4.0/i686-native-linuxapp-gcc/b34fabe9464043f7a12be6a19e71b855/dpdk/mk/internal/rte.compile-pre.mk:114: recipe for target 'atl_ethdev.o' failed
make[6]: *** [atl_ethdev.o] Error 1
/tmp/UB1604-32_K4.4.0_GCC5.4.0/i686-native-linuxapp-gcc/b34fabe9464043f7a12be6a19e71b855/dpdk/mk/rte.subdir.mk:35: recipe for target 'atlantic' failed
make[5]: *** [atlantic] Error 2
make[5]: *** Waiting for unfinished jobs....
  CC scheduler_multicore.o
  LD dpaa_sec.o
  AR librte_pmd_dpaa_sec.a
  INSTALL-LIB librte_pmd_dpaa_sec.a
--
  INSTALL-LIB librte_pmd_axgbe.a
make[6]: warning:  Clock skew detected.  Your build may be incomplete.
  AR librte_pmd_bond.a
  INSTALL-LIB librte_pmd_bond.a
make[6]: warning:  Clock skew detected.  Your build may be incomplete.
/tmp/UB1604-32_K4.4.0_GCC5.4.0/i686-native-linuxapp-gcc/b34fabe9464043f7a12be6a19e71b855/dpdk/mk/rte.subdir.mk:35: recipe for target 'net' failed
make[4]: *** [net] Error 2
make[4]: *** Waiting for unfinished jobs....
  AR librte_pmd_octeontx_crypto.a
  INSTALL-LIB librte_pmd_octeontx_crypto.a
/tmp/UB1604-32_K4.4.0_GCC5.4.0/i686-native-linuxapp-gcc/b34fabe9464043f7a12be6a19e71b855/dpdk/mk/rte.sdkbuild.mk:46: recipe for target 'drivers' failed
make[3]: *** [drivers] Error 2
/tmp/UB1604-32_K4.4.0_GCC5.4.0/i686-native-linuxapp-gcc/b34fabe9464043f7a12be6a19e71b855/dpdk/mk/rte.sdkroot.mk:98: recipe for target 'all' failed
make[2]: *** [all] Error 2
/tmp/UB1604-32_K4.4.0_GCC5.4.0/i686-native-linuxapp-gcc/b34fabe9464043f7a12be6a19e71b855/dpdk/mk/rte.sdkinstall.mk:60: recipe for target 'pre_install' failed
make[1]: *** [pre_install] Error 2
/tmp/UB1604-32_K4.4.0_GCC5.4.0/i686-native-linuxapp-gcc/b34fabe9464043f7a12be6a19e71b855/dpdk/mk/rte.sdkroot.mk:77: recipe for target 'install' failed
make: *** [install] Error 2


*Make Build Failed #3:
OS: UB1904-64
Target: x86_64-native-linuxapp-gcc
/tmp/UB1904-64_K4.18.0_GCC8.3.0/x86_64-native-linuxapp-gcc/b34fabe9464043f7a12be6a19e71b855/dpdk/drivers/net/atlantic/atl_ethdev.c:48:13: note: previous declaration of ‘atl_dev_info_get’ was here
 static void atl_dev_info_get(struct rte_eth_dev *dev,
             ^~~~~~~~~~~~~~~~
cc1: error: unrecognized command line option ‘-Wno-address-of-packed-member’ [-Werror]
cc1: all warnings being treated as errors
make[6]: *** [/tmp/UB1904-64_K4.18.0_GCC8.3.0/x86_64-native-linuxapp-gcc/b34fabe9464043f7a12be6a19e71b855/dpdk/mk/internal/rte.compile-pre.mk:116: atl_ethdev.o] Error 1
make[6]: *** Waiting for unfinished jobs....
  CC ark_pktgen.o
  AR librte_pmd_crypto_scheduler.a
  INSTALL-LIB librte_pmd_crypto_scheduler.a
  CC virtqueue.o
== Build drivers/net/axgbe
  CC virtio_pci.o
make[5]: *** [/tmp/UB1904-64_K4.18.0_GCC8.3.0/x86_64-native-linuxapp-gcc/b34fabe9464043f7a12be6a19e71b855/dpdk/mk/rte.subdir.mk:37: atlantic] Error 2
make[5]: *** Waiting for unfinished jobs....
  CC virtio_rxtx.o
  AR librte_pmd_octeontx_crypto.a
  INSTALL-LIB librte_pmd_octeontx_crypto.a
  CC virtio_cryptodev.o
--
  INSTALL-LIB librte_pmd_avp.a
make[6]: warning:  Clock skew detected.  Your build may be incomplete.
  AR librte_pmd_axgbe.a
  INSTALL-LIB librte_pmd_axgbe.a
make[6]: warning:  Clock skew detected.  Your build may be incomplete.
make[4]: *** [/tmp/UB1904-64_K4.18.0_GCC8.3.0/x86_64-native-linuxapp-gcc/b34fabe9464043f7a12be6a19e71b855/dpdk/mk/rte.subdir.mk:35: net] Error 2
make[3]: *** [/tmp/UB1904-64_K4.18.0_GCC8.3.0/x86_64-native-linuxapp-gcc/b34fabe9464043f7a12be6a19e71b855/dpdk/mk/rte.sdkbuild.mk:46: drivers] Error 2
make[2]: *** [/tmp/UB1904-64_K4.18.0_GCC8.3.0/x86_64-native-linuxapp-gcc/b34fabe9464043f7a12be6a19e71b855/dpdk/mk/rte.sdkroot.mk:99: all] Error 2
make[1]: *** [/tmp/UB1904-64_K4.18.0_GCC8.3.0/x86_64-native-linuxapp-gcc/b34fabe9464043f7a12be6a19e71b855/dpdk/mk/rte.sdkinstall.mk:61: pre_install] Error 2
make: *** [/tmp/UB1904-64_K4.18.0_GCC8.3.0/x86_64-native-linuxapp-gcc/b34fabe9464043f7a12be6a19e71b855/dpdk/mk/rte.sdkroot.mk:77: install] Error 2


*Make Build Failed #4:
OS: UB1804-64
Target: x86_64-native-linuxapp-icc
/tmp/UB1804-64_K4.15.0_ICC19.0.0/x86_64-native-linuxapp-icc/b34fabe9464043f7a12be6a19e71b855/dpdk/drivers/net/atlantic/atl_ethdev.c(1081): error #147: declaration is incompatible with "void atl_dev_info_get(struct rte_eth_dev *, struct rte_eth_dev_info *)" (declared at line 48)
  atl_dev_info_get(struct rte_eth_dev *dev, struct rte_eth_dev_info *dev_info)
  ^

compilation aborted for /tmp/UB1804-64_K4.15.0_ICC19.0.0/x86_64-native-linuxapp-icc/b34fabe9464043f7a12be6a19e71b855/dpdk/drivers/net/atlantic/atl_ethdev.c (code 2)
/tmp/UB1804-64_K4.15.0_ICC19.0.0/x86_64-native-linuxapp-icc/b34fabe9464043f7a12be6a19e71b855/dpdk/mk/internal/rte.compile-pre.mk:114: recipe for target 'atl_ethdev.o' failed
make[6]: *** [atl_ethdev.o] Error 2
/tmp/UB1804-64_K4.15.0_ICC19.0.0/x86_64-native-linuxapp-icc/b34fabe9464043f7a12be6a19e71b855/dpdk/mk/rte.subdir.mk:35: recipe for target 'atlantic' failed
make[5]: *** [atlantic] Error 2
make[5]: *** Waiting for unfinished jobs....
  CC ark_pktchkr.o
  AR librte_pmd_null_crypto.a
  INSTALL-LIB librte_pmd_null_crypto.a
== Build drivers/crypto/virtio
--
  PMDINFO fpga_lte_fec.o.pmd.c
  INSTALL-LIB librte_pmd_dpaa2_sec.a
  CC fpga_lte_fec.o.pmd.o
  INSTALL-LIB librte_pmd_ark.a
make[6]: warning:  Clock skew detected.  Your build may be incomplete.
/tmp/UB1804-64_K4.15.0_ICC19.0.0/x86_64-native-linuxapp-icc/b34fabe9464043f7a12be6a19e71b855/dpdk/mk/rte.subdir.mk:35: recipe for target 'net' failed
make[4]: *** [net] Error 2
make[4]: *** Waiting for unfinished jobs....
  LD fpga_lte_fec.o
  AR librte_pmd_fpga_lte_fec.a
  INSTALL-LIB librte_pmd_fpga_lte_fec.a
  CC virtio_cryptodev.o
--
  LD caam_jr.o
  AR librte_pmd_caam_jr.a
  INSTALL-LIB librte_pmd_caam_jr.a
  AR librte_pmd_octeontx_crypto.a
  INSTALL-LIB librte_pmd_octeontx_crypto.a
/tmp/UB1804-64_K4.15.0_ICC19.0.0/x86_64-native-linuxapp-icc/b34fabe9464043f7a12be6a19e71b855/dpdk/mk/rte.sdkbuild.mk:46: recipe for target 'drivers' failed
make[3]: *** [drivers] Error 2
/tmp/UB1804-64_K4.15.0_ICC19.0.0/x86_64-native-linuxapp-icc/b34fabe9464043f7a12be6a19e71b855/dpdk/mk/rte.sdkroot.mk:98: recipe for target 'all' failed
make[2]: *** [all] Error 2
/tmp/UB1804-64_K4.15.0_ICC19.0.0/x86_64-native-linuxapp-icc/b34fabe9464043f7a12be6a19e71b855/dpdk/mk/rte.sdkinstall.mk:60: recipe for target 'pre_install' failed
make[1]: *** [pre_install] Error 2
/tmp/UB1804-64_K4.15.0_ICC19.0.0/x86_64-native-linuxapp-icc/b34fabe9464043f7a12be6a19e71b855/dpdk/mk/rte.sdkroot.mk:77: recipe for target 'install' failed
make: *** [install] Error 2


*Make Build Failed #5:
OS: UB1804-64
Target: x86_64-native-linuxapp-clang
:1611:6: error: assigning to 'int' from incompatible type 'void'
        ret = atl_dev_info_get(dev, &dev_info);
            ^ ~~~~~~~~~~~~~~~~~~~~~~~~~~~~~~~~
== Build drivers/crypto/caam_jr
4 errors generated.
/tmp/UB1804-64_K4.15.0_Clang6.0.0/x86_64-native-linuxapp-clang/b34fabe9464043f7a12be6a19e71b855/dpdk/mk/internal/rte.compile-pre.mk:114: recipe for target 'atl_ethdev.o' failed
make[6]: *** [atl_ethdev.o] Error 1
make[6]: *** Waiting for unfinished jobs....
== Build drivers/crypto/virtio
  LD dpaa2_sec_dpseci.o
make[6]: Warning: File 'axgbe_ethdev.c' has modification time 16537 s in the future
  CC avp_ethdev.o
--
  INSTALL-LIB librte_pmd_crypto_scheduler.a
  CC virtio_pci.o
  PMDINFO axgbe_ethdev.o.pmd.c
  CC axgbe_ethdev.o.pmd.o
  LD axgbe_ethdev.o
/tmp/UB1804-64_K4.15.0_Clang6.0.0/x86_64-native-linuxapp-clang/b34fabe9464043f7a12be6a19e71b855/dpdk/mk/rte.subdir.mk:35: recipe for target 'atlantic' failed
make[5]: *** [atlantic] Error 2
make[5]: *** Waiting for unfinished jobs....
  CC virtio_rxtx.o
  CC axgbe_phy_impl.o
  CC virtio_cryptodev.o
  CC caam_jr_capabilities.o
--
  AR librte_pmd_virtio_crypto.a
  INSTALL-LIB librte_pmd_virtio_crypto.a
  AR librte_pmd_axgbe.a
  INSTALL-LIB librte_pmd_axgbe.a
make[6]: warning:  Clock skew detected.  Your build may be incomplete.
/tmp/UB1804-64_K4.15.0_Clang6.0.0/x86_64-native-linuxapp-clang/b34fabe9464043f7a12be6a19e71b855/dpdk/mk/rte.subdir.mk:35: recipe for target 'net' failed
make[4]: *** [net] Error 2
make[4]: *** Waiting for unfinished jobs....
  PMDINFO caam_jr.o.pmd.c
  CC caam_jr.o.pmd.o
  LD caam_jr.o
  AR librte_pmd_caam_jr.a
--
  PMDINFO dpaa_sec.o.pmd.c
  CC dpaa_sec.o.pmd.o
  LD dpaa_sec.o
  AR librte_pmd_dpaa_sec.a
  INSTALL-LIB librte_pmd_dpaa_sec.a
/tmp/UB1804-64_K4.15.0_Clang6.0.0/x86_64-native-linuxapp-clang/b34fabe9464043f7a12be6a19e71b855/dpdk/mk/rte.sdkbuild.mk:46: recipe for target 'drivers' failed
make[3]: *** [drivers] Error 2
/tmp/UB1804-64_K4.15.0_Clang6.0.0/x86_64-native-linuxapp-clang/b34fabe9464043f7a12be6a19e71b855/dpdk/mk/rte.sdkroot.mk:98: recipe for target 'all' failed
make[2]: *** [all] Error 2
/tmp/UB1804-64_K4.15.0_Clang6.0.0/x86_64-native-linuxapp-clang/b34fabe9464043f7a12be6a19e71b855/dpdk/mk/rte.sdkinstall.mk:60: recipe for target 'pre_install' failed
make[1]: *** [pre_install] Error 2
/tmp/UB1804-64_K4.15.0_Clang6.0.0/x86_64-native-linuxapp-clang/b34fabe9464043f7a12be6a19e71b855/dpdk/mk/rte.sdkroot.mk:77: recipe for target 'install' failed
make: *** [install] Error 2


*Make Build Failed #6:
OS: FC30-64
Target: x86_64-native-linuxapp-gcc
  123 | static int atl_dev_info_get(struct rte_eth_dev *dev,
      |            ^~~~~~~~~~~~~~~~
/tmp/FC30-64_K4.20_GCC9.1.1/x86_64-native-linuxapp-gcc/b34fabe9464043f7a12be6a19e71b855/dpdk/drivers/net/atlantic/atl_ethdev.c:48:13: note: previous declaration of ‘atl_dev_info_get’ was here
   48 | static void atl_dev_info_get(struct rte_eth_dev *dev,
      |             ^~~~~~~~~~~~~~~~
make[6]: *** [/tmp/FC30-64_K4.20_GCC9.1.1/x86_64-native-linuxapp-gcc/b34fabe9464043f7a12be6a19e71b855/dpdk/mk/internal/rte.compile-pre.mk:116: atl_ethdev.o] Error 1
make[6]: *** Waiting for unfinished jobs....
  CC otx_cryptodev_ops.o
  PMDINFO qat_device.o.pmd.c
  CC qat_device.o.pmd.o
  AR librte_pmd_openssl.a
--
== Build drivers/net/axgbe
  CC scheduler_pkt_size_distr.o
  CC mc/dpseci.o
  CC scheduler_failover.o
  SYMLINK-FILE include/rte_avp_common.h
make[5]: *** [/tmp/FC30-64_K4.20_GCC9.1.1/x86_64-native-linuxapp-gcc/b34fabe9464043f7a12be6a19e71b855/dpdk/mk/rte.subdir.mk:37: atlantic] Error 2
make[5]: *** Waiting for unfinished jobs....
== Build drivers/net/bnx2x
  SYMLINK-FILE include/rte_avp_fifo.h
  CC qat_logs.o
  CC avp_ethdev.o
--
  INSTALL-LIB librte_pmd_caam_jr.a
  AR librte_pmd_octeontx_crypto.a
  INSTALL-LIB librte_pmd_octeontx_crypto.a
  AR librte_pmd_bnx2x.a
  INSTALL-LIB librte_pmd_bnx2x.a
make[4]: *** [/tmp/FC30-64_K4.20_GCC9.1.1/x86_64-native-linuxapp-gcc/b34fabe9464043f7a12be6a19e71b855/dpdk/mk/rte.subdir.mk:35: net] Error 2
make[3]: *** [/tmp/FC30-64_K4.20_GCC9.1.1/x86_64-native-linuxapp-gcc/b34fabe9464043f7a12be6a19e71b855/dpdk/mk/rte.sdkbuild.mk:46: drivers] Error 2
make[2]: *** [/tmp/FC30-64_K4.20_GCC9.1.1/x86_64-native-linuxapp-gcc/b34fabe9464043f7a12be6a19e71b855/dpdk/mk/rte.sdkroot.mk:99: all] Error 2
make[1]: *** [/tmp/FC30-64_K4.20_GCC9.1.1/x86_64-native-linuxapp-gcc/b34fabe9464043f7a12be6a19e71b855/dpdk/mk/rte.sdkinstall.mk:61: pre_install] Error 2
make: *** [/tmp/FC30-64_K4.20_GCC9.1.1/x86_64-native-linuxapp-gcc/b34fabe9464043f7a12be6a19e71b855/dpdk/mk/rte.sdkroot.mk:77: install] Error 2


*Make Build Failed #7:
OS: SUSE15-64
Target: x86_64-native-linuxapp-gcc
  LD otx_zip_pmd.o
== Build drivers/compress/zlib
  CC ark_ethdev_rx.o
  AR librte_pmd_octeontx_zip.a
  INSTALL-LIB librte_pmd_octeontx_zip.a
make[6]: *** [/tmp/SUSE15-64_K4.12.14_GCC7.3.1/x86_64-native-linuxapp-gcc/b34fabe9464043f7a12be6a19e71b855/dpdk/mk/internal/rte.compile-pre.mk:116: atl_ethdev.o] Error 1
make[6]: *** Waiting for unfinished jobs....
  CC atl_hw_regs.o
  CC ark_ethdev_tx.o
  PMDINFO qat_device.o.pmd.c
  CC qat_device.o.pmd.o
--
  CC qat_logs.o
  AR librte_pmd_crypto_scheduler.a
  INSTALL-LIB librte_pmd_crypto_scheduler.a
  CC ark_mpu.o
== Build drivers/crypto/caam_jr
make[5]: *** [/tmp/SUSE15-64_K4.12.14_GCC7.3.1/x86_64-native-linuxapp-gcc/b34fabe9464043f7a12be6a19e71b855/dpdk/mk/rte.subdir.mk:37: atlantic] Error 2
make[5]: *** Waiting for unfinished jobs....
  CC qat_qp.o
== Build drivers/crypto/virtio
  CC ark_pktchkr.o
  CC ark_pktdir.o
--
  CC ark_udm.o
  AR librte_pmd_octeontx_crypto.a
  INSTALL-LIB librte_pmd_octeontx_crypto.a
  AR librte_pmd_ark.a
  INSTALL-LIB librte_pmd_ark.a
make[4]: *** [/tmp/SUSE15-64_K4.12.14_GCC7.3.1/x86_64-native-linuxapp-gcc/b34fabe9464043f7a12be6a19e71b855/dpdk/mk/rte.subdir.mk:35: net] Error 2
make[4]: *** Waiting for unfinished jobs....
  CC caam_jr.o
  CC caam_jr_capabilities.o
  CC caam_jr_hw.o
  CC caam_jr_uio.o
--
  PMDINFO caam_jr.o.pmd.c
  CC caam_jr.o.pmd.o
  LD caam_jr.o
  AR librte_pmd_caam_jr.a
  INSTALL-LIB librte_pmd_caam_jr.a
make[3]: *** [/tmp/SUSE15-64_K4.12.14_GCC7.3.1/x86_64-native-linuxapp-gcc/b34fabe9464043f7a12be6a19e71b855/dpdk/mk/rte.sdkbuild.mk:46: drivers] Error 2
make[2]: *** [/tmp/SUSE15-64_K4.12.14_GCC7.3.1/x86_64-native-linuxapp-gcc/b34fabe9464043f7a12be6a19e71b855/dpdk/mk/rte.sdkroot.mk:99: all] Error 2
make[1]: *** [/tmp/SUSE15-64_K4.12.14_GCC7.3.1/x86_64-native-linuxapp-gcc/b34fabe9464043f7a12be6a19e71b855/dpdk/mk/rte.sdkinstall.mk:61: pre_install] Error 2
make: *** [/tmp/SUSE15-64_K4.12.14_GCC7.3.1/x86_64-native-linuxapp-gcc/b34fabe9464043f7a12be6a19e71b855/dpdk/mk/rte.sdkroot.mk:77: install] Error 2


*Make Build Failed #8:
OS: SUSE15-64
Target: x86_64-native-linuxapp-clang
            ^
/tmp/SUSE15-64_K4.12.14_Clang5.0.1/x86_64-native-linuxapp-clang/b34fabe9464043f7a12be6a19e71b855/dpdk/drivers/net/atlantic/atl_ethdev.c:1611:6: error: assigning to 'int' from incompatible type 'void'
        ret = atl_dev_info_get(dev, &dev_info);
            ^ ~~~~~~~~~~~~~~~~~~~~~~~~~~~~~~~~
4 errors generated.
make[6]: *** [/tmp/SUSE15-64_K4.12.14_Clang5.0.1/x86_64-native-linuxapp-clang/b34fabe9464043f7a12be6a19e71b855/dpdk/mk/internal/rte.compile-pre.mk:116: atl_ethdev.o] Error 1
make[6]: *** Waiting for unfinished jobs....
== Build drivers/net/bnx2x
  CC rte_aesni_mb_pmd_ops.o
  CC qat_sym_session.o
  SYMLINK-FILE include/fpga_lte_fec.h
  CC axgbe_ethdev.o
make[5]: *** [/tmp/SUSE15-64_K4.12.14_Clang5.0.1/x86_64-native-linuxapp-clang/b34fabe9464043f7a12be6a19e71b855/dpdk/mk/rte.subdir.mk:37: atlantic] Error 2
make[5]: *** Waiting for unfinished jobs....
  CC fpga_lte_fec.o
  AR librte_pmd_isal_comp.a
  CC axgbe_dev.o
  INSTALL-LIB librte_pmd_isal_comp.a
--
  CC caam_jr_hw.o
  CC scheduler_multicore.o
  CC caam_jr_uio.o
  AR librte_pmd_bnx2x.a
  INSTALL-LIB librte_pmd_bnx2x.a
make[4]: *** [/tmp/SUSE15-64_K4.12.14_Clang5.0.1/x86_64-native-linuxapp-clang/b34fabe9464043f7a12be6a19e71b855/dpdk/mk/rte.subdir.mk:35: net] Error 2
make[4]: *** Waiting for unfinished jobs....
  PMDINFO virtio_cryptodev.o.pmd.c
  CC virtio_cryptodev.o.pmd.o
  LD virtio_cryptodev.o
  AR librte_pmd_virtio_crypto.a
--
  PMDINFO dpaa_sec.o.pmd.c
  CC dpaa_sec.o.pmd.o
  LD dpaa_sec.o
  AR librte_pmd_dpaa_sec.a
  INSTALL-LIB librte_pmd_dpaa_sec.a
make[3]: *** [/tmp/SUSE15-64_K4.12.14_Clang5.0.1/x86_64-native-linuxapp-clang/b34fabe9464043f7a12be6a19e71b855/dpdk/mk/rte.sdkbuild.mk:46: drivers] Error 2
make[2]: *** [/tmp/SUSE15-64_K4.12.14_Clang5.0.1/x86_64-native-linuxapp-clang/b34fabe9464043f7a12be6a19e71b855/dpdk/mk/rte.sdkroot.mk:99: all] Error 2
make[1]: *** [/tmp/SUSE15-64_K4.12.14_Clang5.0.1/x86_64-native-linuxapp-clang/b34fabe9464043f7a12be6a19e71b855/dpdk/mk/rte.sdkinstall.mk:61: pre_install] Error 2
make: *** [/tmp/SUSE15-64_K4.12.14_Clang5.0.1/x86_64-native-linuxapp-clang/b34fabe9464043f7a12be6a19e71b855/dpdk/mk/rte.sdkroot.mk:77: install] Error 2


*Make Build Failed #9:
OS: RHEL76-64
Target: x86_64-native-linuxapp-gcc
/tmp/RHEL76-64_K3.10.0_GCC4.8.5/x86_64-native-linuxapp-gcc/b34fabe9464043f7a12be6a19e71b855/dpdk/drivers/net/atlantic/atl_ethdev.c:48:13: note: previous declaration of ‘atl_dev_info_get’ was here
 static void atl_dev_info_get(struct rte_eth_dev *dev,
             ^
cc1: error: unrecognized command line option "-Wno-address-of-packed-member" [-Werror]
cc1: all warnings being treated as errors
make[6]: *** [atl_ethdev.o] Error 1
make[6]: *** Waiting for unfinished jobs....
  AR librte_pmd_bbdev_null.a
  INSTALL-LIB librte_pmd_bbdev_null.a
  INSTALL-LIB librte_pmd_af_packet.a
  CC ark_ethdev.o
--
  CC otx_cryptodev.o.pmd.o
  LD otx_cryptodev.o
  CC isal_compress_pmd_ops.o
  CC ark_ethdev_rx.o
  CC otx_cryptodev_capabilities.o
make[5]: *** [atlantic] Error 2
make[5]: *** Waiting for unfinished jobs....
  CC otx_cryptodev_hw_access.o
  AR librte_pmd_aesni_mb.a
  INSTALL-LIB librte_pmd_aesni_mb.a
== Build drivers/crypto/scheduler
--
  INSTALL-LIB librte_pmd_zlib.a
  CC scheduler_pkt_size_distr.o
  AR librte_pmd_axgbe.a
  INSTALL-LIB librte_pmd_axgbe.a
  AR librte_pmd_fpga_lte_fec.a
make[4]: *** [net] Error 2
make[4]: *** Waiting for unfinished jobs....
  CC scheduler_failover.o
  CC scheduler_multicore.o
  INSTALL-LIB librte_pmd_fpga_lte_fec.a
  CC dpaa2_sec_dpseci.o
--
  LD dpaa_sec.o
  AR librte_pmd_dpaa2_sec.a
  INSTALL-LIB librte_pmd_dpaa2_sec.a
  AR librte_pmd_dpaa_sec.a
  INSTALL-LIB librte_pmd_dpaa_sec.a
make[3]: *** [drivers] Error 2
make[2]: *** [all] Error 2
make[1]: *** [pre_install] Error 2
make: *** [install] Error 2


*Make Build Failed #10:
OS: FC30-64
Target: x86_64-native-linuxapp-clang
  PMDINFO axgbe_ethdev.o.pmd.c
  CC axgbe_ethdev.o.pmd.o
  SYMLINK-FILE include/fpga_lte_fec.h
  LD axgbe_ethdev.o
  CC fpga_lte_fec.o
make[6]: *** [/tmp/FC30-64_K4.20_Clang8.0.0/x86_64-native-linuxapp-clang/b34fabe9464043f7a12be6a19e71b855/dpdk/mk/internal/rte.compile-pre.mk:116: atl_ethdev.o] Error 1
make[6]: *** Waiting for unfinished jobs....
  CC atl_hw_regs.o
== Build drivers/crypto/scheduler
  CC qat_common.o
  PMDINFO qat_device.o.pmd.c
--
  PMDINFO fpga_lte_fec.o.pmd.c
  CC fpga_lte_fec.o.pmd.o
  LD fpga_lte_fec.o
  AR librte_pmd_fpga_lte_fec.a
  INSTALL-LIB librte_pmd_fpga_lte_fec.a
make[5]: *** [/tmp/FC30-64_K4.20_Clang8.0.0/x86_64-native-linuxapp-clang/b34fabe9464043f7a12be6a19e71b855/dpdk/mk/rte.subdir.mk:37: atlantic] Error 2
make[5]: *** Waiting for unfinished jobs....
  CC qat_qp.o
== Build drivers/net/bonding
  CC zlib_pmd_ops.o
  PMDINFO zlib_pmd.o.pmd.c
--
  INSTALL-LIB librte_pmd_virtio_crypto.a
  AR librte_pmd_bond.a
  INSTALL-LIB librte_pmd_bond.a
  AR librte_pmd_bnx2x.a
  INSTALL-LIB librte_pmd_bnx2x.a
make[4]: *** [/tmp/FC30-64_K4.20_Clang8.0.0/x86_64-native-linuxapp-clang/b34fabe9464043f7a12be6a19e71b855/dpdk/mk/rte.subdir.mk:35: net] Error 2
make[3]: *** [/tmp/FC30-64_K4.20_Clang8.0.0/x86_64-native-linuxapp-clang/b34fabe9464043f7a12be6a19e71b855/dpdk/mk/rte.sdkbuild.mk:46: drivers] Error 2
make[2]: *** [/tmp/FC30-64_K4.20_Clang8.0.0/x86_64-native-linuxapp-clang/b34fabe9464043f7a12be6a19e71b855/dpdk/mk/rte.sdkroot.mk:99: all] Error 2
make[1]: *** [/tmp/FC30-64_K4.20_Clang8.0.0/x86_64-native-linuxapp-clang/b34fabe9464043f7a12be6a19e71b855/dpdk/mk/rte.sdkinstall.mk:61: pre_install] Error 2
make: *** [/tmp/FC30-64_K4.20_Clang8.0.0/x86_64-native-linuxapp-clang/b34fabe9464043f7a12be6a19e71b855/dpdk/mk/rte.sdkroot.mk:77: install] Error 2


*Make Build Failed #11:
OS: RHEL80-64
Target: x86_64-native-linuxapp-gcc
 static void atl_dev_info_get(struct rte_eth_dev *dev,
             ^~~~~~~~~~~~~~~~
  CC qat_logs.o
cc1: error: unrecognized command line option ‘-Wno-address-of-packed-member’ [-Werror]
cc1: all warnings being treated as errors
make[6]: *** [/tmp/RHEL80-64_K3.10.0_GCC8.2.1/x86_64-native-linuxapp-gcc/b34fabe9464043f7a12be6a19e71b855/dpdk/mk/internal/rte.compile-pre.mk:116: atl_ethdev.o] Error 1
make[5]: *** [/tmp/RHEL80-64_K3.10.0_GCC8.2.1/x86_64-native-linuxapp-gcc/b34fabe9464043f7a12be6a19e71b855/dpdk/mk/rte.subdir.mk:37: atlantic] Error 2
make[5]: *** Waiting for unfinished jobs....
  CC qat_qp.o
  CC ark_mpu.o
  SYMLINK-FILE include/rte_avp_common.h
  CC ark_pktchkr.o
--
  LD dpaa_sec.o
  AR librte_pmd_dpaa_sec.a
  INSTALL-LIB librte_pmd_dpaa_sec.a
  AR librte_pmd_bond.a
  INSTALL-LIB librte_pmd_bond.a
make[4]: *** [/tmp/RHEL80-64_K3.10.0_GCC8.2.1/x86_64-native-linuxapp-gcc/b34fabe9464043f7a12be6a19e71b855/dpdk/mk/rte.subdir.mk:35: net] Error 2
make[3]: *** [/tmp/RHEL80-64_K3.10.0_GCC8.2.1/x86_64-native-linuxapp-gcc/b34fabe9464043f7a12be6a19e71b855/dpdk/mk/rte.sdkbuild.mk:46: drivers] Error 2
make[2]: *** [/tmp/RHEL80-64_K3.10.0_GCC8.2.1/x86_64-native-linuxapp-gcc/b34fabe9464043f7a12be6a19e71b855/dpdk/mk/rte.sdkroot.mk:99: all] Error 2
make[1]: *** [/tmp/RHEL80-64_K3.10.0_GCC8.2.1/x86_64-native-linuxapp-gcc/b34fabe9464043f7a12be6a19e71b855/dpdk/mk/rte.sdkinstall.mk:61: pre_install] Error 2
make: *** [/tmp/RHEL80-64_K3.10.0_GCC8.2.1/x86_64-native-linuxapp-gcc/b34fabe9464043f7a12be6a19e71b855/dpdk/mk/rte.sdkroot.mk:77: install] Error 2


*Make Build Failed #12:
OS: UB1604-64
Target: x86_64-native-linuxapp-gcc
  AR librte_pmd_avp.a
  INSTALL-LIB librte_pmd_avp.a
make[6]: warning:  Clock skew detected.  Your build may be incomplete.
  CC ark_ethdev_tx.o
== Build drivers/net/bnx2x
/tmp/UB1604-64_K4.4.0_GCC5.4.0/x86_64-native-linuxapp-gcc/b34fabe9464043f7a12be6a19e71b855/dpdk/mk/internal/rte.compile-pre.mk:114: recipe for target 'atl_ethdev.o' failed
make[6]: *** [atl_ethdev.o] Error 1
/tmp/UB1604-64_K4.4.0_GCC5.4.0/x86_64-native-linuxapp-gcc/b34fabe9464043f7a12be6a19e71b855/dpdk/mk/rte.subdir.mk:35: recipe for target 'atlantic' failed
make[5]: *** [atlantic] Error 2
make[5]: *** Waiting for unfinished jobs....
  CC axgbe_i2c.o
  AR librte_pmd_aesni_mb.a
  CC qat_sym_session.o
  CC qat_sym_pmd.o
--
  AR librte_pmd_virtio_crypto.a
  INSTALL-LIB librte_pmd_virtio_crypto.a
  AR librte_pmd_bnx2x.a
  INSTALL-LIB librte_pmd_bnx2x.a
make[6]: warning:  Clock skew detected.  Your build may be incomplete.
/tmp/UB1604-64_K4.4.0_GCC5.4.0/x86_64-native-linuxapp-gcc/b34fabe9464043f7a12be6a19e71b855/dpdk/mk/rte.subdir.mk:35: recipe for target 'net' failed
make[4]: *** [net] Error 2
make[4]: *** Waiting for unfinished jobs....
  PMDINFO caam_jr.o.pmd.c
  CC caam_jr.o.pmd.o
  LD caam_jr.o
  PMDINFO dpaa_sec.o.pmd.c
--
  PMDINFO dpaa2_sec_dpseci.o.pmd.c
  CC dpaa2_sec_dpseci.o.pmd.o
  LD dpaa2_sec_dpseci.o
  AR librte_pmd_dpaa2_sec.a
  INSTALL-LIB librte_pmd_dpaa2_sec.a
/tmp/UB1604-64_K4.4.0_GCC5.4.0/x86_64-native-linuxapp-gcc/b34fabe9464043f7a12be6a19e71b855/dpdk/mk/rte.sdkbuild.mk:46: recipe for target 'drivers' failed
make[3]: *** [drivers] Error 2
/tmp/UB1604-64_K4.4.0_GCC5.4.0/x86_64-native-linuxapp-gcc/b34fabe9464043f7a12be6a19e71b855/dpdk/mk/rte.sdkroot.mk:98: recipe for target 'all' failed
make[2]: *** [all] Error 2
/tmp/UB1604-64_K4.4.0_GCC5.4.0/x86_64-native-linuxapp-gcc/b34fabe9464043f7a12be6a19e71b855/dpdk/mk/rte.sdkinstall.mk:60: recipe for target 'pre_install' failed
make[1]: *** [pre_install] Error 2
/tmp/UB1604-64_K4.4.0_GCC5.4.0/x86_64-native-linuxapp-gcc/b34fabe9464043f7a12be6a19e71b855/dpdk/mk/rte.sdkroot.mk:77: recipe for target 'install' failed
make: *** [install] Error 2


*Make Build Failed #13:
OS: UB1804-64
Target: x86_64-native-linuxapp-gcc
  PMDINFO avp_ethdev.o.pmd.c
  CC avp_ethdev.o.pmd.o
cc1: error: unrecognized command line option ‘-Wno-address-of-packed-member’ [-Werror]
cc1: all warnings being treated as errors
  AR librte_pmd_null_crypto.a
/tmp/UB1804-64_K4.15.0_GCC7.3.0/x86_64-native-linuxapp-gcc/b34fabe9464043f7a12be6a19e71b855/dpdk/mk/internal/rte.compile-pre.mk:114: recipe for target 'atl_ethdev.o' failed
make[6]: *** [atl_ethdev.o] Error 1
/tmp/UB1804-64_K4.15.0_GCC7.3.0/x86_64-native-linuxapp-gcc/b34fabe9464043f7a12be6a19e71b855/dpdk/mk/rte.subdir.mk:35: recipe for target 'atlantic' failed
make[5]: *** [atlantic] Error 2
make[5]: *** Waiting for unfinished jobs....
  INSTALL-LIB librte_pmd_null_crypto.a
  CC scheduler_roundrobin.o
  LD avp_ethdev.o
  CC scheduler_pkt_size_distr.o
--
  AR librte_pmd_octeontx_crypto.a
  INSTALL-LIB librte_pmd_octeontx_crypto.a
  AR librte_pmd_bnx2x.a
  INSTALL-LIB librte_pmd_bnx2x.a
make[6]: warning:  Clock skew detected.  Your build may be incomplete.
/tmp/UB1804-64_K4.15.0_GCC7.3.0/x86_64-native-linuxapp-gcc/b34fabe9464043f7a12be6a19e71b855/dpdk/mk/rte.subdir.mk:35: recipe for target 'net' failed
make[4]: *** [net] Error 2
/tmp/UB1804-64_K4.15.0_GCC7.3.0/x86_64-native-linuxapp-gcc/b34fabe9464043f7a12be6a19e71b855/dpdk/mk/rte.sdkbuild.mk:46: recipe for target 'drivers' failed
make[3]: *** [drivers] Error 2
/tmp/UB1804-64_K4.15.0_GCC7.3.0/x86_64-native-linuxapp-gcc/b34fabe9464043f7a12be6a19e71b855/dpdk/mk/rte.sdkroot.mk:98: recipe for target 'all' failed
make[2]: *** [all] Error 2
/tmp/UB1804-64_K4.15.0_GCC7.3.0/x86_64-native-linuxapp-gcc/b34fabe9464043f7a12be6a19e71b855/dpdk/mk/rte.sdkinstall.mk:60: recipe for target 'pre_install' failed
make[1]: *** [pre_install] Error 2
/tmp/UB1804-64_K4.15.0_GCC7.3.0/x86_64-native-linuxapp-gcc/b34fabe9464043f7a12be6a19e71b855/dpdk/mk/rte.sdkroot.mk:77: recipe for target 'install' failed
make: *** [install] Error 2


*Make Build Failed #14:
OS: FreeBSD12-64
Target: x86_64-native-bsdapp-gcc+debug
             ^~~~~~~~~~~~~~~~
  AR librte_pmd_bbdev_turbo_sw.a
  INSTALL-LIB librte_pmd_bbdev_turbo_sw.a
cc1: error: unrecognized command line option '-Wno-address-of-packed-member' [-Werror]
cc1: all warnings being treated as errors
gmake[6]: *** [/tmp/FreeBSD12-64_K19.02_GCC7.3.0/x86_64-native-bsdapp-gcc+debug/b34fabe9464043f7a12be6a19e71b855/dpdk/mk/internal/rte.compile-pre.mk:116: atl_ethdev.o] Error 1
gmake[6]: *** Waiting for unfinished jobs....
  LD ark_ethdev.o
  CC qat_sym_pmd.o
  CC ark_ethdev_rx.o
  AR librte_pmd_isal_comp.a
--
  CC axgbe_mdio.o
== Build drivers/crypto/openssl
== Build drivers/net/bonding
  CC otx_cryptodev_mbox.o
  CC ark_ethdev_tx.o
gmake[5]: *** [/tmp/FreeBSD12-64_K19.02_GCC7.3.0/x86_64-native-bsdapp-gcc+debug/b34fabe9464043f7a12be6a19e71b855/dpdk/mk/rte.subdir.mk:37: atlantic] Error 2
gmake[5]: *** Waiting for unfinished jobs....
  CC bnx2x_stats.o
  CC otx_cryptodev_ops.o
  CC qat_device.o
  CC axgbe_phy_impl.o
--
  LD otx_zip_pmd.o
  AR librte_pmd_octeontx_zip.a
  INSTALL-LIB librte_pmd_octeontx_zip.a
  AR librte_pmd_bnx2x.a
  INSTALL-LIB librte_pmd_bnx2x.a
gmake[4]: *** [/tmp/FreeBSD12-64_K19.02_GCC7.3.0/x86_64-native-bsdapp-gcc+debug/b34fabe9464043f7a12be6a19e71b855/dpdk/mk/rte.subdir.mk:35: net] Error 2
gmake[3]: *** [/tmp/FreeBSD12-64_K19.02_GCC7.3.0/x86_64-native-bsdapp-gcc+debug/b34fabe9464043f7a12be6a19e71b855/dpdk/mk/rte.sdkbuild.mk:46: drivers] Error 2
gmake[2]: *** [/tmp/FreeBSD12-64_K19.02_GCC7.3.0/x86_64-native-bsdapp-gcc+debug/b34fabe9464043f7a12be6a19e71b855/dpdk/mk/rte.sdkroot.mk:99: all] Error 2
gmake[1]: *** [/tmp/FreeBSD12-64_K19.02_GCC7.3.0/x86_64-native-bsdapp-gcc+debug/b34fabe9464043f7a12be6a19e71b855/dpdk/mk/rte.sdkinstall.mk:61: pre_install] Error 2
gmake: *** [/tmp/FreeBSD12-64_K19.02_GCC7.3.0/x86_64-native-bsdapp-gcc+debug/b34fabe9464043f7a12be6a19e71b855/dpdk/mk/rte.sdkroot.mk:77: install] Error 2


*Make Build Failed #15:
OS: CENTOS76-64
Target: x86_64-native-linuxapp-clang
            ^
/tmp/CENTOS76-64_K3.10.0_Clang3.4.2/x86_64-native-linuxapp-clang/b34fabe9464043f7a12be6a19e71b855/dpdk/drivers/net/atlantic/atl_ethdev.c:1611:6: error: assigning to 'int' from incompatible type 'void'
        ret = atl_dev_info_get(dev, &dev_info);
            ^ ~~~~~~~~~~~~~~~~~~~~~~~~~~~~~~~~
4 errors generated.
make[6]: *** [atl_ethdev.o] Error 1
make[5]: *** [atlantic] Error 2
make[5]: *** Waiting for unfinished jobs....
  CC ark_mpu.o
  LD bbdev_turbo_software.o
  CC rte_openssl_pmd_ops.o
  SYMLINK-FILE include/rte_cryptodev_scheduler.h
--
  AR librte_pmd_avp.a
  INSTALL-LIB librte_pmd_null_crypto.a
  INSTALL-LIB librte_pmd_avp.a
== Build drivers/crypto/caam_jr
== Build drivers/crypto/virtio
make[4]: *** [net] Error 2
make[4]: *** Waiting for unfinished jobs....
  CC mc/dpseci.o
  CC dpaa_sec.o
  CC scheduler_pkt_size_distr.o
  CC scheduler_failover.o
--
  PMDINFO dpaa_sec.o.pmd.c
  CC dpaa_sec.o.pmd.o
  LD dpaa_sec.o
  AR librte_pmd_dpaa_sec.a
  INSTALL-LIB librte_pmd_dpaa_sec.a
make[3]: *** [drivers] Error 2
make[2]: *** [all] Error 2
make[1]: *** [pre_install] Error 2
make: *** [install] Error 2


*Make Build Failed #16:
OS: FreeBSD12-64
Target: x86_64-native-bsdapp-gcc
/tmp/FreeBSD12-64_K19.02_GCC7.3.0/x86_64-native-bsdapp-gcc/b34fabe9464043f7a12be6a19e71b855/dpdk/drivers/net/atlantic/atl_ethdev.c:48:13: note: previous declaration of 'atl_dev_info_get' was here
 static void atl_dev_info_get(struct rte_eth_dev *dev,
             ^~~~~~~~~~~~~~~~
cc1: error: unrecognized command line option '-Wno-address-of-packed-member' [-Werror]
cc1: all warnings being treated as errors
gmake[6]: *** [/tmp/FreeBSD12-64_K19.02_GCC7.3.0/x86_64-native-bsdapp-gcc/b34fabe9464043f7a12be6a19e71b855/dpdk/mk/internal/rte.compile-pre.mk:114: atl_ethdev.o] Error 1
gmake[5]: *** [/tmp/FreeBSD12-64_K19.02_GCC7.3.0/x86_64-native-bsdapp-gcc/b34fabe9464043f7a12be6a19e71b855/dpdk/mk/rte.subdir.mk:37: atlantic] Error 2
gmake[5]: *** Waiting for unfinished jobs....
  LD qat_device.o
  CC ark_ethdev_tx.o
  CC axgbe_i2c.o
  CC ark_mpu.o
--
  LD virtio_cryptodev.o
  AR librte_pmd_virtio_crypto.a
  INSTALL-LIB librte_pmd_virtio_crypto.a
  AR librte_pmd_bnx2x.a
  INSTALL-LIB librte_pmd_bnx2x.a
gmake[4]: *** [/tmp/FreeBSD12-64_K19.02_GCC7.3.0/x86_64-native-bsdapp-gcc/b34fabe9464043f7a12be6a19e71b855/dpdk/mk/rte.subdir.mk:35: net] Error 2
gmake[3]: *** [/tmp/FreeBSD12-64_K19.02_GCC7.3.0/x86_64-native-bsdapp-gcc/b34fabe9464043f7a12be6a19e71b855/dpdk/mk/rte.sdkbuild.mk:46: drivers] Error 2
gmake[2]: *** [/tmp/FreeBSD12-64_K19.02_GCC7.3.0/x86_64-native-bsdapp-gcc/b34fabe9464043f7a12be6a19e71b855/dpdk/mk/rte.sdkroot.mk:99: all] Error 2
gmake[1]: *** [/tmp/FreeBSD12-64_K19.02_GCC7.3.0/x86_64-native-bsdapp-gcc/b34fabe9464043f7a12be6a19e71b855/dpdk/mk/rte.sdkinstall.mk:61: pre_install] Error 2
gmake: *** [/tmp/FreeBSD12-64_K19.02_GCC7.3.0/x86_64-native-bsdapp-gcc/b34fabe9464043f7a12be6a19e71b855/dpdk/mk/rte.sdkroot.mk:77: install] Error 2


*Make Build Failed #17:
OS: CENTOS76-64
Target: x86_64-native-linuxapp-gcc
/tmp/CENTOS76-64_K3.10.0_GCC4.8.5/x86_64-native-linuxapp-gcc/b34fabe9464043f7a12be6a19e71b855/dpdk/drivers/net/atlantic/atl_ethdev.c:48:13: note: previous declaration of ‘atl_dev_info_get’ was here
 static void atl_dev_info_get(struct rte_eth_dev *dev,
             ^
cc1: error: unrecognized command line option "-Wno-address-of-packed-member" [-Werror]
cc1: all warnings being treated as errors
make[6]: *** [atl_ethdev.o] Error 1
make[5]: *** [atlantic] Error 2
make[5]: *** Waiting for unfinished jobs....
  AR librte_pmd_avp.a
  CC ecore_sp.o
  INSTALL-LIB librte_pmd_avp.a
  CC elink.o
--
  LD rte_eth_bond_pmd.o
  AR librte_pmd_bond.a
  INSTALL-LIB librte_pmd_bond.a
  AR librte_pmd_bnx2x.a
  INSTALL-LIB librte_pmd_bnx2x.a
make[4]: *** [net] Error 2
make[3]: *** [drivers] Error 2
make[2]: *** [all] Error 2
make[1]: *** [pre_install] Error 2
make: *** [install] Error 2


*Make Build Failed #18:
OS: CENTOS76-64
Target: x86_64-native-linuxapp-icc
/tmp/CENTOS76-64_K3.10.0_ICC19.0.0/x86_64-native-linuxapp-icc/b34fabe9464043f7a12be6a19e71b855/dpdk/drivers/net/atlantic/atl_ethdev.c(1081): error #147: declaration is incompatible with "void atl_dev_info_get(struct rte_eth_dev *, struct rte_eth_dev_info *)" (declared at line 48)
  atl_dev_info_get(struct rte_eth_dev *dev, struct rte_eth_dev_info *dev_info)
  ^

compilation aborted for /tmp/CENTOS76-64_K3.10.0_ICC19.0.0/x86_64-native-linuxapp-icc/b34fabe9464043f7a12be6a19e71b855/dpdk/drivers/net/atlantic/atl_ethdev.c (code 2)
make[6]: *** [atl_ethdev.o] Error 2
make[6]: *** Waiting for unfinished jobs....
  LD dpaa2_sec_dpseci.o
== Build drivers/net/bnx2x
  CC mc/dpseci.o
  CC scheduler_multicore.o
  CC ark_mpu.o
  AR librte_pmd_crypto_scheduler.a
  INSTALL-LIB librte_pmd_crypto_scheduler.a
  CC ark_pktchkr.o
make[5]: *** [atlantic] Error 2
make[5]: *** Waiting for unfinished jobs....
  CC ark_pktdir.o
  AR librte_pmd_dpaa2_sec.a
  INSTALL-LIB librte_pmd_dpaa2_sec.a
  CC ark_pktgen.o
--
  LD bnx2x_ethdev.o
  AR librte_pmd_octeontx_crypto.a
  INSTALL-LIB librte_pmd_octeontx_crypto.a
  AR librte_pmd_bnx2x.a
  INSTALL-LIB librte_pmd_bnx2x.a
make[4]: *** [net] Error 2
make[3]: *** [drivers] Error 2
make[2]: *** [all] Error 2
make[1]: *** [pre_install] Error 2
make: *** [install] Error 2


*Make Build Failed #19:
OS: CENTOS76-64
Target: x86_64-native-linuxapp-gcc+debug
/tmp/CENTOS76-64_K3.10.0_GCC4.8.5/x86_64-native-linuxapp-gcc+debug/b34fabe9464043f7a12be6a19e71b855/dpdk/drivers/net/atlantic/atl_ethdev.c:48:13: note: previous declaration of ‘atl_dev_info_get’ was here
 static void atl_dev_info_get(struct rte_eth_dev *dev,
             ^
cc1: error: unrecognized command line option "-Wno-address-of-packed-member" [-Werror]
cc1: all warnings being treated as errors
make[6]: *** [atl_ethdev.o] Error 1
make[6]: *** Waiting for unfinished jobs....
  SYMLINK-FILE include/fpga_lte_fec.h
  CC ark_pktgen.o
  CC fpga_lte_fec.o
make[5]: *** [atlantic] Error 2
make[5]: *** Waiting for unfinished jobs....
  CC ark_rqp.o
  CC ark_udm.o
== Build drivers/crypto/openssl
  CC otx_zip_pmd.o
--
  PMDINFO null_crypto_pmd.o.pmd.c
  CC null_crypto_pmd.o.pmd.o
  LD null_crypto_pmd.o
  AR librte_pmd_avp.a
  INSTALL-LIB librte_pmd_avp.a
make[4]: *** [net] Error 2
make[4]: *** Waiting for unfinished jobs....
  CC rte_cryptodev_scheduler.o
  CC null_crypto_pmd_ops.o
  CC caam_jr.o
  CC mc/dpseci.o
--
  LD dpaa2_sec_dpseci.o
  AR librte_pmd_dpaa2_sec.a
  INSTALL-LIB librte_pmd_dpaa2_sec.a
  AR librte_pmd_octeontx_crypto.a
  INSTALL-LIB librte_pmd_octeontx_crypto.a
make[3]: *** [drivers] Error 2
make[2]: *** [all] Error 2
make[1]: *** [pre_install] Error 2
make: *** [install] Error 2


*Make Build Failed #20:
OS: CENTOS76-64
Target: x86_64-native-linuxapp-gcc+shared
 static void atl_dev_info_get(struct rte_eth_dev *dev,
             ^
== Build drivers/net/axgbe
cc1: error: unrecognized command line option "-Wno-address-of-packed-member" [-Werror]
cc1: all warnings being treated as errors
make[6]: *** [atl_ethdev.o] Error 1
make[5]: *** [atlantic] Error 2
make[5]: *** Waiting for unfinished jobs....
  CC caam_jr_uio.o
  CC ark_pktdir.o
  CC ark_pktgen.o
  CC ark_rqp.o
--
  LD dpaa_sec.o
  LD librte_pmd_dpaa_sec.so.1.1
  INSTALL-LIB librte_pmd_dpaa_sec.so.1.1
  LD librte_pmd_axgbe.so.1.1
  INSTALL-LIB librte_pmd_axgbe.so.1.1
make[4]: *** [net] Error 2
make[4]: *** Waiting for unfinished jobs....
  LD librte_pmd_octeontx_crypto.so.1.1
  PMDINFO dpaa2_sec_dpseci.o.pmd.c
  CC dpaa2_sec_dpseci.o.pmd.o
  LD dpaa2_sec_dpseci.o
  INSTALL-LIB librte_pmd_octeontx_crypto.so.1.1
  LD librte_pmd_dpaa2_sec.so.2.1
  INSTALL-LIB librte_pmd_dpaa2_sec.so.2.1
make[3]: *** [drivers] Error 2
make[2]: *** [all] Error 2
make[1]: *** [pre_install] Error 2
make: *** [install] Error 2


*Make Build Failed #21:
OS: FreeBSD12-64
Target: x86_64-native-bsdapp-clang
            ^
/tmp/FreeBSD12-64_K19.02_Clang6.0.1/x86_64-native-bsdapp-clang/b34fabe9464043f7a12be6a19e71b855/dpdk/drivers/net/atlantic/atl_ethdev.c:1611:6: error: assigning to 'int' from incompatible type 'void'
        ret = atl_dev_info_get(dev, &dev_info);
            ^ ~~~~~~~~~~~~~~~~~~~~~~~~~~~~~~~~
4 errors generated.
gmake[6]: *** [/tmp/FreeBSD12-64_K19.02_Clang6.0.1/x86_64-native-bsdapp-clang/b34fabe9464043f7a12be6a19e71b855/dpdk/mk/internal/rte.compile-pre.mk:114: atl_ethdev.o] Error 1
gmake[5]: *** [/tmp/FreeBSD12-64_K19.02_Clang6.0.1/x86_64-native-bsdapp-clang/b34fabe9464043f7a12be6a19e71b855/dpdk/mk/rte.subdir.mk:37: atlantic] Error 2
gmake[5]: *** Waiting for unfinished jobs....
  CC axgbe_i2c.o
== Build drivers/net/bonding
  CC ark_pktdir.o
  AR librte_pmd_zlib.a
--
  INSTALL-LIB librte_pmd_qat.a
  AR librte_pmd_bond.a
  INSTALL-LIB librte_pmd_bond.a
  AR librte_pmd_bnx2x.a
  INSTALL-LIB librte_pmd_bnx2x.a
gmake[4]: *** [/tmp/FreeBSD12-64_K19.02_Clang6.0.1/x86_64-native-bsdapp-clang/b34fabe9464043f7a12be6a19e71b855/dpdk/mk/rte.subdir.mk:35: net] Error 2
gmake[3]: *** [/tmp/FreeBSD12-64_K19.02_Clang6.0.1/x86_64-native-bsdapp-clang/b34fabe9464043f7a12be6a19e71b855/dpdk/mk/rte.sdkbuild.mk:46: drivers] Error 2
gmake[2]: *** [/tmp/FreeBSD12-64_K19.02_Clang6.0.1/x86_64-native-bsdapp-clang/b34fabe9464043f7a12be6a19e71b855/dpdk/mk/rte.sdkroot.mk:99: all] Error 2
gmake[1]: *** [/tmp/FreeBSD12-64_K19.02_Clang6.0.1/x86_64-native-bsdapp-clang/b34fabe9464043f7a12be6a19e71b855/dpdk/mk/rte.sdkinstall.mk:61: pre_install] Error 2
gmake: *** [/tmp/FreeBSD12-64_K19.02_Clang6.0.1/x86_64-native-bsdapp-clang/b34fabe9464043f7a12be6a19e71b855/dpdk/mk/rte.sdkroot.mk:77: install] Error 2


*Make Build Failed #22:
OS: FreeBSD12-64
Target: x86_64-native-bsdapp-gcc+shared
/tmp/FreeBSD12-64_K19.02_GCC7.3.0/x86_64-native-bsdapp-gcc+shared/b34fabe9464043f7a12be6a19e71b855/dpdk/drivers/net/atlantic/atl_ethdev.c:48:13: note: previous declaration of 'atl_dev_info_get' was here
 static void atl_dev_info_get(struct rte_eth_dev *dev,
             ^~~~~~~~~~~~~~~~
cc1: error: unrecognized command line option '-Wno-address-of-packed-member' [-Werror]
cc1: all warnings being treated as errors
gmake[6]: *** [/tmp/FreeBSD12-64_K19.02_GCC7.3.0/x86_64-native-bsdapp-gcc+shared/b34fabe9464043f7a12be6a19e71b855/dpdk/mk/internal/rte.compile-pre.mk:114: atl_ethdev.o] Error 1
gmake[5]: *** [/tmp/FreeBSD12-64_K19.02_GCC7.3.0/x86_64-native-bsdapp-gcc+shared/b34fabe9464043f7a12be6a19e71b855/dpdk/mk/rte.subdir.mk:37: atlantic] Error 2
gmake[5]: *** Waiting for unfinished jobs....
  CC ark_pktdir.o
  CC qat_logs.o
  CC qat_qp.o
  CC axgbe_ethdev.o
--
  INSTALL-LIB librte_pmd_octeontx_crypto.so.1.1
  LD librte_pmd_virtio_crypto.so.1.1
  INSTALL-LIB librte_pmd_virtio_crypto.so.1.1
  LD librte_pmd_bnx2x.so.1.1
  INSTALL-LIB librte_pmd_bnx2x.so.1.1
gmake[4]: *** [/tmp/FreeBSD12-64_K19.02_GCC7.3.0/x86_64-native-bsdapp-gcc+shared/b34fabe9464043f7a12be6a19e71b855/dpdk/mk/rte.subdir.mk:35: net] Error 2
gmake[3]: *** [/tmp/FreeBSD12-64_K19.02_GCC7.3.0/x86_64-native-bsdapp-gcc+shared/b34fabe9464043f7a12be6a19e71b855/dpdk/mk/rte.sdkbuild.mk:46: drivers] Error 2
gmake[2]: *** [/tmp/FreeBSD12-64_K19.02_GCC7.3.0/x86_64-native-bsdapp-gcc+shared/b34fabe9464043f7a12be6a19e71b855/dpdk/mk/rte.sdkroot.mk:99: all] Error 2
gmake[1]: *** [/tmp/FreeBSD12-64_K19.02_GCC7.3.0/x86_64-native-bsdapp-gcc+shared/b34fabe9464043f7a12be6a19e71b855/dpdk/mk/rte.sdkinstall.mk:61: pre_install] Error 2
gmake: *** [/tmp/FreeBSD12-64_K19.02_GCC7.3.0/x86_64-native-bsdapp-gcc+shared/b34fabe9464043f7a12be6a19e71b855/dpdk/mk/rte.sdkroot.mk:77: install] Error 2

*Meson Build Failed #1:
OS: SUSE15-64
Target:build-gcc-static
FAILED: drivers/a715181@@tmp_rte_pmd_atlantic at sta/net_atlantic_atl_ethdev.c.o 
gcc -Idrivers/a715181@@tmp_rte_pmd_atlantic at sta -Idrivers -I../drivers -Idrivers/net/atlantic -I../drivers/net/atlantic -Ilib/librte_ethdev -I../lib/librte_ethdev -I. -I../ -Iconfig -I../config -Ilib/librte_eal/common/include -I../lib/librte_eal/common/include -I../lib/librte_eal/linux/eal/include -Ilib/librte_eal/common -I../lib/librte_eal/common -Ilib/librte_eal/common/include/arch/x86 -I../lib/librte_eal/common/include/arch/x86 -Ilib/librte_eal -I../lib/librte_eal -Ilib/librte_kvargs -I../lib/librte_kvargs -Ilib/librte_net -I../lib/librte_net -Ilib/librte_mbuf -I../lib/librte_mbuf -Ilib/librte_mempool -I../lib/librte_mempool -Ilib/librte_ring -I../lib/librte_ring -Ilib/librte_meter -I../lib/librte_meter -Idrivers/bus/pci -I../drivers/bus/pci -I../drivers/bus/pci/linux -Ilib/librte_pci -I../lib/librte_pci -Idrivers/bus/vdev -I../drivers/bus/vdev -fdiagnostics-color=always -pipe -D_FILE_OFFSET_BITS=64 -Wall -Winvalid-pch -Werror -O3 -include rte_config.h -Wunused-parameter -Wsign-compare -Wcast-qual -D_GNU_SOURCE -fPIC -march=native -Wno-format-truncation -DALLOW_EXPERIMENTAL_API -MD -MQ 'drivers/a715181@@tmp_rte_pmd_atlantic at sta/net_atlantic_atl_ethdev.c.o' -MF 'drivers/a715181@@tmp_rte_pmd_atlantic at sta/net_atlantic_atl_ethdev.c.o.d' -o 'drivers/a715181@@tmp_rte_pmd_atlantic at sta/net_atlantic_atl_ethdev.c.o' -c ../drivers/net/atlantic/atl_ethdev.c
../drivers/net/atlantic/atl_ethdev.c:123:12: error: conflicting types for ‘atl_dev_info_get’
 static int atl_dev_info_get(struct rte_eth_dev *dev,
            ^~~~~~~~~~~~~~~~
../drivers/net/atlantic/atl_ethdev.c:48:13: note: previous declaration of ‘atl_dev_info_get’ was here
 static void atl_dev_info_get(struct rte_eth_dev *dev,
             ^~~~~~~~~~~~~~~~
[559/1831] Generating rte_pmd_ark.pmd.c with a custom command.
[560/1831] Compiling C object 'drivers/a715181@@tmp_rte_pmd_atlantic at sta/net_atlantic_hw_atl_hw_atl_b0.c.o'.
[561/1831] Compiling C object 'drivers/a715181@@tmp_rte_pmd_atlantic at sta/net_atlantic_hw_atl_hw_atl_utils_fw2x.c.o'.
[562/1831] Compiling C object 'drivers/a715181@@tmp_rte_pmd_atlantic at sta/net_atlantic_hw_atl_hw_atl_llh.c.o'.
[563/1831] Compiling C object 'drivers/a715181@@tmp_rte_pmd_atlantic at sta/net_atlantic_hw_atl_hw_atl_utils.c.o'.
[564/1831] Compiling C object 'drivers/a715181@@tmp_rte_pmd_atlantic at sta/net_atlantic_atl_rxtx.c.o'.
[565/1831] Compiling C object 'lib/76b5a35@@rte_pipeline at sta/librte_pipeline_rte_table_action.c.o'.
ninja: build stopped: subcommand failed




*Meson Build Failed #2:
OS: FC30-64
Target:build-gcc-static
FAILED: drivers/a715181@@tmp_rte_pmd_atlantic at sta/net_atlantic_atl_ethdev.c.o 
gcc -Idrivers/a715181@@tmp_rte_pmd_atlantic at sta -Idrivers -I../drivers -Idrivers/net/atlantic -I../drivers/net/atlantic -Ilib/librte_ethdev -I../lib/librte_ethdev -I. -I../ -Iconfig -I../config -Ilib/librte_eal/common/include -I../lib/librte_eal/common/include -I../lib/librte_eal/linux/eal/include -Ilib/librte_eal/common -I../lib/librte_eal/common -Ilib/librte_eal/common/include/arch/x86 -I../lib/librte_eal/common/include/arch/x86 -Ilib/librte_eal -I../lib/librte_eal -Ilib/librte_kvargs -I../lib/librte_kvargs -Ilib/librte_net -I../lib/librte_net -Ilib/librte_mbuf -I../lib/librte_mbuf -Ilib/librte_mempool -I../lib/librte_mempool -Ilib/librte_ring -I../lib/librte_ring -Ilib/librte_meter -I../lib/librte_meter -Idrivers/bus/pci -I../drivers/bus/pci -I../drivers/bus/pci/linux -Ilib/librte_pci -I../lib/librte_pci -Idrivers/bus/vdev -I../drivers/bus/vdev -fdiagnostics-color=always -pipe -D_FILE_OFFSET_BITS=64 -Wall -Winvalid-pch -Werror -O3 -include rte_config.h -Wunused-parameter -Wsign-compare -Wcast-qual -Wno-address-of-packed-member -D_GNU_SOURCE -fPIC -march=native -mno-avx512f -Wno-format-truncation -DALLOW_EXPERIMENTAL_API -MD -MQ 'drivers/a715181@@tmp_rte_pmd_atlantic at sta/net_atlantic_atl_ethdev.c.o' -MF 'drivers/a715181@@tmp_rte_pmd_atlantic at sta/net_atlantic_atl_ethdev.c.o.d' -o 'drivers/a715181@@tmp_rte_pmd_atlantic at sta/net_atlantic_atl_ethdev.c.o' -c ../drivers/net/atlantic/atl_ethdev.c
../drivers/net/atlantic/atl_ethdev.c:123:12: error: conflicting types for ‘atl_dev_info_get’
  123 | static int atl_dev_info_get(struct rte_eth_dev *dev,
      |            ^~~~~~~~~~~~~~~~
../drivers/net/atlantic/atl_ethdev.c:48:13: note: previous declaration of ‘atl_dev_info_get’ was here
   48 | static void atl_dev_info_get(struct rte_eth_dev *dev,
      |             ^~~~~~~~~~~~~~~~
[561/1784] Compiling C object 'drivers/a715181@@tmp_rte_pmd_atlantic at sta/net_atlantic_hw_atl_hw_atl_llh.c.o'.
[562/1784] Compiling C object 'drivers/a715181@@tmp_rte_pmd_ark at sta/net_ark_ark_pktgen.c.o'.
[563/1784] Compiling C object 'drivers/a715181@@tmp_rte_pmd_atlantic at sta/net_atlantic_hw_atl_hw_atl_utils.c.o'.
[564/1784] Compiling C object 'drivers/a715181@@tmp_rte_pmd_atlantic at sta/net_atlantic_rte_pmd_atlantic.c.o'.
[565/1784] Compiling C object 'drivers/a715181@@tmp_rte_pmd_atlantic at sta/net_atlantic_hw_atl_hw_atl_utils_fw2x.c.o'.
[566/1784] Compiling C object 'drivers/a715181@@tmp_rte_pmd_atlantic at sta/net_atlantic_atl_rxtx.c.o'.
[567/1784] Compiling C object 'lib/76b5a35@@rte_pipeline at sta/librte_pipeline_rte_table_action.c.o'.
ninja: build stopped: subcommand failed




*Meson Build Failed #3:
OS: UB1604-32
Target:build-gcc-static
FAILED: drivers/a715181@@tmp_rte_pmd_atlantic at sta/net_atlantic_atl_ethdev.c.o 
gcc -Idrivers/a715181@@tmp_rte_pmd_atlantic at sta -Idrivers -I../drivers -Idrivers/net/atlantic -I../drivers/net/atlantic -Ilib/librte_ethdev -I../lib/librte_ethdev -I. -I../ -Iconfig -I../config -Ilib/librte_eal/common/include -I../lib/librte_eal/common/include -I../lib/librte_eal/linux/eal/include -Ilib/librte_eal/common -I../lib/librte_eal/common -Ilib/librte_eal/common/include/arch/x86 -I../lib/librte_eal/common/include/arch/x86 -Ilib/librte_eal -I../lib/librte_eal -Ilib/librte_kvargs -I../lib/librte_kvargs -Ilib/librte_net -I../lib/librte_net -Ilib/librte_mbuf -I../lib/librte_mbuf -Ilib/librte_mempool -I../lib/librte_mempool -Ilib/librte_ring -I../lib/librte_ring -Ilib/librte_meter -I../lib/librte_meter -Idrivers/bus/pci -I../drivers/bus/pci -I../drivers/bus/pci/linux -Ilib/librte_pci -I../lib/librte_pci -Idrivers/bus/vdev -I../drivers/bus/vdev -fdiagnostics-color=always -pipe -D_FILE_OFFSET_BITS=64 -Wall -Winvalid-pch -Werror -O3 -include rte_config.h -Wunused-parameter -Wsign-compare -Wcast-qual -Wno-pointer-to-int-cast -D_GNU_SOURCE -fPIC -march=native -DALLOW_EXPERIMENTAL_API -MD -MQ 'drivers/a715181@@tmp_rte_pmd_atlantic at sta/net_atlantic_atl_ethdev.c.o' -MF 'drivers/a715181@@tmp_rte_pmd_atlantic at sta/net_atlantic_atl_ethdev.c.o.d' -o 'drivers/a715181@@tmp_rte_pmd_atlantic at sta/net_atlantic_atl_ethdev.c.o' -c ../drivers/net/atlantic/atl_ethdev.c
../drivers/net/atlantic/atl_ethdev.c:123:12: error: conflicting types for ‘atl_dev_info_get’
 static int atl_dev_info_get(struct rte_eth_dev *dev,
            ^
../drivers/net/atlantic/atl_ethdev.c:48:13: note: previous declaration of ‘atl_dev_info_get’ was here
 static void atl_dev_info_get(struct rte_eth_dev *dev,
             ^
[560/1656] Linking static target drivers/libtmp_rte_pmd_ark.a.
[561/1656] Compiling C object 'drivers/a715181@@tmp_rte_pmd_atlantic at sta/net_atlantic_hw_atl_hw_atl_utils_fw2x.c.o'.
[562/1656] Compiling C object 'drivers/a715181@@tmp_rte_pmd_atlantic at sta/net_atlantic_hw_atl_hw_atl_llh.c.o'.
[563/1656] Compiling C object 'drivers/a715181@@tmp_rte_pmd_atlantic at sta/net_atlantic_hw_atl_hw_atl_utils.c.o'.
[564/1656] Compiling C object 'drivers/a715181@@tmp_rte_pmd_atlantic at sta/net_atlantic_atl_rxtx.c.o'.
ninja: build stopped: subcommand failed




*Meson Build Failed #4:
OS: UB1804-64
Target:build-gcc-static
FAILED: drivers/a715181@@tmp_rte_pmd_atlantic at sta/net_atlantic_atl_ethdev.c.o 
gcc -Idrivers/a715181@@tmp_rte_pmd_atlantic at sta -Idrivers -I../drivers -Idrivers/net/atlantic -I../drivers/net/atlantic -Ilib/librte_ethdev -I../lib/librte_ethdev -I. -I../ -Iconfig -I../config -Ilib/librte_eal/common/include -I../lib/librte_eal/common/include -I../lib/librte_eal/linux/eal/include -Ilib/librte_eal/common -I../lib/librte_eal/common -Ilib/librte_eal/common/include/arch/x86 -I../lib/librte_eal/common/include/arch/x86 -Ilib/librte_eal -I../lib/librte_eal -Ilib/librte_kvargs -I../lib/librte_kvargs -Ilib/librte_net -I../lib/librte_net -Ilib/librte_mbuf -I../lib/librte_mbuf -Ilib/librte_mempool -I../lib/librte_mempool -Ilib/librte_ring -I../lib/librte_ring -Ilib/librte_meter -I../lib/librte_meter -Idrivers/bus/pci -I../drivers/bus/pci -I../drivers/bus/pci/linux -Ilib/librte_pci -I../lib/librte_pci -Idrivers/bus/vdev -I../drivers/bus/vdev -fdiagnostics-color=always -pipe -D_FILE_OFFSET_BITS=64 -Wall -Winvalid-pch -Werror -O3 -include rte_config.h -Wunused-parameter -Wsign-compare -Wcast-qual -D_GNU_SOURCE -fPIC -march=native -mno-avx512f -Wno-format-truncation -DALLOW_EXPERIMENTAL_API -MD -MQ 'drivers/a715181@@tmp_rte_pmd_atlantic at sta/net_atlantic_atl_ethdev.c.o' -MF 'drivers/a715181@@tmp_rte_pmd_atlantic at sta/net_atlantic_atl_ethdev.c.o.d' -o 'drivers/a715181@@tmp_rte_pmd_atlantic at sta/net_atlantic_atl_ethdev.c.o' -c ../drivers/net/atlantic/atl_ethdev.c
../drivers/net/atlantic/atl_ethdev.c:123:12: error: conflicting types for ‘atl_dev_info_get’
 static int atl_dev_info_get(struct rte_eth_dev *dev,
            ^~~~~~~~~~~~~~~~
../drivers/net/atlantic/atl_ethdev.c:48:13: note: previous declaration of ‘atl_dev_info_get’ was here
 static void atl_dev_info_get(struct rte_eth_dev *dev,
             ^~~~~~~~~~~~~~~~
[566/1791] Compiling C object 'drivers/a715181@@tmp_rte_pmd_atlantic at sta/net_atlantic_hw_atl_hw_atl_utils_fw2x.c.o'.
[567/1791] Compiling C object 'drivers/a715181@@tmp_rte_pmd_atlantic at sta/net_atlantic_hw_atl_hw_atl_llh.c.o'.
[568/1791] Compiling C object 'drivers/a715181@@tmp_rte_pmd_atlantic at sta/net_atlantic_atl_rxtx.c.o'.
[569/1791] Compiling C object 'drivers/a715181@@tmp_rte_pmd_atlantic at sta/net_atlantic_hw_atl_hw_atl_utils.c.o'.
[570/1791] Compiling C object 'lib/76b5a35@@rte_pipeline at sta/librte_pipeline_rte_table_action.c.o'.
ninja: build stopped: subcommand failed




*Meson Build Failed #5:
OS: FreeBSD12-64
Target:build-gcc-static
FAILED: drivers/a715181@@tmp_rte_pmd_atlantic at sta/net_atlantic_atl_ethdev.c.o 
ccache gcc -Idrivers/a715181@@tmp_rte_pmd_atlantic at sta -Idrivers -I../drivers -Idrivers/net/atlantic -I../drivers/net/atlantic -Ilib/librte_ethdev -I../lib/librte_ethdev -I. -I../ -Iconfig -I../config -Ilib/librte_eal/common/include -I../lib/librte_eal/common/include -I../lib/librte_eal/freebsd/eal/include -Ilib/librte_eal/common -I../lib/librte_eal/common -Ilib/librte_eal/common/include/arch/x86 -I../lib/librte_eal/common/include/arch/x86 -Ilib/librte_eal -I../lib/librte_eal -Ilib/librte_kvargs -I../lib/librte_kvargs -Ilib/librte_net -I../lib/librte_net -Ilib/librte_mbuf -I../lib/librte_mbuf -Ilib/librte_mempool -I../lib/librte_mempool -Ilib/librte_ring -I../lib/librte_ring -Ilib/librte_meter -I../lib/librte_meter -Idrivers/bus/pci -I../drivers/bus/pci -I../drivers/bus/pci/bsd -Ilib/librte_pci -I../lib/librte_pci -Idrivers/bus/vdev -I../drivers/bus/vdev -fdiagnostics-color=always -pipe -D_FILE_OFFSET_BITS=64 -Wall -Winvalid-pch -Werror -O3 -include rte_config.h -Wunused-parameter -Wsign-compare -Wcast-qual -D_GNU_SOURCE -D__BSD_VISIBLE -fPIC -march=native -Wno-format-truncation -DALLOW_EXPERIMENTAL_API -MD -MQ 'drivers/a715181@@tmp_rte_pmd_atlantic at sta/net_atlantic_atl_ethdev.c.o' -MF 'drivers/a715181@@tmp_rte_pmd_atlantic at sta/net_atlantic_atl_ethdev.c.o.d' -o 'drivers/a715181@@tmp_rte_pmd_atlantic at sta/net_atlantic_atl_ethdev.c.o' -c ../drivers/net/atlantic/atl_ethdev.c
../drivers/net/atlantic/atl_ethdev.c:123:12: error: conflicting types for 'atl_dev_info_get'
 static int atl_dev_info_get(struct rte_eth_dev *dev,
            ^~~~~~~~~~~~~~~~
../drivers/net/atlantic/atl_ethdev.c:48:13: note: previous declaration of 'atl_dev_info_get' was here
 static void atl_dev_info_get(struct rte_eth_dev *dev,
             ^~~~~~~~~~~~~~~~
[132/1413] Generating symbol file 'lib/76b5a35@@rte_eal at sha/librte_eal.so.11.1.symbols'.
[133/1413] Compiling C object 'drivers/a715181@@tmp_rte_pmd_bond at sta/net_bonding_rte_eth_bond_alb.c.o'.
[134/1413] Compiling C object 'drivers/a715181@@tmp_rte_pmd_bnx2x at sta/net_bnx2x_bnx2x_ethdev.c.o'.
[135/1413] Compiling C object 'lib/76b5a35@@rte_ethdev at sta/librte_ethdev_rte_ethdev.c.o'.
[136/1413] Compiling C object 'drivers/a715181@@tmp_rte_pmd_bnx2x at sta/net_bnx2x_bnx2x.c.o'.
ninja: build stopped: subcommand failed



DPDK STV team


More information about the test-report mailing list