[dpdk-test-report] |FAILURE| pw58767[v1, 4/5] net/qede: fix stats flow as per new 100Gb queue allocation method

sys_stv at intel.com sys_stv at intel.com
Fri Sep 6 19:05:54 CEST 2019


Test-Label: Intel-compilation
Test-Status: FAILURE
http://dpdk.org/patch/58767

_Compilation issues_

Submitter: Shahed Shaikh <shshaikh at marvell.com>
Date: 2019-09-06 07:32:16
Reply_mail: 20190906073217.13873-5-shshaikh at marvell.com
DPDK git baseline: Repo:dpdk-next-net-mrvl, CommitID: 68e78a94ec298a7f2b55c859f99fb489b54a96a4

Makefile build Summary: 22 Builds Done, 16 Successful, 6 Failures

Meson build Summary: 7 Builds Done, 7 Successful, 0 Failures

               +==============================================+===========+==========+
               |                   Makefile                   |   Meson   | Document |
+--------------+------+-------+------+------------+-----------+-----------+----------+
| os           | gcc  | clang | icc  | gcc+shared | gcc+debug | gcc/clang | pdf/html |
+--------------+------+-------+------+------------+-----------+-----------+----------+
| RHEL76-64    | pass |       |      |            |           |           |          |
| CENTOS76-64  | pass | FAIL  | pass | pass       | pass      |           |          |
| UB1804-64    | pass | FAIL  | pass |            |           | pass      | pass     |
| UB1604-32    | pass |       |      |            |           | pass      |          |
| UB1904-64    | pass |       |      |            |           |           |          |
| UB1604-64    | pass | FAIL  |      |            |           |           |          |
| FC30-64      | pass | FAIL  |      |            |           | pass      |          |
| WIN10-64     |      |       |      |            |           | pass      |          |
| FreeBSD12-64 | pass | FAIL  |      | pass       | pass      | pass      |          |
| RHEL80-64    | pass |       |      |            |           |           |          |
| SUSE15-64    | pass | FAIL  |      |            |           | pass      |          |
+--------------+------+-------+------+------------+-----------+-----------+----------+

Test environment and configuration as below:

** Makefile build **


OS: RHEL76-64
	Kernel Version: 3.10.0-957.el7.x86_64
	CPU info: Intel(R) Xeon(R) CPU E5-2699 v4 @ 2.20GHz
	GCC Version: gcc (GCC) 4.8.5 20150623 (Red Hat 4.8.5-36)
	Clang Version: NA
	x86_64-native-linuxapp-gcc


OS: CENTOS76-64
	Kernel Version: 3.10.0-957.10.1.el7.x86_64
	CPU info: Intel(R) Xeon(R) CPU E5-2699 v4 @ 2.20GHz
	GCC Version: gcc (GCC) 4.8.5 20150623 (Red Hat 4.8.5-36)
	Clang Version: 3.4.2 (tags/RELEASE_34/dot2-final)
	x86_64-native-linuxapp-clang
	x86_64-native-linuxapp-gcc+debug
	x86_64-native-linuxapp-gcc
	x86_64-native-linuxapp-gcc+shared
	x86_64-native-linuxapp-icc


OS: UB1804-64
	Kernel Version: 4.15.0-20-generic
	CPU info: Intel(R) Xeon(R) CPU E5-2699 v3 @ 2.30GHz
	GCC Version: gcc (Ubuntu 7.3.0-27ubuntu1~18.04) 7.3.0
	Clang Version: 6.0.0-1ubuntu2 (tags/RELEASE_600/final)
	x86_64-native-linuxapp-icc
	x86_64-native-linuxapp-clang
	x86_64-native-linuxapp-gcc


OS: UB1904-64
	Kernel Version: 5.0.0-13-generic
	CPU info: Intel(R) Xeon(R) CPU E5-2699 v3 @ 2.30GHz
	GCC Version: gcc (Ubuntu 8.3.0-6ubuntu1) 8.3.0
	Clang Version: 8.0.0-3 (tags/RELEASE_800/final)
	x86_64-native-linuxapp-gcc


OS: UB1604-32
	Kernel Version: 4.4.0-131-generic
	CPU info: Intel(R) Xeon(R) CPU E5-2699 v3 @ 2.30GHz
	GCC Version: gcc (Ubuntu 5.4.0-6ubuntu1~16.04.11) 5.4.0 20160609
	Clang Version: 3.8.0-2ubuntu4 (tags/RELEASE_380/final)
	i686-native-linuxapp-gcc


OS: UB1604-64
	Kernel Version: 4.4.0-47-generic
	CPU info: Intel(R) Xeon(R) CPU E5-2699 v3 @ 2.30GHz
	GCC Version: gcc (Ubuntu 5.4.0-6ubuntu1~16.04.10) 5.4.0 20160609
	Clang Version: 3.8.0-2ubuntu4 (tags/RELEASE_380/final)
	x86_64-native-linuxapp-clang
	x86_64-native-linuxapp-gcc


OS: FC30-64
	Kernel Version: 5.1.7-300.fc30.x86_64
	CPU info: Intel(R) Xeon(R) CPU E5-2699 v4 @ 2.20GHz
	GCC Version: gcc (GCC) 9.1.1 20190503 (Red Hat 9.1.1-1)
	Clang Version: 8.0.0 (Fedora 8.0.0-1.fc30)
	x86_64-native-linuxapp-gcc
	x86_64-native-linuxapp-clang


OS: FreeBSD12-64
	Kernel Version: 12.0-RC3
	CPU info: Intel(R) Xeon(R) CPU E5-2699 v4 @ 2.20GHz (2194.97-MHz K8-class CPU)
	GCC Version: gcc (FreeBSD Ports Collection) 7.3.0
	Clang Version: 6.0.1 (tags/RELEASE_601/final 335540) (based on LLVM 6.0.1)
	x86_64-native-bsdapp-clang
	x86_64-native-bsdapp-gcc+debug
	x86_64-native-bsdapp-gcc+shared
	x86_64-native-bsdapp-gcc


OS: RHEL80-64
	Kernel Version: 4.18.0-80.el8.x86_64
	CPU info: Intel(R) Xeon(R) CPU E5-2699 v4 @ 2.20GHz
	GCC Version: gcc (GCC) 8.2.1 20180905 (Red Hat 8.2.1-3)
	Clang Version: 6.0.1 (tags/RELEASE_601/final)
	x86_64-native-linuxapp-gcc


OS: SUSE15-64
	Kernel Version: 4.12.14-lp150.11-default
	CPU info: Intel(R) Xeon(R) CPU E5-2699 v4 @ 2.20GHz
	GCC Version: gcc (SUSE Linux) 7.3.1 20180323 [gcc-7-branch revision 258812]
	Clang Version: 5.0.1 (tags/RELEASE_501/final 312548)
	x86_64-native-linuxapp-gcc
	x86_64-native-linuxapp-clang


** Meson build **


OS: UB1804-64
	Kernel Version: 4.15.0-20-generic
	CPU info: Intel(R) Xeon(R) CPU E5-2699 v4 @ 2.20GHz
	GCC Version: gcc (Ubuntu 7.3.0-27ubuntu1~18.04) 7.3.0
	Clang Version: 6.0.0-1ubuntu2 (tags/RELEASE_600/final)
	x86_64-native-linuxapp-doc
	build-gcc-static
	build-gcc-shared
	build-clang-static
	build-clang-shared
	build-x86-default


OS: UB1604-32
	Kernel Version: 4.4.0-131-generic
	CPU info: Intel(R) Xeon(R) CPU E5-2699 v4 @ 2.20GHz
	GCC Version: gcc (Ubuntu 5.4.0-6ubuntu1~16.04.11) 5.4.0 20160609
	Clang Version: 3.8.0-2ubuntu4 (tags/RELEASE_380/final)
	build-gcc-static
	build-gcc-shared
	build-clang-static
	build-clang-shared
	build-x86-default


OS: FC30-64
	Kernel Version: 5.0.9-301.fc30.x86_64
	CPU info: Intel(R) Xeon(R) CPU E5-2699 v4 @ 2.20GHz
	GCC Version: gcc (GCC) 9.1.1 20190503 (Red Hat 9.1.1-1)
	Clang Version: 8.0.0 (Fedora 8.0.0-1.fc30)
	build-gcc-static
	build-gcc-shared
	build-clang-static
	build-clang-shared
	build-x86-default


OS: WIN10-64
	Kernel Version: N/A
	CPU info: N/A
	GCC Version: N/A
	Clang Version: Clang 8.0.0
	x86_64-windows-clang


OS: FreeBSD12-64
	Kernel Version: 12.0-RC3
	CPU info: Intel(R) Xeon(R) CPU E5-2699 v4 @ 2.20GHz (2194.99-MHz K8-class CPU)
	GCC Version: gcc (FreeBSD Ports Collection) 7.3.0
	Clang Version: 6.0.1 (tags/RELEASE_601/final 335540) (based on LLVM 6.0.1)
	build-gcc-static
	build-gcc-shared
	build-clang-static
	build-clang-shared
	build-x86-default


OS: SUSE15-64
	Kernel Version: 4.12.14-lp150.11-default
	CPU info: Intel(R) Xeon(R) CPU E5-2699 v4 @ 2.20GHz
	GCC Version: gcc (SUSE Linux) 7.3.1 20180323 [gcc-7-branch revision 258812]
	Clang Version: 5.0.1 (tags/RELEASE_501/final 312548)
	build-gcc-static
	build-gcc-shared
	build-clang-static
	build-clang-shared
	build-x86-default


*Make Build Failed #1:
OS: UB1604-64
Target: x86_64-native-linuxapp-clang
  CC rte_eth_softnic_action.o
/tmp/UB1604-64_K4.4.0_Clang3.8.0/x86_64-native-linuxapp-clang/3ccfcb23400441f7b6ca965e94533a1f/dpdk/drivers/net/qede/qede_rxtx.c:638:17: error: comparison of integers of different signs: 'uint32_t' (aka 'unsigned int') and 'int' [-Werror,-Wsign-compare]
                for (i = 0; i < QEDE_RXTX_MAX(qdev) / 2; i++) {
                            ~ ^ ~~~~~~~~~~~~~~~~~~~~~~~
1 error generated.
/tmp/UB1604-64_K4.4.0_Clang3.8.0/x86_64-native-linuxapp-clang/3ccfcb23400441f7b6ca965e94533a1f/dpdk/mk/internal/rte.compile-pre.mk:114: recipe for target 'qede_rxtx.o' failed
make[6]: *** [qede_rxtx.o] Error 1
make[6]: *** Waiting for unfinished jobs....
  CC rte_eth_softnic_pipeline.o
  PMDINFO qede_ethdev.o.pmd.c
  CC qede_ethdev.o.pmd.o
  LD qede_ethdev.o
--
  CC rte_eth_softnic_thread.o
  PMDINFO virtio_user_ethdev.o.pmd.c
  CC virtio_user_ethdev.o.pmd.o
  CC rte_eth_softnic_cli.o
  LD virtio_user_ethdev.o
/tmp/UB1604-64_K4.4.0_Clang3.8.0/x86_64-native-linuxapp-clang/3ccfcb23400441f7b6ca965e94533a1f/dpdk/mk/rte.subdir.mk:35: recipe for target 'qede' failed
make[5]: *** [qede] Error 2
make[5]: *** Waiting for unfinished jobs....
  CC rte_eth_softnic_flow.o
  CC rte_eth_softnic_meter.o
  CC otx2_ethdev_devargs.o
  AR librte_pmd_virtio.a
--
  CC medford2_nic.o
  AR librte_pmd_softnic.a
  INSTALL-LIB librte_pmd_softnic.a
  AR librte_pmd_sfc_efx.a
  INSTALL-LIB librte_pmd_sfc_efx.a
/tmp/UB1604-64_K4.4.0_Clang3.8.0/x86_64-native-linuxapp-clang/3ccfcb23400441f7b6ca965e94533a1f/dpdk/mk/rte.subdir.mk:35: recipe for target 'net' failed
make[4]: *** [net] Error 2
/tmp/UB1604-64_K4.4.0_Clang3.8.0/x86_64-native-linuxapp-clang/3ccfcb23400441f7b6ca965e94533a1f/dpdk/mk/rte.sdkbuild.mk:46: recipe for target 'drivers' failed
make[3]: *** [drivers] Error 2
/tmp/UB1604-64_K4.4.0_Clang3.8.0/x86_64-native-linuxapp-clang/3ccfcb23400441f7b6ca965e94533a1f/dpdk/mk/rte.sdkroot.mk:98: recipe for target 'all' failed
make[2]: *** [all] Error 2
/tmp/UB1604-64_K4.4.0_Clang3.8.0/x86_64-native-linuxapp-clang/3ccfcb23400441f7b6ca965e94533a1f/dpdk/mk/rte.sdkinstall.mk:60: recipe for target 'pre_install' failed
make[1]: *** [pre_install] Error 2
/tmp/UB1604-64_K4.4.0_Clang3.8.0/x86_64-native-linuxapp-clang/3ccfcb23400441f7b6ca965e94533a1f/dpdk/mk/rte.sdkroot.mk:77: recipe for target 'install' failed
make: *** [install] Error 2


*Make Build Failed #2:
OS: UB1804-64
Target: x86_64-native-linuxapp-clang
  CC efx_mac.o
/tmp/UB1804-64_K4.15.0_Clang6.0.0/x86_64-native-linuxapp-clang/3ccfcb23400441f7b6ca965e94533a1f/dpdk/drivers/net/qede/qede_rxtx.c:638:17: error: comparison of integers of different signs: 'uint32_t' (aka 'unsigned int') and 'int' [-Werror,-Wsign-compare]
                for (i = 0; i < QEDE_RXTX_MAX(qdev) / 2; i++) {
                            ~ ^ ~~~~~~~~~~~~~~~~~~~~~~~
1 error generated.
/tmp/UB1804-64_K4.15.0_Clang6.0.0/x86_64-native-linuxapp-clang/3ccfcb23400441f7b6ca965e94533a1f/dpdk/mk/internal/rte.compile-pre.mk:114: recipe for target 'qede_rxtx.o' failed
make[6]: *** [qede_rxtx.o] Error 1
make[6]: *** Waiting for unfinished jobs....
  CC efx_mcdi.o
  CC efx_mon.o
  CC efx_nic.o
  CC efx_nvram.o
/tmp/UB1804-64_K4.15.0_Clang6.0.0/x86_64-native-linuxapp-clang/3ccfcb23400441f7b6ca965e94533a1f/dpdk/mk/rte.subdir.mk:35: recipe for target 'qede' failed
make[5]: *** [qede] Error 2
make[5]: *** Waiting for unfinished jobs....
  CC efx_phy.o
  AR librte_pmd_octeontx2.a
  CC efx_port.o
  INSTALL-LIB librte_pmd_octeontx2.a
--
  CC hunt_nic.o
  CC medford_nic.o
  CC medford2_nic.o
  AR librte_pmd_sfc_efx.a
  INSTALL-LIB librte_pmd_sfc_efx.a
/tmp/UB1804-64_K4.15.0_Clang6.0.0/x86_64-native-linuxapp-clang/3ccfcb23400441f7b6ca965e94533a1f/dpdk/mk/rte.subdir.mk:35: recipe for target 'net' failed
make[4]: *** [net] Error 2
/tmp/UB1804-64_K4.15.0_Clang6.0.0/x86_64-native-linuxapp-clang/3ccfcb23400441f7b6ca965e94533a1f/dpdk/mk/rte.sdkbuild.mk:46: recipe for target 'drivers' failed
make[3]: *** [drivers] Error 2
/tmp/UB1804-64_K4.15.0_Clang6.0.0/x86_64-native-linuxapp-clang/3ccfcb23400441f7b6ca965e94533a1f/dpdk/mk/rte.sdkroot.mk:98: recipe for target 'all' failed
make[2]: *** [all] Error 2
/tmp/UB1804-64_K4.15.0_Clang6.0.0/x86_64-native-linuxapp-clang/3ccfcb23400441f7b6ca965e94533a1f/dpdk/mk/rte.sdkinstall.mk:60: recipe for target 'pre_install' failed
make[1]: *** [pre_install] Error 2
/tmp/UB1804-64_K4.15.0_Clang6.0.0/x86_64-native-linuxapp-clang/3ccfcb23400441f7b6ca965e94533a1f/dpdk/mk/rte.sdkroot.mk:77: recipe for target 'install' failed
make: *** [install] Error 2


*Make Build Failed #3:
OS: SUSE15-64
Target: x86_64-native-linuxapp-clang
  CC qede_filter.o
/tmp/SUSE15-64_K4.12.14_Clang5.0.1/x86_64-native-linuxapp-clang/3ccfcb23400441f7b6ca965e94533a1f/dpdk/drivers/net/qede/qede_rxtx.c:638:17: error: comparison of integers of different signs: 'uint32_t' (aka 'unsigned int') and 'int' [-Werror,-Wsign-compare]
                for (i = 0; i < QEDE_RXTX_MAX(qdev) / 2; i++) {
                            ~ ^ ~~~~~~~~~~~~~~~~~~~~~~~
1 error generated.
make[6]: *** [/tmp/SUSE15-64_K4.12.14_Clang5.0.1/x86_64-native-linuxapp-clang/3ccfcb23400441f7b6ca965e94533a1f/dpdk/mk/internal/rte.compile-pre.mk:116: qede_rxtx.o] Error 1
make[6]: *** Waiting for unfinished jobs....
  CC rte_eth_softnic_cryptodev.o
  CC sfc_dp.o
  CC parser.o
  CC conn.o
--
  CC efx_bootcfg.o
  CC efx_crc32.o
  CC efx_ev.o
  CC efx_evb.o
  CC efx_filter.o
make[5]: *** [/tmp/SUSE15-64_K4.12.14_Clang5.0.1/x86_64-native-linuxapp-clang/3ccfcb23400441f7b6ca965e94533a1f/dpdk/mk/rte.subdir.mk:35: qede] Error 2
make[5]: *** Waiting for unfinished jobs....
  CC efx_hash.o
  CC efx_intr.o
  CC efx_lic.o
  CC efx_mac.o
--
  CC hunt_nic.o
  CC medford_nic.o
  CC medford2_nic.o
  AR librte_pmd_sfc_efx.a
  INSTALL-LIB librte_pmd_sfc_efx.a
make[4]: *** [/tmp/SUSE15-64_K4.12.14_Clang5.0.1/x86_64-native-linuxapp-clang/3ccfcb23400441f7b6ca965e94533a1f/dpdk/mk/rte.subdir.mk:35: net] Error 2
make[3]: *** [/tmp/SUSE15-64_K4.12.14_Clang5.0.1/x86_64-native-linuxapp-clang/3ccfcb23400441f7b6ca965e94533a1f/dpdk/mk/rte.sdkbuild.mk:46: drivers] Error 2
make[2]: *** [/tmp/SUSE15-64_K4.12.14_Clang5.0.1/x86_64-native-linuxapp-clang/3ccfcb23400441f7b6ca965e94533a1f/dpdk/mk/rte.sdkroot.mk:99: all] Error 2
make[1]: *** [/tmp/SUSE15-64_K4.12.14_Clang5.0.1/x86_64-native-linuxapp-clang/3ccfcb23400441f7b6ca965e94533a1f/dpdk/mk/rte.sdkinstall.mk:61: pre_install] Error 2
make: *** [/tmp/SUSE15-64_K4.12.14_Clang5.0.1/x86_64-native-linuxapp-clang/3ccfcb23400441f7b6ca965e94533a1f/dpdk/mk/rte.sdkroot.mk:77: install] Error 2


*Make Build Failed #4:
OS: FC30-64
Target: x86_64-native-linuxapp-clang
  CC rte_eth_softnic_link.o
/tmp/FC30-64_K4.20_Clang8.0.0/x86_64-native-linuxapp-clang/3ccfcb23400441f7b6ca965e94533a1f/dpdk/drivers/net/qede/qede_rxtx.c:638:17: error: comparison of integers of different signs: 'uint32_t' (aka 'unsigned int') and 'int' [-Werror,-Wsign-compare]
                for (i = 0; i < QEDE_RXTX_MAX(qdev) / 2; i++) {
                            ~ ^ ~~~~~~~~~~~~~~~~~~~~~~~
1 error generated.
make[6]: *** [/tmp/FC30-64_K4.20_Clang8.0.0/x86_64-native-linuxapp-clang/3ccfcb23400441f7b6ca965e94533a1f/dpdk/mk/internal/rte.compile-pre.mk:114: qede_rxtx.o] Error 1
make[6]: *** Waiting for unfinished jobs....
  CC rte_eth_softnic_tm.o
  CC rte_eth_softnic_tap.o
  CC efx_nvram.o
  CC efx_phy.o
  PMDINFO qede_ethdev.o.pmd.c
  CC qede_ethdev.o.pmd.o
  LD qede_ethdev.o
make[5]: *** [/tmp/FC30-64_K4.20_Clang8.0.0/x86_64-native-linuxapp-clang/3ccfcb23400441f7b6ca965e94533a1f/dpdk/mk/rte.subdir.mk:35: qede] Error 2
make[5]: *** Waiting for unfinished jobs....
  CC efx_port.o
  CC efx_proxy.o
  CC efx_rx.o
  CC efx_sram.o
--
  CC hunt_nic.o
  CC medford_nic.o
  CC medford2_nic.o
  AR librte_pmd_sfc_efx.a
  INSTALL-LIB librte_pmd_sfc_efx.a
make[4]: *** [/tmp/FC30-64_K4.20_Clang8.0.0/x86_64-native-linuxapp-clang/3ccfcb23400441f7b6ca965e94533a1f/dpdk/mk/rte.subdir.mk:35: net] Error 2
make[3]: *** [/tmp/FC30-64_K4.20_Clang8.0.0/x86_64-native-linuxapp-clang/3ccfcb23400441f7b6ca965e94533a1f/dpdk/mk/rte.sdkbuild.mk:46: drivers] Error 2
make[2]: *** [/tmp/FC30-64_K4.20_Clang8.0.0/x86_64-native-linuxapp-clang/3ccfcb23400441f7b6ca965e94533a1f/dpdk/mk/rte.sdkroot.mk:99: all] Error 2
make[1]: *** [/tmp/FC30-64_K4.20_Clang8.0.0/x86_64-native-linuxapp-clang/3ccfcb23400441f7b6ca965e94533a1f/dpdk/mk/rte.sdkinstall.mk:61: pre_install] Error 2
make: *** [/tmp/FC30-64_K4.20_Clang8.0.0/x86_64-native-linuxapp-clang/3ccfcb23400441f7b6ca965e94533a1f/dpdk/mk/rte.sdkroot.mk:77: install] Error 2


*Make Build Failed #5:
OS: CENTOS76-64
Target: x86_64-native-linuxapp-clang
  CC efx_filter.o
/tmp/CENTOS76-64_K3.10.0_Clang3.4.2/x86_64-native-linuxapp-clang/3ccfcb23400441f7b6ca965e94533a1f/dpdk/drivers/net/qede/qede_rxtx.c:638:17: error: comparison of integers of different signs: 'uint32_t' (aka 'unsigned int') and 'int' [-Werror,-Wsign-compare]
                for (i = 0; i < QEDE_RXTX_MAX(qdev) / 2; i++) {
                            ~ ^ ~~~~~~~~~~~~~~~~~~~~~~~
1 error generated.
make[6]: *** [qede_rxtx.o] Error 1
make[6]: *** Waiting for unfinished jobs....
  CC ixgbe_pf.o
  CC ifcvf.o
  CC efx_hash.o
  CC rte_eth_softnic_pipeline.o
--
  AR librte_pmd_ifc.a
  CC efx_mac.o
  INSTALL-LIB librte_pmd_ifc.a
  CC rte_eth_softnic_cli.o
  CC efx_mcdi.o
make[5]: *** [qede] Error 2
make[5]: *** Waiting for unfinished jobs....
  CC ixgbe_flow.o
  CC efx_mon.o
  CC ixgbe_rxtx_vec_sse.o
  CC efx_nic.o
--
  CC medford2_nic.o
  AR librte_pmd_ixgbe.a
  INSTALL-LIB librte_pmd_ixgbe.a
  AR librte_pmd_sfc_efx.a
  INSTALL-LIB librte_pmd_sfc_efx.a
make[4]: *** [net] Error 2
make[3]: *** [drivers] Error 2
make[2]: *** [all] Error 2
make[1]: *** [pre_install] Error 2
make: *** [install] Error 2


*Make Build Failed #6:
OS: FreeBSD12-64
Target: x86_64-native-bsdapp-clang
/tmp/FreeBSD12-64_K19.02_Clang6.0.1/x86_64-native-bsdapp-clang/3ccfcb23400441f7b6ca965e94533a1f/dpdk/drivers/net/qede/qede_rxtx.c:638:17: error: comparison of integers of different signs: 'uint32_t' (aka 'unsigned int') and 'int' [-Werror,-Wsign-compare]
                for (i = 0; i < QEDE_RXTX_MAX(qdev) / 2; i++) {
                            ~ ^ ~~~~~~~~~~~~~~~~~~~~~~~
1 error generated.
  CC qede_filter.o
gmake[6]: *** [/tmp/FreeBSD12-64_K19.02_Clang6.0.1/x86_64-native-bsdapp-clang/3ccfcb23400441f7b6ca965e94533a1f/dpdk/mk/internal/rte.compile-pre.mk:116: qede_rxtx.o] Error 1
gmake[6]: *** Waiting for unfinished jobs....
  CC efx_intr.o
  CC efx_lic.o
  AR librte_pmd_ixgbe.a
  INSTALL-LIB librte_pmd_ixgbe.a
--
  CC efx_nvram.o
  CC efx_rx.o
  CC efx_sram.o
  CC efx_tunnel.o
  CC efx_tx.o
gmake[5]: *** [/tmp/FreeBSD12-64_K19.02_Clang6.0.1/x86_64-native-bsdapp-clang/3ccfcb23400441f7b6ca965e94533a1f/dpdk/mk/rte.subdir.mk:35: qede] Error 2
gmake[5]: *** Waiting for unfinished jobs....
  CC mcdi_mon.o
  CC efx_vpd.o
  CC siena_mac.o
  CC siena_nvram.o
--
  CC hunt_nic.o
  CC medford_nic.o
  CC medford2_nic.o
  AR librte_pmd_sfc_efx.a
  INSTALL-LIB librte_pmd_sfc_efx.a
gmake[4]: *** [/tmp/FreeBSD12-64_K19.02_Clang6.0.1/x86_64-native-bsdapp-clang/3ccfcb23400441f7b6ca965e94533a1f/dpdk/mk/rte.subdir.mk:35: net] Error 2
gmake[3]: *** [/tmp/FreeBSD12-64_K19.02_Clang6.0.1/x86_64-native-bsdapp-clang/3ccfcb23400441f7b6ca965e94533a1f/dpdk/mk/rte.sdkbuild.mk:46: drivers] Error 2
gmake[2]: *** [/tmp/FreeBSD12-64_K19.02_Clang6.0.1/x86_64-native-bsdapp-clang/3ccfcb23400441f7b6ca965e94533a1f/dpdk/mk/rte.sdkroot.mk:99: all] Error 2
gmake[1]: *** [/tmp/FreeBSD12-64_K19.02_Clang6.0.1/x86_64-native-bsdapp-clang/3ccfcb23400441f7b6ca965e94533a1f/dpdk/mk/rte.sdkinstall.mk:61: pre_install] Error 2
gmake: *** [/tmp/FreeBSD12-64_K19.02_Clang6.0.1/x86_64-native-bsdapp-clang/3ccfcb23400441f7b6ca965e94533a1f/dpdk/mk/rte.sdkroot.mk:77: install] Error 2

DPDK STV team


More information about the test-report mailing list