[dpdk-test-report] |FAILURE| pw58816[v2, 5/6] test/lpm: reset total time

sys_stv at intel.com sys_stv at intel.com
Fri Sep 6 21:19:53 CEST 2019


Test-Label: Intel-compilation
Test-Status: FAILURE
http://dpdk.org/patch/58816

_Compilation issues_

Submitter: Ruifeng Wang <ruifeng.wang at arm.com>
Date: 2019-09-06 09:45:33
Reply_mail: 20190906094534.36060-6-ruifeng.wang at arm.com
DPDK git baseline: Repo:dpdk, CommitID: e7fd5a3bbe5636e93a66fd5086f182756624c97a

Makefile build Summary: 22 Builds Done, 17 Successful, 5 Failures

Meson build Summary: 7 Builds Done, 7 Successful, 0 Failures

               +==============================================+===========+==========+
               |                   Makefile                   |   Meson   | Document |
+--------------+------+-------+------+------------+-----------+-----------+----------+
| os           | gcc  | clang | icc  | gcc+shared | gcc+debug | gcc/clang | pdf/html |
+--------------+------+-------+------+------------+-----------+-----------+----------+
| RHEL76-64    | FAIL |       |      |            |           |           |          |
| CENTOS76-64  | FAIL | pass  | pass | FAIL       | FAIL      |           |          |
| UB1804-64    | pass | pass  | pass |            |           | pass      | pass     |
| UB1604-32    | pass |       |      |            |           | pass      |          |
| UB1904-64    | pass |       |      |            |           |           |          |
| UB1604-64    | pass | pass  |      |            |           |           |          |
| FC30-64      | pass | pass  |      |            |           | pass      |          |
| WIN10-64     |      |       |      |            |           | pass      |          |
| FreeBSD12-64 | pass | pass  |      | FAIL       | pass      | pass      |          |
| RHEL80-64    | pass |       |      |            |           |           |          |
| SUSE15-64    | pass | pass  |      |            |           | pass      |          |
+--------------+------+-------+------+------------+-----------+-----------+----------+

Test environment and configuration as below:

** Makefile build **


OS: RHEL76-64
	Kernel Version: 3.10.0-957.el7.x86_64
	CPU info: Intel(R) Xeon(R) CPU E5-2699 v4 @ 2.20GHz
	GCC Version: gcc (GCC) 4.8.5 20150623 (Red Hat 4.8.5-36)
	Clang Version: NA
	x86_64-native-linuxapp-gcc


OS: CENTOS76-64
	Kernel Version: 3.10.0-957.10.1.el7.x86_64
	CPU info: Intel(R) Xeon(R) CPU E5-2699 v4 @ 2.20GHz
	GCC Version: gcc (GCC) 4.8.5 20150623 (Red Hat 4.8.5-36)
	Clang Version: 3.4.2 (tags/RELEASE_34/dot2-final)
	x86_64-native-linuxapp-gcc
	x86_64-native-linuxapp-gcc+debug
	x86_64-native-linuxapp-gcc+shared
	x86_64-native-linuxapp-clang
	x86_64-native-linuxapp-icc


OS: UB1804-64
	Kernel Version: 4.15.0-20-generic
	CPU info: Intel(R) Xeon(R) CPU E5-2699 v3 @ 2.30GHz
	GCC Version: gcc (Ubuntu 7.3.0-27ubuntu1~18.04) 7.3.0
	Clang Version: 6.0.0-1ubuntu2 (tags/RELEASE_600/final)
	x86_64-native-linuxapp-icc
	x86_64-native-linuxapp-clang
	x86_64-native-linuxapp-gcc


OS: UB1904-64
	Kernel Version: 5.0.0-13-generic
	CPU info: Intel(R) Xeon(R) CPU E5-2699 v3 @ 2.30GHz
	GCC Version: gcc (Ubuntu 8.3.0-6ubuntu1) 8.3.0
	Clang Version: 8.0.0-3 (tags/RELEASE_800/final)
	x86_64-native-linuxapp-gcc


OS: UB1604-32
	Kernel Version: 4.4.0-131-generic
	CPU info: Intel(R) Xeon(R) CPU E5-2699 v3 @ 2.30GHz
	GCC Version: gcc (Ubuntu 5.4.0-6ubuntu1~16.04.11) 5.4.0 20160609
	Clang Version: 3.8.0-2ubuntu4 (tags/RELEASE_380/final)
	i686-native-linuxapp-gcc


OS: UB1604-64
	Kernel Version: 4.4.0-47-generic
	CPU info: Intel(R) Xeon(R) CPU E5-2699 v3 @ 2.30GHz
	GCC Version: gcc (Ubuntu 5.4.0-6ubuntu1~16.04.10) 5.4.0 20160609
	Clang Version: 3.8.0-2ubuntu4 (tags/RELEASE_380/final)
	x86_64-native-linuxapp-clang
	x86_64-native-linuxapp-gcc


OS: FC30-64
	Kernel Version: 5.1.7-300.fc30.x86_64
	CPU info: Intel(R) Xeon(R) CPU E5-2699 v4 @ 2.20GHz
	GCC Version: gcc (GCC) 9.1.1 20190503 (Red Hat 9.1.1-1)
	Clang Version: 8.0.0 (Fedora 8.0.0-1.fc30)
	x86_64-native-linuxapp-gcc
	x86_64-native-linuxapp-clang


OS: FreeBSD12-64
	Kernel Version: 12.0-RC3
	CPU info: Intel(R) Xeon(R) CPU E5-2699 v4 @ 2.20GHz (2194.97-MHz K8-class CPU)
	GCC Version: gcc (FreeBSD Ports Collection) 7.3.0
	Clang Version: 6.0.1 (tags/RELEASE_601/final 335540) (based on LLVM 6.0.1)
	x86_64-native-bsdapp-gcc+shared
	x86_64-native-bsdapp-gcc+debug
	x86_64-native-bsdapp-clang
	x86_64-native-bsdapp-gcc


OS: RHEL80-64
	Kernel Version: 4.18.0-80.el8.x86_64
	CPU info: Intel(R) Xeon(R) CPU E5-2699 v4 @ 2.20GHz
	GCC Version: gcc (GCC) 8.2.1 20180905 (Red Hat 8.2.1-3)
	Clang Version: 6.0.1 (tags/RELEASE_601/final)
	x86_64-native-linuxapp-gcc


OS: SUSE15-64
	Kernel Version: 4.12.14-lp150.11-default
	CPU info: Intel(R) Xeon(R) CPU E5-2699 v4 @ 2.20GHz
	GCC Version: gcc (SUSE Linux) 7.3.1 20180323 [gcc-7-branch revision 258812]
	Clang Version: 5.0.1 (tags/RELEASE_501/final 312548)
	x86_64-native-linuxapp-gcc
	x86_64-native-linuxapp-clang


** Meson build **


OS: UB1804-64
	Kernel Version: 4.15.0-20-generic
	CPU info: Intel(R) Xeon(R) CPU E5-2699 v4 @ 2.20GHz
	GCC Version: gcc (Ubuntu 7.3.0-27ubuntu1~18.04) 7.3.0
	Clang Version: 6.0.0-1ubuntu2 (tags/RELEASE_600/final)
	x86_64-native-linuxapp-doc
	build-gcc-static
	build-gcc-shared
	build-clang-static
	build-clang-shared
	build-x86-default


OS: UB1604-32
	Kernel Version: 4.4.0-131-generic
	CPU info: Intel(R) Xeon(R) CPU E5-2699 v4 @ 2.20GHz
	GCC Version: gcc (Ubuntu 5.4.0-6ubuntu1~16.04.11) 5.4.0 20160609
	Clang Version: 3.8.0-2ubuntu4 (tags/RELEASE_380/final)
	build-gcc-static
	build-gcc-shared
	build-clang-static
	build-clang-shared
	build-x86-default


OS: FC30-64
	Kernel Version: 5.0.9-301.fc30.x86_64
	CPU info: Intel(R) Xeon(R) CPU E5-2699 v4 @ 2.20GHz
	GCC Version: gcc (GCC) 9.1.1 20190503 (Red Hat 9.1.1-1)
	Clang Version: 8.0.0 (Fedora 8.0.0-1.fc30)
	build-gcc-static
	build-gcc-shared
	build-clang-static
	build-clang-shared
	build-x86-default


OS: WIN10-64
	Kernel Version: N/A
	CPU info: N/A
	GCC Version: N/A
	Clang Version: Clang 8.0.0
	x86_64-windows-clang


OS: FreeBSD12-64
	Kernel Version: 12.0-RC3
	CPU info: Intel(R) Xeon(R) CPU E5-2699 v4 @ 2.20GHz (2194.99-MHz K8-class CPU)
	GCC Version: gcc (FreeBSD Ports Collection) 7.3.0
	Clang Version: 6.0.1 (tags/RELEASE_601/final 335540) (based on LLVM 6.0.1)
	build-gcc-static
	build-gcc-shared
	build-clang-static
	build-clang-shared
	build-x86-default


OS: SUSE15-64
	Kernel Version: 4.12.14-lp150.11-default
	CPU info: Intel(R) Xeon(R) CPU E5-2699 v4 @ 2.20GHz
	GCC Version: gcc (SUSE Linux) 7.3.1 20180323 [gcc-7-branch revision 258812]
	Clang Version: 5.0.1 (tags/RELEASE_501/final 312548)
	build-gcc-static
	build-gcc-shared
	build-clang-static
	build-clang-shared
	build-x86-default


*Make Build Failed #1:
OS: RHEL76-64
Target: x86_64-native-linuxapp-gcc
    *index = qs_item.index;
           ^
/tmp/RHEL76-64_K3.10.0_GCC4.8.5/x86_64-native-linuxapp-gcc/8bce68be4e224b2cab194687381eccfe/dpdk/lib/librte_lpm/rte_lpm.c: At top level:
cc1: error: unrecognized command line option "-Wno-address-of-packed-member" [-Werror]
cc1: all warnings being treated as errors
make[5]: *** [rte_lpm.o] Error 1
make[5]: *** Waiting for unfinished jobs....
  SYMLINK-FILE include/rte_ip.h
  SYMLINK-FILE include/rte_comp.h
  SYMLINK-FILE include/rte_tcp.h
  SYMLINK-FILE include/rte_compressdev.h
--
  SYMLINK-FILE include/rte_cryptodev.h
  CC rte_comp.o
  SYMLINK-FILE include/rte_cryptodev_pmd.h
  SYMLINK-FILE include/rte_crypto_asym.h
  SYMLINK-FILE include/rte_icmp.h
make[4]: *** [librte_lpm] Error 2
make[4]: *** Waiting for unfinished jobs....
  SYMLINK-FILE include/rte_arp.h
  CC rte_cryptodev.o
  CC rte_cryptodev_pmd.o
  SYMLINK-FILE include/rte_ether.h
--
  INSTALL-LIB librte_cryptodev.a
  AR librte_bbdev.a
  INSTALL-LIB librte_bbdev.a
  AR librte_compressdev.a
  INSTALL-LIB librte_compressdev.a
make[3]: *** [lib] Error 2
make[2]: *** [all] Error 2
make[1]: *** [pre_install] Error 2
make: *** [install] Error 2


*Make Build Failed #2:
OS: CENTOS76-64
Target: x86_64-native-linuxapp-gcc
    *index = qs_item.index;
           ^
/tmp/CENTOS76-64_K3.10.0_GCC4.8.5/x86_64-native-linuxapp-gcc/8bce68be4e224b2cab194687381eccfe/dpdk/lib/librte_lpm/rte_lpm.c: At top level:
cc1: error: unrecognized command line option "-Wno-address-of-packed-member" [-Werror]
cc1: all warnings being treated as errors
make[5]: *** [rte_lpm.o] Error 1
make[4]: *** [librte_lpm] Error 2
make[4]: *** Waiting for unfinished jobs....
  CC rte_member_vbf.o
  AR librte_reorder.a
  INSTALL-LIB librte_reorder.a
  CC rte_comp.o
--
  INSTALL-LIB librte_net.a
  AR librte_bbdev.a
  INSTALL-LIB librte_bbdev.a
  AR librte_compressdev.a
  INSTALL-LIB librte_compressdev.a
make[3]: *** [lib] Error 2
make[2]: *** [all] Error 2
make[1]: *** [pre_install] Error 2
make: *** [install] Error 2


*Make Build Failed #3:
OS: CENTOS76-64
Target: x86_64-native-linuxapp-gcc+debug
    *index = qs_item.index;
           ^
/tmp/CENTOS76-64_K3.10.0_GCC4.8.5/x86_64-native-linuxapp-gcc+debug/8bce68be4e224b2cab194687381eccfe/dpdk/lib/librte_lpm/rte_lpm.c: At top level:
cc1: error: unrecognized command line option "-Wno-address-of-packed-member" [-Werror]
cc1: all warnings being treated as errors
make[5]: *** [rte_lpm.o] Error 1
make[4]: *** [librte_lpm] Error 2
make[4]: *** Waiting for unfinished jobs....
  CC rte_arp.o
  CC rte_member_vbf.o
  AR librte_net.a
  INSTALL-LIB librte_net.a
--
  AR librte_bbdev.a
  INSTALL-LIB librte_bbdev.a
  AR librte_compressdev.a
  INSTALL-LIB librte_member.a
  INSTALL-LIB librte_compressdev.a
make[3]: *** [lib] Error 2
make[2]: *** [all] Error 2
make[1]: *** [pre_install] Error 2
make: *** [install] Error 2


*Make Build Failed #4:
OS: CENTOS76-64
Target: x86_64-native-linuxapp-gcc+shared
/tmp/CENTOS76-64_K3.10.0_GCC4.8.5/x86_64-native-linuxapp-gcc+shared/8bce68be4e224b2cab194687381eccfe/dpdk/lib/librte_lpm/rte_lpm.c: At top level:
cc1: error: unrecognized command line option "-Wno-address-of-packed-member" [-Werror]
cc1: all warnings being treated as errors
  SYMLINK-FILE include/rte_ip.h
  CC rte_reorder.o
make[5]: *** [rte_lpm.o] Error 1
make[5]: *** Waiting for unfinished jobs....
  SYMLINK-FILE include/rte_compressdev_pmd.h
  SYMLINK-FILE include/rte_tcp.h
  SYMLINK-FILE include/rte_udp.h
  SYMLINK-FILE include/rte_esp.h
  SYMLINK-FILE include/rte_compressdev_internal.h
  SYMLINK-FILE include/rte_sctp.h
  SYMLINK-FILE include/rte_crypto.h
  SYMLINK-FILE include/rte_crypto_sym.h
make[4]: *** [librte_lpm] Error 2
make[4]: *** Waiting for unfinished jobs....
  SYMLINK-FILE include/rte_cryptodev.h
  SYMLINK-FILE include/rte_icmp.h
  CC rte_compressdev.o
  SYMLINK-FILE include/rte_arp.h
--
  INSTALL-LIB librte_cryptodev.so.8.1
  LD librte_compressdev.so.1.1
  INSTALL-LIB librte_compressdev.so.1.1
  LD librte_bbdev.so.1.1
  INSTALL-LIB librte_bbdev.so.1.1
make[3]: *** [lib] Error 2
make[2]: *** [all] Error 2
make[1]: *** [pre_install] Error 2
make: *** [install] Error 2


*Make Build Failed #5:
OS: FreeBSD12-64
Target: x86_64-native-bsdapp-gcc+shared
rte_lpm.o: In function `rte_lpm_free_v1604':
rte_lpm.c:(.text+0x1364): undefined reference to `rte_ring_free'
rte_lpm.o: In function `rte_lpm_rcu_qsbr_add':
rte_lpm.c:(.text.experimental+0xd4): undefined reference to `rte_ring_create'
collect2: error: ld returned 1 exit status
gmake[5]: *** [/tmp/FreeBSD12-64_K19.02_GCC7.3.0/x86_64-native-bsdapp-gcc+shared/8bce68be4e224b2cab194687381eccfe/dpdk/mk/rte.lib.mk:102: librte_lpm.so.2.1] Error 1
gmake[4]: *** [/tmp/FreeBSD12-64_K19.02_GCC7.3.0/x86_64-native-bsdapp-gcc+shared/8bce68be4e224b2cab194687381eccfe/dpdk/mk/rte.subdir.mk:35: librte_lpm] Error 2
gmake[4]: *** Waiting for unfinished jobs....
  CC ethdev_profile.o
  CC cmdline_vt100.o
  CC cmdline_socket.o
  CC rte_approx.o
--
  LD librte_cmdline.so.2.1
  INSTALL-LIB librte_sched.so.3.1
  INSTALL-LIB librte_cmdline.so.2.1
  LD librte_ethdev.so.12.1
  INSTALL-LIB librte_ethdev.so.12.1
gmake[3]: *** [/tmp/FreeBSD12-64_K19.02_GCC7.3.0/x86_64-native-bsdapp-gcc+shared/8bce68be4e224b2cab194687381eccfe/dpdk/mk/rte.sdkbuild.mk:48: lib] Error 2
gmake[2]: *** [/tmp/FreeBSD12-64_K19.02_GCC7.3.0/x86_64-native-bsdapp-gcc+shared/8bce68be4e224b2cab194687381eccfe/dpdk/mk/rte.sdkroot.mk:99: all] Error 2
gmake[1]: *** [/tmp/FreeBSD12-64_K19.02_GCC7.3.0/x86_64-native-bsdapp-gcc+shared/8bce68be4e224b2cab194687381eccfe/dpdk/mk/rte.sdkinstall.mk:61: pre_install] Error 2
gmake: *** [/tmp/FreeBSD12-64_K19.02_GCC7.3.0/x86_64-native-bsdapp-gcc+shared/8bce68be4e224b2cab194687381eccfe/dpdk/mk/rte.sdkroot.mk:77: install] Error 2

DPDK STV team


More information about the test-report mailing list