[dpdk-test-report] |FAILURE| pw58823[2/2] examples/l3fwd: integrate RCU QSBR for LPM mode

sys_stv at intel.com sys_stv at intel.com
Fri Sep 6 22:09:42 CEST 2019


Test-Label: Intel-compilation
Test-Status: FAILURE
http://dpdk.org/patch/58823

_Compilation issues_

Submitter: Ruifeng Wang <ruifeng.wang at arm.com>
Date: 2019-09-06 10:26:15
Reply_mail: 20190906102615.36942-3-ruifeng.wang at arm.com
DPDK git baseline: Repo:dpdk, CommitID: e7fd5a3bbe5636e93a66fd5086f182756624c97a

Makefile build Summary: 22 Builds Done, 22 Successful, 0 Failures

Meson build Summary: 7 Builds Done, 2 Successful, 5 Failures

               +==============================================+===========+==========+
               |                   Makefile                   |   Meson   | Document |
+--------------+------+-------+------+------------+-----------+-----------+----------+
| os           | gcc  | clang | icc  | gcc+shared | gcc+debug | gcc/clang | pdf/html |
+--------------+------+-------+------+------------+-----------+-----------+----------+
| RHEL76-64    | pass |       |      |            |           |           |          |
| CENTOS76-64  | pass | pass  | pass | pass       | pass      |           |          |
| UB1804-64    | pass | pass  | pass |            |           | FAIL      | pass     |
| UB1604-32    | pass |       |      |            |           | FAIL      |          |
| UB1904-64    | pass |       |      |            |           |           |          |
| UB1604-64    | pass | pass  |      |            |           |           |          |
| FC30-64      | pass | pass  |      |            |           | FAIL      |          |
| WIN10-64     |      |       |      |            |           | pass      |          |
| FreeBSD12-64 | pass | pass  |      | pass       | pass      | FAIL      |          |
| RHEL80-64    | pass |       |      |            |           |           |          |
| SUSE15-64    | pass | pass  |      |            |           | FAIL      |          |
+--------------+------+-------+------+------------+-----------+-----------+----------+

Test environment and configuration as below:

** Makefile build **


OS: RHEL76-64
	Kernel Version: 3.10.0-957.el7.x86_64
	CPU info: Intel(R) Xeon(R) CPU E5-2699 v4 @ 2.20GHz
	GCC Version: gcc (GCC) 4.8.5 20150623 (Red Hat 4.8.5-36)
	Clang Version: NA
	x86_64-native-linuxapp-gcc


OS: CENTOS76-64
	Kernel Version: 3.10.0-957.10.1.el7.x86_64
	CPU info: Intel(R) Xeon(R) CPU E5-2699 v4 @ 2.20GHz
	GCC Version: gcc (GCC) 4.8.5 20150623 (Red Hat 4.8.5-36)
	Clang Version: 3.4.2 (tags/RELEASE_34/dot2-final)
	x86_64-native-linuxapp-gcc+debug
	x86_64-native-linuxapp-gcc
	x86_64-native-linuxapp-clang
	x86_64-native-linuxapp-gcc+shared
	x86_64-native-linuxapp-icc


OS: UB1804-64
	Kernel Version: 4.15.0-20-generic
	CPU info: Intel(R) Xeon(R) CPU E5-2699 v3 @ 2.30GHz
	GCC Version: gcc (Ubuntu 7.3.0-27ubuntu1~18.04) 7.3.0
	Clang Version: 6.0.0-1ubuntu2 (tags/RELEASE_600/final)
	x86_64-native-linuxapp-icc
	x86_64-native-linuxapp-clang
	x86_64-native-linuxapp-gcc


OS: UB1904-64
	Kernel Version: 5.0.0-13-generic
	CPU info: Intel(R) Xeon(R) CPU E5-2699 v3 @ 2.30GHz
	GCC Version: gcc (Ubuntu 8.3.0-6ubuntu1) 8.3.0
	Clang Version: 8.0.0-3 (tags/RELEASE_800/final)
	x86_64-native-linuxapp-gcc


OS: UB1604-32
	Kernel Version: 4.4.0-131-generic
	CPU info: Intel(R) Xeon(R) CPU E5-2699 v3 @ 2.30GHz
	GCC Version: gcc (Ubuntu 5.4.0-6ubuntu1~16.04.11) 5.4.0 20160609
	Clang Version: 3.8.0-2ubuntu4 (tags/RELEASE_380/final)
	i686-native-linuxapp-gcc


OS: UB1604-64
	Kernel Version: 4.4.0-47-generic
	CPU info: Intel(R) Xeon(R) CPU E5-2699 v3 @ 2.30GHz
	GCC Version: gcc (Ubuntu 5.4.0-6ubuntu1~16.04.10) 5.4.0 20160609
	Clang Version: 3.8.0-2ubuntu4 (tags/RELEASE_380/final)
	x86_64-native-linuxapp-clang
	x86_64-native-linuxapp-gcc


OS: FC30-64
	Kernel Version: 5.1.7-300.fc30.x86_64
	CPU info: Intel(R) Xeon(R) CPU E5-2699 v4 @ 2.20GHz
	GCC Version: gcc (GCC) 9.1.1 20190503 (Red Hat 9.1.1-1)
	Clang Version: 8.0.0 (Fedora 8.0.0-1.fc30)
	x86_64-native-linuxapp-gcc
	x86_64-native-linuxapp-clang


OS: FreeBSD12-64
	Kernel Version: 12.0-RC3
	CPU info: Intel(R) Xeon(R) CPU E5-2699 v4 @ 2.20GHz (2194.97-MHz K8-class CPU)
	GCC Version: gcc (FreeBSD Ports Collection) 7.3.0
	Clang Version: 6.0.1 (tags/RELEASE_601/final 335540) (based on LLVM 6.0.1)
	x86_64-native-bsdapp-gcc+shared
	x86_64-native-bsdapp-gcc+debug
	x86_64-native-bsdapp-clang
	x86_64-native-bsdapp-gcc


OS: RHEL80-64
	Kernel Version: 4.18.0-80.el8.x86_64
	CPU info: Intel(R) Xeon(R) CPU E5-2699 v4 @ 2.20GHz
	GCC Version: gcc (GCC) 8.2.1 20180905 (Red Hat 8.2.1-3)
	Clang Version: 6.0.1 (tags/RELEASE_601/final)
	x86_64-native-linuxapp-gcc


OS: SUSE15-64
	Kernel Version: 4.12.14-lp150.11-default
	CPU info: Intel(R) Xeon(R) CPU E5-2699 v4 @ 2.20GHz
	GCC Version: gcc (SUSE Linux) 7.3.1 20180323 [gcc-7-branch revision 258812]
	Clang Version: 5.0.1 (tags/RELEASE_501/final 312548)
	x86_64-native-linuxapp-gcc
	x86_64-native-linuxapp-clang


** Meson build **


OS: UB1804-64
	Kernel Version: 4.15.0-20-generic
	CPU info: Intel(R) Xeon(R) CPU E5-2699 v4 @ 2.20GHz
	GCC Version: gcc (Ubuntu 7.3.0-27ubuntu1~18.04) 7.3.0
	Clang Version: 6.0.0-1ubuntu2 (tags/RELEASE_600/final)
	x86_64-native-linuxapp-doc
	build-gcc-static
	build-gcc-shared
	build-clang-static
	build-clang-shared
	build-x86-default


OS: UB1604-32
	Kernel Version: 4.4.0-131-generic
	CPU info: Intel(R) Xeon(R) CPU E5-2699 v4 @ 2.20GHz
	GCC Version: gcc (Ubuntu 5.4.0-6ubuntu1~16.04.11) 5.4.0 20160609
	Clang Version: 3.8.0-2ubuntu4 (tags/RELEASE_380/final)
	build-gcc-static
	build-gcc-shared
	build-clang-static
	build-clang-shared
	build-x86-default


OS: FC30-64
	Kernel Version: 5.0.9-301.fc30.x86_64
	CPU info: Intel(R) Xeon(R) CPU E5-2699 v4 @ 2.20GHz
	GCC Version: gcc (GCC) 9.1.1 20190503 (Red Hat 9.1.1-1)
	Clang Version: 8.0.0 (Fedora 8.0.0-1.fc30)
	build-gcc-static
	build-gcc-shared
	build-clang-static
	build-clang-shared
	build-x86-default


OS: WIN10-64
	Kernel Version: N/A
	CPU info: N/A
	GCC Version: N/A
	Clang Version: Clang 8.0.0
	x86_64-windows-clang


OS: FreeBSD12-64
	Kernel Version: 12.0-RC3
	CPU info: Intel(R) Xeon(R) CPU E5-2699 v4 @ 2.20GHz (2194.99-MHz K8-class CPU)
	GCC Version: gcc (FreeBSD Ports Collection) 7.3.0
	Clang Version: 6.0.1 (tags/RELEASE_601/final 335540) (based on LLVM 6.0.1)
	build-gcc-static
	build-gcc-shared
	build-clang-static
	build-clang-shared
	build-x86-default


OS: SUSE15-64
	Kernel Version: 4.12.14-lp150.11-default
	CPU info: Intel(R) Xeon(R) CPU E5-2699 v4 @ 2.20GHz
	GCC Version: gcc (SUSE Linux) 7.3.1 20180323 [gcc-7-branch revision 258812]
	Clang Version: 5.0.1 (tags/RELEASE_501/final 312548)
	build-gcc-static
	build-gcc-shared
	build-clang-static
	build-clang-shared
	build-x86-default


*Meson Build Failed #1:
OS: SUSE15-64
Target:build-gcc-static
FAILED: examples/c590b3c@@dpdk-l3fwd at exe/l3fwd_l3fwd_lpm.c.o 
gcc -Iexamples/c590b3c@@dpdk-l3fwd at exe -Iexamples -I../examples -Iexamples/l3fwd -I../examples/l3fwd -I. -I../ -Iconfig -I../config -Ilib/librte_eal/common/include -I../lib/librte_eal/common/include -I../lib/librte_eal/linux/eal/include -Ilib/librte_eal/common -I../lib/librte_eal/common -Ilib/librte_eal/common/include/arch/x86 -I../lib/librte_eal/common/include/arch/x86 -Ilib/librte_eal -I../lib/librte_eal -Ilib/librte_kvargs -I../lib/librte_kvargs -Ilib/librte_mempool -I../lib/librte_mempool -Ilib/librte_ring -I../lib/librte_ring -Ilib/librte_net -I../lib/librte_net -Ilib/librte_mbuf -I../lib/librte_mbuf -Ilib/librte_ethdev -I../lib/librte_ethdev -Ilib/librte_meter -I../lib/librte_meter -Ilib/librte_cmdline -I../lib/librte_cmdline -Ilib/librte_hash -I../lib/librte_hash -Ilib/librte_lpm -I../lib/librte_lpm -fdiagnostics-color=always -pipe -D_FILE_OFFSET_BITS=64 -Wall -Winvalid-pch -Werror -O3 -include rte_config.h -Wunused-parameter -Wsign-compare -Wcast-qual -D_GNU_SOURCE -march=native -Wno-format-truncation -DALLOW_EXPERIMENTAL_API -MD -MQ 'examples/c590b3c@@dpdk-l3fwd at exe/l3fwd_l3fwd_lpm.c.o' -MF 'examples/c590b3c@@dpdk-l3fwd at exe/l3fwd_l3fwd_lpm.c.o.d' -o 'examples/c590b3c@@dpdk-l3fwd at exe/l3fwd_l3fwd_lpm.c.o' -c ../examples/l3fwd/l3fwd_lpm.c
../examples/l3fwd/l3fwd_lpm.c: In function ‘lpm_main_loop’:
../examples/l3fwd/l3fwd_lpm.c:219:7: error: implicit declaration of function ‘rte_rcu_qsbr_thread_register’; did you mean ‘rte_ctrl_thread_create’? [-Werror=implicit-function-declaration]
   if (rte_rcu_qsbr_thread_register(lpm4_qsv[socketid],
       ^~~~~~~~~~~~~~~~~~~~~~~~~~~~
       rte_ctrl_thread_create
../examples/l3fwd/l3fwd_lpm.c:226:3: error: implicit declaration of function ‘rte_rcu_qsbr_thread_online’; did you mean ‘rte_ctrl_thread_create’? [-Werror=implicit-function-declaration]
   rte_rcu_qsbr_thread_online(lpm4_qsv[socketid], lcore_id);
   ^~~~~~~~~~~~~~~~~~~~~~~~~~
   rte_ctrl_thread_create
../examples/l3fwd/l3fwd_lpm.c:262:6: error: implicit declaration of function ‘rte_rcu_qsbr_quiescent’ [-Werror=implicit-function-declaration]
      rte_rcu_qsbr_quiescent(
      ^~~~~~~~~~~~~~~~~~~~~~
../examples/l3fwd/l3fwd_lpm.c:282:3: error: implicit declaration of function ‘rte_rcu_qsbr_thread_offline’; did you mean ‘rte_ctrl_thread_create’? [-Werror=implicit-function-declaration]
   rte_rcu_qsbr_thread_offline(lpm4_qsv[socketid], lcore_id);
   ^~~~~~~~~~~~~~~~~~~~~~~~~~~
   rte_ctrl_thread_create
../examples/l3fwd/l3fwd_lpm.c:283:7: error: implicit declaration of function ‘rte_rcu_qsbr_thread_unregister’; did you mean ‘rte_extmem_unregister’? [-Werror=implicit-function-declaration]
   if (rte_rcu_qsbr_thread_unregister(lpm4_qsv[socketid],
       ^~~~~~~~~~~~~~~~~~~~~~~~~~~~~~
       rte_extmem_unregister
../examples/l3fwd/l3fwd_lpm.c: In function ‘setup_lpm’:
../examples/l3fwd/l3fwd_lpm.c:348:8: error: implicit declaration of function ‘rte_rcu_qsbr_get_memsize’; did you mean ‘rte_ring_get_memsize’? [-Werror=implicit-function-declaration]
   sz = rte_rcu_qsbr_get_memsize(RTE_MAX_LCORE);
        ^~~~~~~~~~~~~~~~~~~~~~~~
        rte_ring_get_memsize
../examples/l3fwd/l3fwd_lpm.c:357:8: error: implicit declaration of function ‘rte_rcu_qsbr_init’; did you mean ‘rte_ring_init’? [-Werror=implicit-function-declaration]
    if (rte_rcu_qsbr_init(lpm4_qsv[socketid],
        ^~~~~~~~~~~~~~~~~
        rte_ring_init
../examples/l3fwd/l3fwd_lpm.c:365:7: error: implicit declaration of function ‘rte_lpm_rcu_qsbr_add’; did you mean ‘rte_lpm6_add’? [-Werror=implicit-function-declaration]
   if (rte_lpm_rcu_qsbr_add(ipv4_l3fwd_lpm_lookup_struct[socketid],
       ^~~~~~~~~~~~~~~~~~~~
       rte_lpm6_add
cc1: all warnings being treated as errors
[1776/1831] Linking target examples/dpdk-l2fwd-keepalive.
[1777/1831] Compiling C object 'examples/c590b3c@@dpdk-l3fwd-vf at exe/l3fwd-vf_main.c.o'.
[1778/1831] Compiling C object 'examples/c590b3c@@dpdk-load_balancer at exe/load_balancer_init.c.o'.
[1779/1831] Compiling C object 'examples/c590b3c@@dpdk-simple_mp at exe/multi_process_simple_mp_main.c.o'.
[1780/1831] Linking target examples/dpdk-link_status_interrupt.
[1781/1831] Compiling C object 'examples/c590b3c@@dpdk-qos_sched at exe/qos_sched_stats.c.o'.
[1782/1831] Compiling C object 'examples/c590b3c@@dpdk-load_balancer at exe/load_balancer_config.c.o'.
ninja: build stopped: subcommand failed




*Meson Build Failed #2:
OS: UB1604-32
Target:build-gcc-static
FAILED: examples/c590b3c@@dpdk-l3fwd at exe/l3fwd_l3fwd_lpm.c.o 
gcc -Iexamples/c590b3c@@dpdk-l3fwd at exe -Iexamples -I../examples -Iexamples/l3fwd -I../examples/l3fwd -I. -I../ -Iconfig -I../config -Ilib/librte_eal/common/include -I../lib/librte_eal/common/include -I../lib/librte_eal/linux/eal/include -Ilib/librte_eal/common -I../lib/librte_eal/common -Ilib/librte_eal/common/include/arch/x86 -I../lib/librte_eal/common/include/arch/x86 -Ilib/librte_eal -I../lib/librte_eal -Ilib/librte_kvargs -I../lib/librte_kvargs -Ilib/librte_mempool -I../lib/librte_mempool -Ilib/librte_ring -I../lib/librte_ring -Ilib/librte_net -I../lib/librte_net -Ilib/librte_mbuf -I../lib/librte_mbuf -Ilib/librte_ethdev -I../lib/librte_ethdev -Ilib/librte_meter -I../lib/librte_meter -Ilib/librte_cmdline -I../lib/librte_cmdline -Ilib/librte_hash -I../lib/librte_hash -Ilib/librte_lpm -I../lib/librte_lpm -fdiagnostics-color=always -pipe -D_FILE_OFFSET_BITS=64 -Wall -Winvalid-pch -Werror -O3 -include rte_config.h -Wunused-parameter -Wsign-compare -Wcast-qual -Wno-pointer-to-int-cast -D_GNU_SOURCE -march=native -DALLOW_EXPERIMENTAL_API -MD -MQ 'examples/c590b3c@@dpdk-l3fwd at exe/l3fwd_l3fwd_lpm.c.o' -MF 'examples/c590b3c@@dpdk-l3fwd at exe/l3fwd_l3fwd_lpm.c.o.d' -o 'examples/c590b3c@@dpdk-l3fwd at exe/l3fwd_l3fwd_lpm.c.o' -c ../examples/l3fwd/l3fwd_lpm.c
../examples/l3fwd/l3fwd_lpm.c: In function ‘lpm_main_loop’:
../examples/l3fwd/l3fwd_lpm.c:219:7: error: implicit declaration of function ‘rte_rcu_qsbr_thread_register’ [-Werror=implicit-function-declaration]
   if (rte_rcu_qsbr_thread_register(lpm4_qsv[socketid],
       ^
../examples/l3fwd/l3fwd_lpm.c:226:3: error: implicit declaration of function ‘rte_rcu_qsbr_thread_online’ [-Werror=implicit-function-declaration]
   rte_rcu_qsbr_thread_online(lpm4_qsv[socketid], lcore_id);
   ^
../examples/l3fwd/l3fwd_lpm.c:262:6: error: implicit declaration of function ‘rte_rcu_qsbr_quiescent’ [-Werror=implicit-function-declaration]
      rte_rcu_qsbr_quiescent(
      ^
../examples/l3fwd/l3fwd_lpm.c:282:3: error: implicit declaration of function ‘rte_rcu_qsbr_thread_offline’ [-Werror=implicit-function-declaration]
   rte_rcu_qsbr_thread_offline(lpm4_qsv[socketid], lcore_id);
   ^
../examples/l3fwd/l3fwd_lpm.c:283:7: error: implicit declaration of function ‘rte_rcu_qsbr_thread_unregister’ [-Werror=implicit-function-declaration]
   if (rte_rcu_qsbr_thread_unregister(lpm4_qsv[socketid],
       ^
../examples/l3fwd/l3fwd_lpm.c: In function ‘setup_lpm’:
../examples/l3fwd/l3fwd_lpm.c:348:8: error: implicit declaration of function ‘rte_rcu_qsbr_get_memsize’ [-Werror=implicit-function-declaration]
   sz = rte_rcu_qsbr_get_memsize(RTE_MAX_LCORE);
        ^
../examples/l3fwd/l3fwd_lpm.c:357:8: error: implicit declaration of function ‘rte_rcu_qsbr_init’ [-Werror=implicit-function-declaration]
    if (rte_rcu_qsbr_init(lpm4_qsv[socketid],
        ^
../examples/l3fwd/l3fwd_lpm.c:365:7: error: implicit declaration of function ‘rte_lpm_rcu_qsbr_add’ [-Werror=implicit-function-declaration]
   if (rte_lpm_rcu_qsbr_add(ipv4_l3fwd_lpm_lookup_struct[socketid],
       ^
cc1: all warnings being treated as errors
[1575/1656] Compiling C object 'examples/c590b3c@@dpdk-l3fwd-power at exe/l3fwd-power_perf_core.c.o'.
[1576/1656] Compiling C object 'examples/c590b3c@@dpdk-l2fwd-jobstats at exe/l2fwd-jobstats_main.c.o'.
[1577/1656] Compiling C object 'examples/c590b3c@@dpdk-ipsec-secgw at exe/ipsec-secgw_ipsec-secgw.c.o'.
[1578/1656] Compiling C object 'examples/c590b3c@@dpdk-l3fwd-power at exe/l3fwd-power_main.c.o'.
[1579/1656] Compiling C object 'examples/c590b3c@@dpdk-l2fwd-crypto at exe/l2fwd-crypto_main.c.o'.
ninja: build stopped: subcommand failed




*Meson Build Failed #3:
OS: FC30-64
Target:build-gcc-static
FAILED: examples/c590b3c@@dpdk-l3fwd at exe/l3fwd_l3fwd_lpm.c.o 
gcc -Iexamples/c590b3c@@dpdk-l3fwd at exe -Iexamples -I../examples -Iexamples/l3fwd -I../examples/l3fwd -I. -I../ -Iconfig -I../config -Ilib/librte_eal/common/include -I../lib/librte_eal/common/include -I../lib/librte_eal/linux/eal/include -Ilib/librte_eal/common -I../lib/librte_eal/common -Ilib/librte_eal/common/include/arch/x86 -I../lib/librte_eal/common/include/arch/x86 -Ilib/librte_eal -I../lib/librte_eal -Ilib/librte_kvargs -I../lib/librte_kvargs -Ilib/librte_mempool -I../lib/librte_mempool -Ilib/librte_ring -I../lib/librte_ring -Ilib/librte_net -I../lib/librte_net -Ilib/librte_mbuf -I../lib/librte_mbuf -Ilib/librte_ethdev -I../lib/librte_ethdev -Ilib/librte_meter -I../lib/librte_meter -Ilib/librte_cmdline -I../lib/librte_cmdline -Ilib/librte_hash -I../lib/librte_hash -Ilib/librte_lpm -I../lib/librte_lpm -fdiagnostics-color=always -pipe -D_FILE_OFFSET_BITS=64 -Wall -Winvalid-pch -Werror -O3 -include rte_config.h -Wunused-parameter -Wsign-compare -Wcast-qual -Wno-address-of-packed-member -D_GNU_SOURCE -march=native -mno-avx512f -Wno-format-truncation -DALLOW_EXPERIMENTAL_API -MD -MQ 'examples/c590b3c@@dpdk-l3fwd at exe/l3fwd_l3fwd_lpm.c.o' -MF 'examples/c590b3c@@dpdk-l3fwd at exe/l3fwd_l3fwd_lpm.c.o.d' -o 'examples/c590b3c@@dpdk-l3fwd at exe/l3fwd_l3fwd_lpm.c.o' -c ../examples/l3fwd/l3fwd_lpm.c
../examples/l3fwd/l3fwd_lpm.c: In function ‘lpm_main_loop’:
../examples/l3fwd/l3fwd_lpm.c:219:7: error: implicit declaration of function ‘rte_rcu_qsbr_thread_register’ [-Werror=implicit-function-declaration]
  219 |   if (rte_rcu_qsbr_thread_register(lpm4_qsv[socketid],
      |       ^~~~~~~~~~~~~~~~~~~~~~~~~~~~
../examples/l3fwd/l3fwd_lpm.c:226:3: error: implicit declaration of function ‘rte_rcu_qsbr_thread_online’ [-Werror=implicit-function-declaration]
  226 |   rte_rcu_qsbr_thread_online(lpm4_qsv[socketid], lcore_id);
      |   ^~~~~~~~~~~~~~~~~~~~~~~~~~
../examples/l3fwd/l3fwd_lpm.c:262:6: error: implicit declaration of function ‘rte_rcu_qsbr_quiescent’ [-Werror=implicit-function-declaration]
  262 |      rte_rcu_qsbr_quiescent(
      |      ^~~~~~~~~~~~~~~~~~~~~~
../examples/l3fwd/l3fwd_lpm.c:282:3: error: implicit declaration of function ‘rte_rcu_qsbr_thread_offline’ [-Werror=implicit-function-declaration]
  282 |   rte_rcu_qsbr_thread_offline(lpm4_qsv[socketid], lcore_id);
      |   ^~~~~~~~~~~~~~~~~~~~~~~~~~~
../examples/l3fwd/l3fwd_lpm.c:283:7: error: implicit declaration of function ‘rte_rcu_qsbr_thread_unregister’ [-Werror=implicit-function-declaration]
  283 |   if (rte_rcu_qsbr_thread_unregister(lpm4_qsv[socketid],
      |       ^~~~~~~~~~~~~~~~~~~~~~~~~~~~~~
../examples/l3fwd/l3fwd_lpm.c: In function ‘setup_lpm’:
../examples/l3fwd/l3fwd_lpm.c:348:8: error: implicit declaration of function ‘rte_rcu_qsbr_get_memsize’; did you mean ‘rte_ring_get_memsize’? [-Werror=implicit-function-declaration]
  348 |   sz = rte_rcu_qsbr_get_memsize(RTE_MAX_LCORE);
      |        ^~~~~~~~~~~~~~~~~~~~~~~~
      |        rte_ring_get_memsize
../examples/l3fwd/l3fwd_lpm.c:357:8: error: implicit declaration of function ‘rte_rcu_qsbr_init’ [-Werror=implicit-function-declaration]
  357 |    if (rte_rcu_qsbr_init(lpm4_qsv[socketid],
      |        ^~~~~~~~~~~~~~~~~
../examples/l3fwd/l3fwd_lpm.c:365:7: error: implicit declaration of function ‘rte_lpm_rcu_qsbr_add’ [-Werror=implicit-function-declaration]
  365 |   if (rte_lpm_rcu_qsbr_add(ipv4_l3fwd_lpm_lookup_struct[socketid],
      |       ^~~~~~~~~~~~~~~~~~~~
cc1: all warnings being treated as errors
[1706/1784] Linking target examples/dpdk-l2fwd.
[1707/1784] Compiling C object 'examples/c590b3c@@dpdk-load_balancer at exe/load_balancer_runtime.c.o'.
[1708/1784] Linking target examples/dpdk-kni.
[1709/1784] Compiling C object 'examples/c590b3c@@dpdk-l2fwd-jobstats at exe/l2fwd-jobstats_main.c.o'.
[1710/1784] Compiling C object 'examples/c590b3c@@dpdk-l2fwd-keepalive at exe/l2fwd-keepalive_main.c.o'.
[1711/1784] Compiling C object 'examples/c590b3c@@dpdk-l2fwd-crypto at exe/l2fwd-crypto_main.c.o'.
[1712/1784] Compiling C object 'examples/c590b3c@@dpdk-l3fwd at exe/l3fwd_l3fwd_em.c.o'.
ninja: build stopped: subcommand failed




*Meson Build Failed #4:
OS: UB1804-64
Target:build-gcc-static
FAILED: examples/c590b3c@@dpdk-l3fwd at exe/l3fwd_l3fwd_lpm.c.o 
gcc -Iexamples/c590b3c@@dpdk-l3fwd at exe -Iexamples -I../examples -Iexamples/l3fwd -I../examples/l3fwd -I. -I../ -Iconfig -I../config -Ilib/librte_eal/common/include -I../lib/librte_eal/common/include -I../lib/librte_eal/linux/eal/include -Ilib/librte_eal/common -I../lib/librte_eal/common -Ilib/librte_eal/common/include/arch/x86 -I../lib/librte_eal/common/include/arch/x86 -Ilib/librte_eal -I../lib/librte_eal -Ilib/librte_kvargs -I../lib/librte_kvargs -Ilib/librte_mempool -I../lib/librte_mempool -Ilib/librte_ring -I../lib/librte_ring -Ilib/librte_net -I../lib/librte_net -Ilib/librte_mbuf -I../lib/librte_mbuf -Ilib/librte_ethdev -I../lib/librte_ethdev -Ilib/librte_meter -I../lib/librte_meter -Ilib/librte_cmdline -I../lib/librte_cmdline -Ilib/librte_hash -I../lib/librte_hash -Ilib/librte_lpm -I../lib/librte_lpm -fdiagnostics-color=always -pipe -D_FILE_OFFSET_BITS=64 -Wall -Winvalid-pch -Werror -O3 -include rte_config.h -Wunused-parameter -Wsign-compare -Wcast-qual -D_GNU_SOURCE -march=native -mno-avx512f -Wno-format-truncation -DALLOW_EXPERIMENTAL_API -MD -MQ 'examples/c590b3c@@dpdk-l3fwd at exe/l3fwd_l3fwd_lpm.c.o' -MF 'examples/c590b3c@@dpdk-l3fwd at exe/l3fwd_l3fwd_lpm.c.o.d' -o 'examples/c590b3c@@dpdk-l3fwd at exe/l3fwd_l3fwd_lpm.c.o' -c ../examples/l3fwd/l3fwd_lpm.c
../examples/l3fwd/l3fwd_lpm.c: In function ‘lpm_main_loop’:
../examples/l3fwd/l3fwd_lpm.c:219:7: error: implicit declaration of function ‘rte_rcu_qsbr_thread_register’; did you mean ‘rte_ctrl_thread_create’? [-Werror=implicit-function-declaration]
   if (rte_rcu_qsbr_thread_register(lpm4_qsv[socketid],
       ^~~~~~~~~~~~~~~~~~~~~~~~~~~~
       rte_ctrl_thread_create
../examples/l3fwd/l3fwd_lpm.c:226:3: error: implicit declaration of function ‘rte_rcu_qsbr_thread_online’; did you mean ‘rte_ctrl_thread_create’? [-Werror=implicit-function-declaration]
   rte_rcu_qsbr_thread_online(lpm4_qsv[socketid], lcore_id);
   ^~~~~~~~~~~~~~~~~~~~~~~~~~
   rte_ctrl_thread_create
../examples/l3fwd/l3fwd_lpm.c:262:6: error: implicit declaration of function ‘rte_rcu_qsbr_quiescent’ [-Werror=implicit-function-declaration]
      rte_rcu_qsbr_quiescent(
      ^~~~~~~~~~~~~~~~~~~~~~
../examples/l3fwd/l3fwd_lpm.c:282:3: error: implicit declaration of function ‘rte_rcu_qsbr_thread_offline’; did you mean ‘rte_ctrl_thread_create’? [-Werror=implicit-function-declaration]
   rte_rcu_qsbr_thread_offline(lpm4_qsv[socketid], lcore_id);
   ^~~~~~~~~~~~~~~~~~~~~~~~~~~
   rte_ctrl_thread_create
../examples/l3fwd/l3fwd_lpm.c:283:7: error: implicit declaration of function ‘rte_rcu_qsbr_thread_unregister’; did you mean ‘rte_extmem_unregister’? [-Werror=implicit-function-declaration]
   if (rte_rcu_qsbr_thread_unregister(lpm4_qsv[socketid],
       ^~~~~~~~~~~~~~~~~~~~~~~~~~~~~~
       rte_extmem_unregister
../examples/l3fwd/l3fwd_lpm.c: In function ‘setup_lpm’:
../examples/l3fwd/l3fwd_lpm.c:348:8: error: implicit declaration of function ‘rte_rcu_qsbr_get_memsize’; did you mean ‘rte_ring_get_memsize’? [-Werror=implicit-function-declaration]
   sz = rte_rcu_qsbr_get_memsize(RTE_MAX_LCORE);
        ^~~~~~~~~~~~~~~~~~~~~~~~
        rte_ring_get_memsize
../examples/l3fwd/l3fwd_lpm.c:357:8: error: implicit declaration of function ‘rte_rcu_qsbr_init’; did you mean ‘rte_ring_init’? [-Werror=implicit-function-declaration]
    if (rte_rcu_qsbr_init(lpm4_qsv[socketid],
        ^~~~~~~~~~~~~~~~~
        rte_ring_init
../examples/l3fwd/l3fwd_lpm.c:365:7: error: implicit declaration of function ‘rte_lpm_rcu_qsbr_add’; did you mean ‘rte_lpm6_add’? [-Werror=implicit-function-declaration]
   if (rte_lpm_rcu_qsbr_add(ipv4_l3fwd_lpm_lookup_struct[socketid],
       ^~~~~~~~~~~~~~~~~~~~
       rte_lpm6_add
cc1: all warnings being treated as errors
[1709/1791] Compiling C object 'examples/c590b3c@@dpdk-l2fwd at exe/l2fwd_main.c.o'.
[1710/1791] Compiling C object 'examples/c590b3c@@dpdk-l3fwd at exe/l3fwd_main.c.o'.
[1711/1791] Linking target examples/dpdk-l2fwd-crypto.
[1712/1791] Linking target examples/dpdk-kni.
[1713/1791] Compiling C object 'examples/c590b3c@@dpdk-ipsec-secgw at exe/ipsec-secgw_ipsec-secgw.c.o'.
ninja: build stopped: subcommand failed




*Meson Build Failed #5:
OS: FreeBSD12-64
Target:build-gcc-static
FAILED: examples/c590b3c@@dpdk-l3fwd at exe/l3fwd_l3fwd_lpm.c.o 
ccache gcc -Iexamples/c590b3c@@dpdk-l3fwd at exe -Iexamples -I../examples -Iexamples/l3fwd -I../examples/l3fwd -I. -I../ -Iconfig -I../config -Ilib/librte_eal/common/include -I../lib/librte_eal/common/include -I../lib/librte_eal/freebsd/eal/include -Ilib/librte_eal/common -I../lib/librte_eal/common -Ilib/librte_eal/common/include/arch/x86 -I../lib/librte_eal/common/include/arch/x86 -Ilib/librte_eal -I../lib/librte_eal -Ilib/librte_kvargs -I../lib/librte_kvargs -Ilib/librte_mempool -I../lib/librte_mempool -Ilib/librte_ring -I../lib/librte_ring -Ilib/librte_net -I../lib/librte_net -Ilib/librte_mbuf -I../lib/librte_mbuf -Ilib/librte_ethdev -I../lib/librte_ethdev -Ilib/librte_meter -I../lib/librte_meter -Ilib/librte_cmdline -I../lib/librte_cmdline -Ilib/librte_hash -I../lib/librte_hash -Ilib/librte_lpm -I../lib/librte_lpm -fdiagnostics-color=always -pipe -D_FILE_OFFSET_BITS=64 -Wall -Winvalid-pch -Werror -O3 -include rte_config.h -Wunused-parameter -Wsign-compare -Wcast-qual -D_GNU_SOURCE -D__BSD_VISIBLE -march=native -Wno-format-truncation -DALLOW_EXPERIMENTAL_API -MD -MQ 'examples/c590b3c@@dpdk-l3fwd at exe/l3fwd_l3fwd_lpm.c.o' -MF 'examples/c590b3c@@dpdk-l3fwd at exe/l3fwd_l3fwd_lpm.c.o.d' -o 'examples/c590b3c@@dpdk-l3fwd at exe/l3fwd_l3fwd_lpm.c.o' -c ../examples/l3fwd/l3fwd_lpm.c
../examples/l3fwd/l3fwd_lpm.c: In function 'lpm_main_loop':
../examples/l3fwd/l3fwd_lpm.c:219:7: error: implicit declaration of function 'rte_rcu_qsbr_thread_register'; did you mean 'rte_ctrl_thread_create'? [-Werror=implicit-function-declaration]
   if (rte_rcu_qsbr_thread_register(lpm4_qsv[socketid],
       ^~~~~~~~~~~~~~~~~~~~~~~~~~~~
       rte_ctrl_thread_create
../examples/l3fwd/l3fwd_lpm.c:226:3: error: implicit declaration of function 'rte_rcu_qsbr_thread_online'; did you mean 'rte_ctrl_thread_create'? [-Werror=implicit-function-declaration]
   rte_rcu_qsbr_thread_online(lpm4_qsv[socketid], lcore_id);
   ^~~~~~~~~~~~~~~~~~~~~~~~~~
   rte_ctrl_thread_create
../examples/l3fwd/l3fwd_lpm.c:262:6: error: implicit declaration of function 'rte_rcu_qsbr_quiescent' [-Werror=implicit-function-declaration]
      rte_rcu_qsbr_quiescent(
      ^~~~~~~~~~~~~~~~~~~~~~
../examples/l3fwd/l3fwd_lpm.c:282:3: error: implicit declaration of function 'rte_rcu_qsbr_thread_offline'; did you mean 'rte_ctrl_thread_create'? [-Werror=implicit-function-declaration]
   rte_rcu_qsbr_thread_offline(lpm4_qsv[socketid], lcore_id);
   ^~~~~~~~~~~~~~~~~~~~~~~~~~~
   rte_ctrl_thread_create
../examples/l3fwd/l3fwd_lpm.c:283:7: error: implicit declaration of function 'rte_rcu_qsbr_thread_unregister'; did you mean 'rte_extmem_unregister'? [-Werror=implicit-function-declaration]
   if (rte_rcu_qsbr_thread_unregister(lpm4_qsv[socketid],
       ^~~~~~~~~~~~~~~~~~~~~~~~~~~~~~
       rte_extmem_unregister
../examples/l3fwd/l3fwd_lpm.c: In function 'setup_lpm':
../examples/l3fwd/l3fwd_lpm.c:348:8: error: implicit declaration of function 'rte_rcu_qsbr_get_memsize'; did you mean 'rte_ring_get_memsize'? [-Werror=implicit-function-declaration]
   sz = rte_rcu_qsbr_get_memsize(RTE_MAX_LCORE);
        ^~~~~~~~~~~~~~~~~~~~~~~~
        rte_ring_get_memsize
../examples/l3fwd/l3fwd_lpm.c:357:8: error: implicit declaration of function 'rte_rcu_qsbr_init'; did you mean 'rte_ring_init'? [-Werror=implicit-function-declaration]
    if (rte_rcu_qsbr_init(lpm4_qsv[socketid],
        ^~~~~~~~~~~~~~~~~
        rte_ring_init
../examples/l3fwd/l3fwd_lpm.c:365:7: error: implicit declaration of function 'rte_lpm_rcu_qsbr_add'; did you mean 'rte_lpm6_add'? [-Werror=implicit-function-declaration]
   if (rte_lpm_rcu_qsbr_add(ipv4_l3fwd_lpm_lookup_struct[socketid],
       ^~~~~~~~~~~~~~~~~~~~
       rte_lpm6_add
cc1: all warnings being treated as errors
[1390/1413] Compiling C object 'examples/c590b3c@@dpdk-qos_sched at exe/qos_sched_cfg_file.c.o'.
[1391/1413] Compiling C object 'examples/c590b3c@@dpdk-qos_sched at exe/qos_sched_cmdline.c.o'.
[1392/1413] Linking target examples/dpdk-packet_ordering.
[1393/1413] Linking target examples/dpdk-ptpclient.
[1394/1413] Linking target examples/dpdk-qos_meter.
ninja: build stopped: subcommand failed



DPDK STV team


More information about the test-report mailing list