[dpdk-test-report] |FAILURE| pw58826[3/5] event/dpaa2: add destroy support

sys_stv at intel.com sys_stv at intel.com
Sat Sep 7 00:36:30 CEST 2019


Test-Label: Intel-compilation
Test-Status: FAILURE
http://dpdk.org/patch/58826

_Compilation issues_

Submitter: Hemant Agrawal <hemant.agrawal at nxp.com>
Date: 2019-09-06 10:34:08
Reply_mail: 20190906103410.14996-4-hemant.agrawal at nxp.com
DPDK git baseline: Repo:dpdk-next-eventdev, CommitID: 4ba6fa790cfadc9065c3cf6aa62b84031248e76d

Makefile build Summary: 22 Builds Done, 4 Successful, 18 Failures

Meson build Summary: 7 Builds Done, 2 Successful, 5 Failures

               +==============================================+===========+==========+
               |                   Makefile                   |   Meson   | Document |
+--------------+------+-------+------+------------+-----------+-----------+----------+
| os           | gcc  | clang | icc  | gcc+shared | gcc+debug | gcc/clang | pdf/html |
+--------------+------+-------+------+------------+-----------+-----------+----------+
| RHEL76-64    | FAIL |       |      |            |           |           |          |
| CENTOS76-64  | FAIL | FAIL  | FAIL | FAIL       | FAIL      |           |          |
| UB1804-64    | FAIL | FAIL  | FAIL |            |           | FAIL      | pass     |
| UB1604-32    | FAIL |       |      |            |           | FAIL      |          |
| UB1904-64    | FAIL |       |      |            |           |           |          |
| UB1604-64    | FAIL | FAIL  |      |            |           |           |          |
| FC30-64      | FAIL | FAIL  |      |            |           | FAIL      |          |
| WIN10-64     |      |       |      |            |           | pass      |          |
| FreeBSD12-64 | pass | pass  |      | pass       | pass      | FAIL      |          |
| RHEL80-64    | FAIL |       |      |            |           |           |          |
| SUSE15-64    | FAIL | FAIL  |      |            |           | FAIL      |          |
+--------------+------+-------+------+------------+-----------+-----------+----------+

Test environment and configuration as below:

** Makefile build **


OS: RHEL76-64
	Kernel Version: 3.10.0-957.el7.x86_64
	CPU info: Intel(R) Xeon(R) CPU E5-2699 v4 @ 2.20GHz
	GCC Version: gcc (GCC) 4.8.5 20150623 (Red Hat 4.8.5-36)
	Clang Version: NA
	x86_64-native-linuxapp-gcc


OS: CENTOS76-64
	Kernel Version: 3.10.0-957.10.1.el7.x86_64
	CPU info: Intel(R) Xeon(R) CPU E5-2699 v4 @ 2.20GHz
	GCC Version: gcc (GCC) 4.8.5 20150623 (Red Hat 4.8.5-36)
	Clang Version: 3.4.2 (tags/RELEASE_34/dot2-final)
	x86_64-native-linuxapp-gcc+debug
	x86_64-native-linuxapp-gcc
	x86_64-native-linuxapp-clang
	x86_64-native-linuxapp-gcc+shared
	x86_64-native-linuxapp-icc


OS: UB1804-64
	Kernel Version: 4.15.0-20-generic
	CPU info: Intel(R) Xeon(R) CPU E5-2699 v3 @ 2.30GHz
	GCC Version: gcc (Ubuntu 7.3.0-27ubuntu1~18.04) 7.3.0
	Clang Version: 6.0.0-1ubuntu2 (tags/RELEASE_600/final)
	x86_64-native-linuxapp-icc
	x86_64-native-linuxapp-clang
	x86_64-native-linuxapp-gcc


OS: UB1904-64
	Kernel Version: 5.0.0-13-generic
	CPU info: Intel(R) Xeon(R) CPU E5-2699 v3 @ 2.30GHz
	GCC Version: gcc (Ubuntu 8.3.0-6ubuntu1) 8.3.0
	Clang Version: 8.0.0-3 (tags/RELEASE_800/final)
	x86_64-native-linuxapp-gcc


OS: UB1604-32
	Kernel Version: 4.4.0-131-generic
	CPU info: Intel(R) Xeon(R) CPU E5-2699 v3 @ 2.30GHz
	GCC Version: gcc (Ubuntu 5.4.0-6ubuntu1~16.04.11) 5.4.0 20160609
	Clang Version: 3.8.0-2ubuntu4 (tags/RELEASE_380/final)
	i686-native-linuxapp-gcc


OS: UB1604-64
	Kernel Version: 4.4.0-47-generic
	CPU info: Intel(R) Xeon(R) CPU E5-2699 v3 @ 2.30GHz
	GCC Version: gcc (Ubuntu 5.4.0-6ubuntu1~16.04.10) 5.4.0 20160609
	Clang Version: 3.8.0-2ubuntu4 (tags/RELEASE_380/final)
	x86_64-native-linuxapp-clang
	x86_64-native-linuxapp-gcc


OS: FC30-64
	Kernel Version: 5.1.7-300.fc30.x86_64
	CPU info: Intel(R) Xeon(R) CPU E5-2699 v4 @ 2.20GHz
	GCC Version: gcc (GCC) 9.1.1 20190503 (Red Hat 9.1.1-1)
	Clang Version: 8.0.0 (Fedora 8.0.0-1.fc30)
	x86_64-native-linuxapp-gcc
	x86_64-native-linuxapp-clang


OS: FreeBSD12-64
	Kernel Version: 12.0-RC3
	CPU info: Intel(R) Xeon(R) CPU E5-2699 v4 @ 2.20GHz (2194.97-MHz K8-class CPU)
	GCC Version: gcc (FreeBSD Ports Collection) 7.3.0
	Clang Version: 6.0.1 (tags/RELEASE_601/final 335540) (based on LLVM 6.0.1)
	x86_64-native-bsdapp-clang
	x86_64-native-bsdapp-gcc+debug
	x86_64-native-bsdapp-gcc
	x86_64-native-bsdapp-gcc+shared


OS: RHEL80-64
	Kernel Version: 4.18.0-80.el8.x86_64
	CPU info: Intel(R) Xeon(R) CPU E5-2699 v4 @ 2.20GHz
	GCC Version: gcc (GCC) 8.2.1 20180905 (Red Hat 8.2.1-3)
	Clang Version: 6.0.1 (tags/RELEASE_601/final)
	x86_64-native-linuxapp-gcc


OS: SUSE15-64
	Kernel Version: 4.12.14-lp150.11-default
	CPU info: Intel(R) Xeon(R) CPU E5-2699 v4 @ 2.20GHz
	GCC Version: gcc (SUSE Linux) 7.3.1 20180323 [gcc-7-branch revision 258812]
	Clang Version: 5.0.1 (tags/RELEASE_501/final 312548)
	x86_64-native-linuxapp-gcc
	x86_64-native-linuxapp-clang


** Meson build **


OS: UB1804-64
	Kernel Version: 4.15.0-20-generic
	CPU info: Intel(R) Xeon(R) CPU E5-2699 v4 @ 2.20GHz
	GCC Version: gcc (Ubuntu 7.3.0-27ubuntu1~18.04) 7.3.0
	Clang Version: 6.0.0-1ubuntu2 (tags/RELEASE_600/final)
	build-gcc-static
	build-gcc-shared
	build-clang-static
	build-clang-shared
	build-x86-default
	x86_64-native-linuxapp-doc


OS: UB1604-32
	Kernel Version: 4.4.0-131-generic
	CPU info: Intel(R) Xeon(R) CPU E5-2699 v4 @ 2.20GHz
	GCC Version: gcc (Ubuntu 5.4.0-6ubuntu1~16.04.11) 5.4.0 20160609
	Clang Version: 3.8.0-2ubuntu4 (tags/RELEASE_380/final)
	build-gcc-static
	build-gcc-shared
	build-clang-static
	build-clang-shared
	build-x86-default


OS: FC30-64
	Kernel Version: 5.0.9-301.fc30.x86_64
	CPU info: Intel(R) Xeon(R) CPU E5-2699 v4 @ 2.20GHz
	GCC Version: gcc (GCC) 9.1.1 20190503 (Red Hat 9.1.1-1)
	Clang Version: 8.0.0 (Fedora 8.0.0-1.fc30)
	build-gcc-static
	build-gcc-shared
	build-clang-static
	build-clang-shared
	build-x86-default


OS: WIN10-64
	Kernel Version: N/A
	CPU info: N/A
	GCC Version: N/A
	Clang Version: Clang 8.0.0
	x86_64-windows-clang


OS: FreeBSD12-64
	Kernel Version: 12.0-RC3
	CPU info: Intel(R) Xeon(R) CPU E5-2699 v4 @ 2.20GHz (2194.99-MHz K8-class CPU)
	GCC Version: gcc (FreeBSD Ports Collection) 7.3.0
	Clang Version: 6.0.1 (tags/RELEASE_601/final 335540) (based on LLVM 6.0.1)
	build-gcc-static
	build-gcc-shared
	build-clang-static
	build-clang-shared
	build-x86-default


OS: SUSE15-64
	Kernel Version: 4.12.14-lp150.11-default
	CPU info: Intel(R) Xeon(R) CPU E5-2699 v4 @ 2.20GHz
	GCC Version: gcc (SUSE Linux) 7.3.1 20180323 [gcc-7-branch revision 258812]
	Clang Version: 5.0.1 (tags/RELEASE_501/final 312548)
	build-gcc-static
	build-gcc-shared
	build-clang-static
	build-clang-shared
	build-x86-default


*Make Build Failed #1:
OS: UB1604-64
Target: x86_64-native-linuxapp-clang
== Build drivers/event/opdl
== Build drivers/event/dpaa
== Build drivers/event/octeontx2
make[6]: Warning: File '/tmp/UB1604-64_K4.4.0_Clang3.8.0/x86_64-native-linuxapp-clang/2cd42b5301b443f29da60d354fbf4f09/dpdk/drivers/event/dpaa2/Makefile' has modification time 17255 s in the future
  CC skeleton_eventdev.o
make[6]: *** No rule to make target 'dpaa2_eventdev_selftest.o', needed by 'librte_pmd_dpaa2_event.a'.  Stop.
  CC dpaa_eventdev.o
make[6]: *** Waiting for unfinished jobs....
  CC dpaa2_hw_dpcon.o
  CC dpaa2_eventdev.o
  CC ssovf_evdev.o
--
  PMDINFO dpaa_eventdev.o.pmd.c
  CC dpaa_eventdev.o.pmd.o
  CC timvf_worker.o
  LD opdl_evdev.o
  LD dpaa_eventdev.o
/tmp/UB1604-64_K4.4.0_Clang3.8.0/x86_64-native-linuxapp-clang/2cd42b5301b443f29da60d354fbf4f09/dpdk/mk/rte.subdir.mk:35: recipe for target 'dpaa2' failed
make[5]: *** [dpaa2] Error 2
make[5]: *** Waiting for unfinished jobs....
  CC timvf_evdev.o
  PMDINFO sw_evdev.o.pmd.c
  CC sw_evdev.o.pmd.o
  CC opdl_evdev_init.o
--
  AR librte_pmd_sw_event.a
  INSTALL-LIB librte_pmd_sw_event.a
make[6]: warning:  Clock skew detected.  Your build may be incomplete.
  AR librte_pmd_octeontx2_event.a
  INSTALL-LIB librte_pmd_octeontx2_event.a
/tmp/UB1604-64_K4.4.0_Clang3.8.0/x86_64-native-linuxapp-clang/2cd42b5301b443f29da60d354fbf4f09/dpdk/mk/rte.subdir.mk:35: recipe for target 'event' failed
make[4]: *** [event] Error 2
/tmp/UB1604-64_K4.4.0_Clang3.8.0/x86_64-native-linuxapp-clang/2cd42b5301b443f29da60d354fbf4f09/dpdk/mk/rte.sdkbuild.mk:46: recipe for target 'drivers' failed
make[3]: *** [drivers] Error 2
/tmp/UB1604-64_K4.4.0_Clang3.8.0/x86_64-native-linuxapp-clang/2cd42b5301b443f29da60d354fbf4f09/dpdk/mk/rte.sdkroot.mk:98: recipe for target 'all' failed
make[2]: *** [all] Error 2
/tmp/UB1604-64_K4.4.0_Clang3.8.0/x86_64-native-linuxapp-clang/2cd42b5301b443f29da60d354fbf4f09/dpdk/mk/rte.sdkinstall.mk:60: recipe for target 'pre_install' failed
make[1]: *** [pre_install] Error 2
/tmp/UB1604-64_K4.4.0_Clang3.8.0/x86_64-native-linuxapp-clang/2cd42b5301b443f29da60d354fbf4f09/dpdk/mk/rte.sdkroot.mk:77: recipe for target 'install' failed
make: *** [install] Error 2


*Make Build Failed #2:
OS: UB1604-32
Target: i686-native-linuxapp-gcc
== Build drivers/event/skeleton
== Build drivers/event/dpaa
== Build drivers/event/sw
== Build drivers/event/dpaa2
make[6]: Warning: File '/tmp/UB1604-32_K4.4.0_GCC5.4.0/i686-native-linuxapp-gcc/2cd42b5301b443f29da60d354fbf4f09/dpdk/drivers/event/dpaa2/Makefile' has modification time 16794 s in the future
make[6]: *** No rule to make target 'dpaa2_eventdev_selftest.o', needed by 'librte_pmd_dpaa2_event.a'.  Stop.
make[6]: *** Waiting for unfinished jobs....
  CC dpaa2_eventdev.o
  CC dpaa2_hw_dpcon.o
  CC dpaa_eventdev.o
  CC skeleton_eventdev.o
--
  CC sw_evdev.o.pmd.o
  CC opdl_evdev_xstats.o
  LD dpaa2_eventdev.o
  LD sw_evdev.o
  CC dsw_event.o
/tmp/UB1604-32_K4.4.0_GCC5.4.0/i686-native-linuxapp-gcc/2cd42b5301b443f29da60d354fbf4f09/dpdk/mk/rte.subdir.mk:35: recipe for target 'dpaa2' failed
make[5]: *** [dpaa2] Error 2
make[5]: *** Waiting for unfinished jobs....
make[6]: Warning: File 'sw_evdev_xstats.c' has modification time 10782 s in the future
  CC sw_evdev_worker.o
  CC sw_evdev_scheduler.o
  PMDINFO dpaa_eventdev.o.pmd.c
--
  PMDINFO otx2_evdev.o.pmd.c
  CC otx2_evdev.o.pmd.o
  LD otx2_evdev.o
  AR librte_pmd_octeontx2_event.a
  INSTALL-LIB librte_pmd_octeontx2_event.a
/tmp/UB1604-32_K4.4.0_GCC5.4.0/i686-native-linuxapp-gcc/2cd42b5301b443f29da60d354fbf4f09/dpdk/mk/rte.subdir.mk:35: recipe for target 'event' failed
make[4]: *** [event] Error 2
/tmp/UB1604-32_K4.4.0_GCC5.4.0/i686-native-linuxapp-gcc/2cd42b5301b443f29da60d354fbf4f09/dpdk/mk/rte.sdkbuild.mk:46: recipe for target 'drivers' failed
make[3]: *** [drivers] Error 2
/tmp/UB1604-32_K4.4.0_GCC5.4.0/i686-native-linuxapp-gcc/2cd42b5301b443f29da60d354fbf4f09/dpdk/mk/rte.sdkroot.mk:98: recipe for target 'all' failed
make[2]: *** [all] Error 2
/tmp/UB1604-32_K4.4.0_GCC5.4.0/i686-native-linuxapp-gcc/2cd42b5301b443f29da60d354fbf4f09/dpdk/mk/rte.sdkinstall.mk:60: recipe for target 'pre_install' failed
make[1]: *** [pre_install] Error 2
/tmp/UB1604-32_K4.4.0_GCC5.4.0/i686-native-linuxapp-gcc/2cd42b5301b443f29da60d354fbf4f09/dpdk/mk/rte.sdkroot.mk:77: recipe for target 'install' failed
make: *** [install] Error 2


*Make Build Failed #3:
OS: UB1904-64
Target: x86_64-native-linuxapp-gcc
  LD skeleton_eventdev.o
  PMDINFO dsw_evdev.o.pmd.c
  CC dsw_evdev.o.pmd.o
  LD dsw_evdev.o
  AR librte_pmd_skeleton_event.a
make[6]: *** No rule to make target 'dpaa2_eventdev_selftest.o', needed by 'librte_pmd_dpaa2_event.a'.  Stop.
make[6]: *** Waiting for unfinished jobs....
  CC dpaa2_eventdev.o
  INSTALL-LIB librte_pmd_skeleton_event.a
  CC dsw_event.o
  CC otx2_tim_worker.o
--
make[6]: Warning: File 'sw_evdev_xstats.c' has modification time 11255 s in the future
  PMDINFO dpaa_eventdev.o.pmd.c
  CC dpaa_eventdev.o.pmd.o
  CC sw_evdev_scheduler.o
  LD dpaa_eventdev.o
make[5]: *** [/tmp/UB1904-64_K4.18.0_GCC8.3.0/x86_64-native-linuxapp-gcc/2cd42b5301b443f29da60d354fbf4f09/dpdk/mk/rte.subdir.mk:35: dpaa2] Error 2
make[5]: *** Waiting for unfinished jobs....
  CC sw_evdev_xstats.o
  CC sw_evdev_selftest.o
  AR librte_pmd_dpaa_event.a
  INSTALL-LIB librte_pmd_dpaa_event.a
--
  PMDINFO otx2_evdev.o.pmd.c
  CC otx2_evdev.o.pmd.o
  LD otx2_evdev.o
  AR librte_pmd_octeontx2_event.a
  INSTALL-LIB librte_pmd_octeontx2_event.a
make[4]: *** [/tmp/UB1904-64_K4.18.0_GCC8.3.0/x86_64-native-linuxapp-gcc/2cd42b5301b443f29da60d354fbf4f09/dpdk/mk/rte.subdir.mk:37: event] Error 2
make[3]: *** [/tmp/UB1904-64_K4.18.0_GCC8.3.0/x86_64-native-linuxapp-gcc/2cd42b5301b443f29da60d354fbf4f09/dpdk/mk/rte.sdkbuild.mk:46: drivers] Error 2
make[2]: *** [/tmp/UB1904-64_K4.18.0_GCC8.3.0/x86_64-native-linuxapp-gcc/2cd42b5301b443f29da60d354fbf4f09/dpdk/mk/rte.sdkroot.mk:99: all] Error 2
make[1]: *** [/tmp/UB1904-64_K4.18.0_GCC8.3.0/x86_64-native-linuxapp-gcc/2cd42b5301b443f29da60d354fbf4f09/dpdk/mk/rte.sdkinstall.mk:61: pre_install] Error 2
make: *** [/tmp/UB1904-64_K4.18.0_GCC8.3.0/x86_64-native-linuxapp-gcc/2cd42b5301b443f29da60d354fbf4f09/dpdk/mk/rte.sdkroot.mk:77: install] Error 2


*Make Build Failed #4:
OS: UB1804-64
Target: x86_64-native-linuxapp-icc
  CC skeleton_eventdev.o.pmd.o
  PMDINFO opdl_evdev.o.pmd.c
  CC opdl_evdev.o.pmd.o
  LD dpaa2_hw_dpcon.o
  CC ssovf_evdev.o
make[6]: *** No rule to make target 'dpaa2_eventdev_selftest.o', needed by 'librte_pmd_dpaa2_event.a'.  Stop.
make[6]: *** Waiting for unfinished jobs....
  CC dpaa2_eventdev.o
  LD dpaa_eventdev.o
  CC opdl_evdev_xstats.o
  AR librte_pmd_dpaa_event.a
--
  PMDINFO dpaa2_eventdev.o.pmd.c
  CC dpaa2_eventdev.o.pmd.o
  CC otx2_worker.o
  LD dpaa2_eventdev.o
  CC sw_evdev_xstats.o
/tmp/UB1804-64_K4.15.0_ICC19.0.0/x86_64-native-linuxapp-icc/2cd42b5301b443f29da60d354fbf4f09/dpdk/mk/rte.subdir.mk:35: recipe for target 'dpaa2' failed
make[5]: *** [dpaa2] Error 2
make[5]: *** Waiting for unfinished jobs....
  CC sw_evdev_selftest.o
  CC dsw_xstats.o
  CC otx2_tim_worker.o
  PMDINFO timvf_probe.o.pmd.c
--
  AR librte_pmd_octeontx_ssovf.a
  INSTALL-LIB librte_pmd_octeontx_ssovf.a
make[6]: warning:  Clock skew detected.  Your build may be incomplete.
  AR librte_pmd_octeontx2_event.a
  INSTALL-LIB librte_pmd_octeontx2_event.a
/tmp/UB1804-64_K4.15.0_ICC19.0.0/x86_64-native-linuxapp-icc/2cd42b5301b443f29da60d354fbf4f09/dpdk/mk/rte.subdir.mk:35: recipe for target 'event' failed
make[4]: *** [event] Error 2
/tmp/UB1804-64_K4.15.0_ICC19.0.0/x86_64-native-linuxapp-icc/2cd42b5301b443f29da60d354fbf4f09/dpdk/mk/rte.sdkbuild.mk:46: recipe for target 'drivers' failed
make[3]: *** [drivers] Error 2
/tmp/UB1804-64_K4.15.0_ICC19.0.0/x86_64-native-linuxapp-icc/2cd42b5301b443f29da60d354fbf4f09/dpdk/mk/rte.sdkroot.mk:98: recipe for target 'all' failed
make[2]: *** [all] Error 2
/tmp/UB1804-64_K4.15.0_ICC19.0.0/x86_64-native-linuxapp-icc/2cd42b5301b443f29da60d354fbf4f09/dpdk/mk/rte.sdkinstall.mk:60: recipe for target 'pre_install' failed
make[1]: *** [pre_install] Error 2
/tmp/UB1804-64_K4.15.0_ICC19.0.0/x86_64-native-linuxapp-icc/2cd42b5301b443f29da60d354fbf4f09/dpdk/mk/rte.sdkroot.mk:77: recipe for target 'install' failed
make: *** [install] Error 2


*Make Build Failed #5:
OS: UB1804-64
Target: x86_64-native-linuxapp-clang
  CC dsw_event.o
  LD dpaa_eventdev.o
  LD dpaa2_hw_dpcon.o
  PMDINFO sw_evdev.o.pmd.c
  CC sw_evdev.o.pmd.o
make[6]: *** No rule to make target 'dpaa2_eventdev_selftest.o', needed by 'librte_pmd_dpaa2_event.a'.  Stop.
make[6]: *** Waiting for unfinished jobs....
  CC dpaa2_eventdev.o
  AR librte_pmd_dpaa_event.a
  LD sw_evdev.o
  INSTALL-LIB librte_pmd_dpaa_event.a
--
  LD ssovf_evdev.o
  CC dpaa2_eventdev.o.pmd.o
  CC opdl_evdev_xstats.o
  LD dpaa2_eventdev.o
  CC ssovf_evdev_selftest.o
/tmp/UB1804-64_K4.15.0_Clang6.0.0/x86_64-native-linuxapp-clang/2cd42b5301b443f29da60d354fbf4f09/dpdk/mk/rte.subdir.mk:35: recipe for target 'dpaa2' failed
make[5]: *** [dpaa2] Error 2
make[5]: *** Waiting for unfinished jobs....
  CC sw_evdev_selftest.o
  CC ssovf_probe.o
  CC opdl_test.o
  AR librte_pmd_dsw_event.a
--
  AR librte_pmd_sw_event.a
  INSTALL-LIB librte_pmd_sw_event.a
make[6]: warning:  Clock skew detected.  Your build may be incomplete.
  AR librte_pmd_octeontx2_event.a
  INSTALL-LIB librte_pmd_octeontx2_event.a
/tmp/UB1804-64_K4.15.0_Clang6.0.0/x86_64-native-linuxapp-clang/2cd42b5301b443f29da60d354fbf4f09/dpdk/mk/rte.subdir.mk:35: recipe for target 'event' failed
make[4]: *** [event] Error 2
/tmp/UB1804-64_K4.15.0_Clang6.0.0/x86_64-native-linuxapp-clang/2cd42b5301b443f29da60d354fbf4f09/dpdk/mk/rte.sdkbuild.mk:46: recipe for target 'drivers' failed
make[3]: *** [drivers] Error 2
/tmp/UB1804-64_K4.15.0_Clang6.0.0/x86_64-native-linuxapp-clang/2cd42b5301b443f29da60d354fbf4f09/dpdk/mk/rte.sdkroot.mk:98: recipe for target 'all' failed
make[2]: *** [all] Error 2
/tmp/UB1804-64_K4.15.0_Clang6.0.0/x86_64-native-linuxapp-clang/2cd42b5301b443f29da60d354fbf4f09/dpdk/mk/rte.sdkinstall.mk:60: recipe for target 'pre_install' failed
make[1]: *** [pre_install] Error 2
/tmp/UB1804-64_K4.15.0_Clang6.0.0/x86_64-native-linuxapp-clang/2cd42b5301b443f29da60d354fbf4f09/dpdk/mk/rte.sdkroot.mk:77: recipe for target 'install' failed
make: *** [install] Error 2


*Make Build Failed #6:
OS: FC30-64
Target: x86_64-native-linuxapp-gcc
  PMDINFO dpaa2_hw_dpcon.o.pmd.c
  CC dpaa2_hw_dpcon.o.pmd.o
  LD dpaa2_hw_dpcon.o
  PMDINFO sw_evdev.o.pmd.c
  CC sw_evdev.o.pmd.o
make[6]: *** No rule to make target 'dpaa2_eventdev_selftest.o', needed by 'librte_pmd_dpaa2_event.a'.  Stop.
make[6]: *** Waiting for unfinished jobs....
  CC dpaa2_eventdev.o
  LD sw_evdev.o
  PMDINFO dpaa_eventdev.o.pmd.c
  PMDINFO ssovf_evdev.o.pmd.c
--
  INSTALL-LIB librte_pmd_dsw_event.a
  CC otx2_evdev.o
  PMDINFO dpaa2_eventdev.o.pmd.c
  CC dpaa2_eventdev.o.pmd.o
  LD dpaa2_eventdev.o
make[5]: *** [/tmp/FC30-64_K4.20_GCC9.1.1/x86_64-native-linuxapp-gcc/2cd42b5301b443f29da60d354fbf4f09/dpdk/mk/rte.subdir.mk:35: dpaa2] Error 2
make[5]: *** Waiting for unfinished jobs....
  CC timvf_probe.o
  CC otx2_evdev_adptr.o
  PMDINFO timvf_probe.o.pmd.c
  CC otx2_tim_evdev.o
--
  LD otx2_evdev.o
  AR librte_pmd_sw_event.a
  INSTALL-LIB librte_pmd_sw_event.a
  AR librte_pmd_octeontx2_event.a
  INSTALL-LIB librte_pmd_octeontx2_event.a
make[4]: *** [/tmp/FC30-64_K4.20_GCC9.1.1/x86_64-native-linuxapp-gcc/2cd42b5301b443f29da60d354fbf4f09/dpdk/mk/rte.subdir.mk:37: event] Error 2
make[3]: *** [/tmp/FC30-64_K4.20_GCC9.1.1/x86_64-native-linuxapp-gcc/2cd42b5301b443f29da60d354fbf4f09/dpdk/mk/rte.sdkbuild.mk:46: drivers] Error 2
make[2]: *** [/tmp/FC30-64_K4.20_GCC9.1.1/x86_64-native-linuxapp-gcc/2cd42b5301b443f29da60d354fbf4f09/dpdk/mk/rte.sdkroot.mk:99: all] Error 2
make[1]: *** [/tmp/FC30-64_K4.20_GCC9.1.1/x86_64-native-linuxapp-gcc/2cd42b5301b443f29da60d354fbf4f09/dpdk/mk/rte.sdkinstall.mk:61: pre_install] Error 2
make: *** [/tmp/FC30-64_K4.20_GCC9.1.1/x86_64-native-linuxapp-gcc/2cd42b5301b443f29da60d354fbf4f09/dpdk/mk/rte.sdkroot.mk:77: install] Error 2


*Make Build Failed #7:
OS: SUSE15-64
Target: x86_64-native-linuxapp-gcc
== Build drivers/event/octeontx
== Build drivers/event/octeontx2
== Build drivers/event/dpaa
== Build drivers/event/dpaa2
== Build drivers/event/opdl
make[6]: *** No rule to make target 'dpaa2_eventdev_selftest.o', needed by 'librte_pmd_dpaa2_event.a'.  Stop.
make[6]: *** Waiting for unfinished jobs....
  CC dpaa2_hw_dpcon.o
  CC dpaa2_eventdev.o
  CC skeleton_eventdev.o
  CC otx2_worker_dual.o
--
  LD dpaa2_eventdev.o
  PMDINFO dpaa_eventdev.o.pmd.c
  CC dpaa_eventdev.o.pmd.o
  LD dpaa_eventdev.o
  CC dsw_xstats.o
make[5]: *** [/tmp/SUSE15-64_K4.12.14_GCC7.3.1/x86_64-native-linuxapp-gcc/2cd42b5301b443f29da60d354fbf4f09/dpdk/mk/rte.subdir.mk:35: dpaa2] Error 2
make[5]: *** Waiting for unfinished jobs....
  CC ssovf_evdev.o
  CC sw_evdev_selftest.o
  AR librte_pmd_dpaa_event.a
  INSTALL-LIB librte_pmd_dpaa_event.a
--
  PMDINFO otx2_evdev.o.pmd.c
  CC otx2_evdev.o.pmd.o
  LD otx2_evdev.o
  AR librte_pmd_octeontx2_event.a
  INSTALL-LIB librte_pmd_octeontx2_event.a
make[4]: *** [/tmp/SUSE15-64_K4.12.14_GCC7.3.1/x86_64-native-linuxapp-gcc/2cd42b5301b443f29da60d354fbf4f09/dpdk/mk/rte.subdir.mk:37: event] Error 2
make[3]: *** [/tmp/SUSE15-64_K4.12.14_GCC7.3.1/x86_64-native-linuxapp-gcc/2cd42b5301b443f29da60d354fbf4f09/dpdk/mk/rte.sdkbuild.mk:46: drivers] Error 2
make[2]: *** [/tmp/SUSE15-64_K4.12.14_GCC7.3.1/x86_64-native-linuxapp-gcc/2cd42b5301b443f29da60d354fbf4f09/dpdk/mk/rte.sdkroot.mk:99: all] Error 2
make[1]: *** [/tmp/SUSE15-64_K4.12.14_GCC7.3.1/x86_64-native-linuxapp-gcc/2cd42b5301b443f29da60d354fbf4f09/dpdk/mk/rte.sdkinstall.mk:61: pre_install] Error 2
make: *** [/tmp/SUSE15-64_K4.12.14_GCC7.3.1/x86_64-native-linuxapp-gcc/2cd42b5301b443f29da60d354fbf4f09/dpdk/mk/rte.sdkroot.mk:77: install] Error 2


*Make Build Failed #8:
OS: RHEL76-64
Target: x86_64-native-linuxapp-gcc
  LD skeleton_eventdev.o
  LD ssovf_evdev.o
  PMDINFO dpaa2_hw_dpcon.o.pmd.c
  AR librte_pmd_skeleton_event.a
  INSTALL-LIB librte_pmd_skeleton_event.a
make[6]: *** No rule to make target `dpaa2_eventdev_selftest.o', needed by `librte_pmd_dpaa2_event.a'.  Stop.
make[6]: *** Waiting for unfinished jobs....
  CC dpaa2_eventdev.o
  CC dpaa2_hw_dpcon.o.pmd.o
  LD dpaa2_hw_dpcon.o
  CC otx2_worker.o
--
  PMDINFO ssovf_probe.o.pmd.c
  CC ssovf_probe.o.pmd.o
  INSTALL-LIB librte_pmd_dsw_event.a
  LD ssovf_probe.o
  CC timvf_evdev.o
make[5]: *** [dpaa2] Error 2
make[5]: *** Waiting for unfinished jobs....
  PMDINFO dpaa_eventdev.o.pmd.c
  CC timvf_probe.o
  CC dpaa_eventdev.o.pmd.o
  CC otx2_tim_worker.o
--
  LD otx2_evdev.o
  AR librte_pmd_sw_event.a
  INSTALL-LIB librte_pmd_sw_event.a
  AR librte_pmd_octeontx2_event.a
  INSTALL-LIB librte_pmd_octeontx2_event.a
make[4]: *** [event] Error 2
make[3]: *** [drivers] Error 2
make[2]: *** [all] Error 2
make[1]: *** [pre_install] Error 2
make: *** [install] Error 2


*Make Build Failed #9:
OS: FC30-64
Target: x86_64-native-linuxapp-clang
  PMDINFO ssovf_probe.o.pmd.c
  CC timvf_worker.o
  CC ssovf_probe.o.pmd.o
  CC sw_evdev_xstats.o
  LD ssovf_probe.o
make[6]: *** No rule to make target 'dpaa2_eventdev_selftest.o', needed by 'librte_pmd_dpaa2_event.a'.  Stop.
make[6]: *** Waiting for unfinished jobs....
  CC opdl_test.o
  CC dpaa2_eventdev.o
  CC timvf_evdev.o
  CC otx2_evdev.o
--
  CC otx2_tim_evdev.o
  PMDINFO dpaa2_eventdev.o.pmd.c
  CC dpaa2_eventdev.o.pmd.o
  CC otx2_evdev_selftest.o
  LD dpaa2_eventdev.o
make[5]: *** [/tmp/FC30-64_K4.20_Clang8.0.0/x86_64-native-linuxapp-clang/2cd42b5301b443f29da60d354fbf4f09/dpdk/mk/rte.subdir.mk:35: dpaa2] Error 2
make[5]: *** Waiting for unfinished jobs....
  CC otx2_evdev_irq.o
  PMDINFO timvf_probe.o.pmd.c
  CC timvf_probe.o.pmd.o
  LD timvf_probe.o
--
  LD otx2_evdev.o
  AR librte_pmd_sw_event.a
  INSTALL-LIB librte_pmd_sw_event.a
  AR librte_pmd_octeontx2_event.a
  INSTALL-LIB librte_pmd_octeontx2_event.a
make[4]: *** [/tmp/FC30-64_K4.20_Clang8.0.0/x86_64-native-linuxapp-clang/2cd42b5301b443f29da60d354fbf4f09/dpdk/mk/rte.subdir.mk:37: event] Error 2
make[3]: *** [/tmp/FC30-64_K4.20_Clang8.0.0/x86_64-native-linuxapp-clang/2cd42b5301b443f29da60d354fbf4f09/dpdk/mk/rte.sdkbuild.mk:46: drivers] Error 2
make[2]: *** [/tmp/FC30-64_K4.20_Clang8.0.0/x86_64-native-linuxapp-clang/2cd42b5301b443f29da60d354fbf4f09/dpdk/mk/rte.sdkroot.mk:99: all] Error 2
make[1]: *** [/tmp/FC30-64_K4.20_Clang8.0.0/x86_64-native-linuxapp-clang/2cd42b5301b443f29da60d354fbf4f09/dpdk/mk/rte.sdkinstall.mk:61: pre_install] Error 2
make: *** [/tmp/FC30-64_K4.20_Clang8.0.0/x86_64-native-linuxapp-clang/2cd42b5301b443f29da60d354fbf4f09/dpdk/mk/rte.sdkroot.mk:77: install] Error 2


*Make Build Failed #10:
OS: RHEL80-64
Target: x86_64-native-linuxapp-gcc
  CC dsw_event.o
  LD dpaa2_hw_dpcon.o
  PMDINFO sw_evdev.o.pmd.c
  CC sw_evdev.o.pmd.o
  LD sw_evdev.o
make[6]: *** No rule to make target 'dpaa2_eventdev_selftest.o', needed by 'librte_pmd_dpaa2_event.a'.  Stop.
make[6]: *** Waiting for unfinished jobs....
  CC dpaa2_eventdev.o
  CC opdl_evdev.o
  CC dsw_xstats.o
  PMDINFO dpaa_eventdev.o.pmd.c
--
  LD dpaa2_eventdev.o
  CC opdl_test.o
  PMDINFO ssovf_evdev.o.pmd.c
  CC ssovf_evdev.o.pmd.o
  LD ssovf_evdev.o
make[5]: *** [/tmp/RHEL80-64_K3.10.0_GCC8.2.1/x86_64-native-linuxapp-gcc/2cd42b5301b443f29da60d354fbf4f09/dpdk/mk/rte.subdir.mk:35: dpaa2] Error 2
make[5]: *** Waiting for unfinished jobs....
  AR librte_pmd_dsw_event.a
  CC otx2_worker.o
  CC ssovf_probe.o
  CC timvf_worker.o
--
  PMDINFO otx2_evdev.o.pmd.c
  CC otx2_evdev.o.pmd.o
  LD otx2_evdev.o
  AR librte_pmd_octeontx2_event.a
  INSTALL-LIB librte_pmd_octeontx2_event.a
make[4]: *** [/tmp/RHEL80-64_K3.10.0_GCC8.2.1/x86_64-native-linuxapp-gcc/2cd42b5301b443f29da60d354fbf4f09/dpdk/mk/rte.subdir.mk:37: event] Error 2
make[3]: *** [/tmp/RHEL80-64_K3.10.0_GCC8.2.1/x86_64-native-linuxapp-gcc/2cd42b5301b443f29da60d354fbf4f09/dpdk/mk/rte.sdkbuild.mk:46: drivers] Error 2
make[2]: *** [/tmp/RHEL80-64_K3.10.0_GCC8.2.1/x86_64-native-linuxapp-gcc/2cd42b5301b443f29da60d354fbf4f09/dpdk/mk/rte.sdkroot.mk:99: all] Error 2
make[1]: *** [/tmp/RHEL80-64_K3.10.0_GCC8.2.1/x86_64-native-linuxapp-gcc/2cd42b5301b443f29da60d354fbf4f09/dpdk/mk/rte.sdkinstall.mk:61: pre_install] Error 2
make: *** [/tmp/RHEL80-64_K3.10.0_GCC8.2.1/x86_64-native-linuxapp-gcc/2cd42b5301b443f29da60d354fbf4f09/dpdk/mk/rte.sdkroot.mk:77: install] Error 2


*Make Build Failed #11:
OS: SUSE15-64
Target: x86_64-native-linuxapp-clang
  CC otx2_evdev.o
  LD dpaa2_hw_dpcon.o
  CC sw_evdev_xstats.o
  LD dpaa_eventdev.o
  LD ssovf_evdev.o
make[6]: *** No rule to make target 'dpaa2_eventdev_selftest.o', needed by 'librte_pmd_dpaa2_event.a'.  Stop.
make[6]: *** Waiting for unfinished jobs....
  CC dpaa2_eventdev.o
  AR librte_pmd_dpaa_event.a
  CC ssovf_evdev_selftest.o
  INSTALL-LIB librte_pmd_dpaa_event.a
--
  INSTALL-LIB librte_pmd_dsw_event.a
  LD dpaa2_eventdev.o
  CC ssovf_probe.o
  CC timvf_worker.o
  LD opdl_evdev.o
make[5]: *** [/tmp/SUSE15-64_K4.12.14_Clang5.0.1/x86_64-native-linuxapp-clang/2cd42b5301b443f29da60d354fbf4f09/dpdk/mk/rte.subdir.mk:35: dpaa2] Error 2
make[5]: *** Waiting for unfinished jobs....
  CC timvf_evdev.o
  CC opdl_evdev_init.o
  CC timvf_probe.o
  PMDINFO otx2_evdev.o.pmd.c
--
  INSTALL-LIB librte_pmd_sw_event.a
  AR librte_pmd_opdl_event.a
  INSTALL-LIB librte_pmd_opdl_event.a
  AR librte_pmd_octeontx2_event.a
  INSTALL-LIB librte_pmd_octeontx2_event.a
make[4]: *** [/tmp/SUSE15-64_K4.12.14_Clang5.0.1/x86_64-native-linuxapp-clang/2cd42b5301b443f29da60d354fbf4f09/dpdk/mk/rte.subdir.mk:37: event] Error 2
make[3]: *** [/tmp/SUSE15-64_K4.12.14_Clang5.0.1/x86_64-native-linuxapp-clang/2cd42b5301b443f29da60d354fbf4f09/dpdk/mk/rte.sdkbuild.mk:46: drivers] Error 2
make[2]: *** [/tmp/SUSE15-64_K4.12.14_Clang5.0.1/x86_64-native-linuxapp-clang/2cd42b5301b443f29da60d354fbf4f09/dpdk/mk/rte.sdkroot.mk:99: all] Error 2
make[1]: *** [/tmp/SUSE15-64_K4.12.14_Clang5.0.1/x86_64-native-linuxapp-clang/2cd42b5301b443f29da60d354fbf4f09/dpdk/mk/rte.sdkinstall.mk:61: pre_install] Error 2
make: *** [/tmp/SUSE15-64_K4.12.14_Clang5.0.1/x86_64-native-linuxapp-clang/2cd42b5301b443f29da60d354fbf4f09/dpdk/mk/rte.sdkroot.mk:77: install] Error 2


*Make Build Failed #12:
OS: UB1604-64
Target: x86_64-native-linuxapp-gcc
  LD dsw_evdev.o
  PMDINFO dpaa2_hw_dpcon.o.pmd.c
  CC dpaa2_hw_dpcon.o.pmd.o
  CC sw_evdev_worker.o
  LD dpaa2_hw_dpcon.o
make[6]: *** No rule to make target 'dpaa2_eventdev_selftest.o', needed by 'librte_pmd_dpaa2_event.a'.  Stop.
make[6]: *** Waiting for unfinished jobs....
  CC dpaa2_eventdev.o
  PMDINFO opdl_evdev.o.pmd.c
  CC opdl_evdev.o.pmd.o
  LD opdl_evdev.o
--
  PMDINFO dpaa2_eventdev.o.pmd.c
  CC dpaa2_eventdev.o.pmd.o
  LD dpaa2_eventdev.o
  PMDINFO ssovf_evdev.o.pmd.c
  CC ssovf_evdev.o.pmd.o
/tmp/UB1604-64_K4.4.0_GCC5.4.0/x86_64-native-linuxapp-gcc/2cd42b5301b443f29da60d354fbf4f09/dpdk/mk/rte.subdir.mk:35: recipe for target 'dpaa2' failed
make[5]: *** [dpaa2] Error 2
make[5]: *** Waiting for unfinished jobs....
  CC otx2_tim_worker.o
  AR librte_pmd_dsw_event.a
  INSTALL-LIB librte_pmd_dsw_event.a
  LD ssovf_evdev.o
--
  PMDINFO otx2_evdev.o.pmd.c
  CC otx2_evdev.o.pmd.o
  LD otx2_evdev.o
  AR librte_pmd_octeontx2_event.a
  INSTALL-LIB librte_pmd_octeontx2_event.a
/tmp/UB1604-64_K4.4.0_GCC5.4.0/x86_64-native-linuxapp-gcc/2cd42b5301b443f29da60d354fbf4f09/dpdk/mk/rte.subdir.mk:35: recipe for target 'event' failed
make[4]: *** [event] Error 2
/tmp/UB1604-64_K4.4.0_GCC5.4.0/x86_64-native-linuxapp-gcc/2cd42b5301b443f29da60d354fbf4f09/dpdk/mk/rte.sdkbuild.mk:46: recipe for target 'drivers' failed
make[3]: *** [drivers] Error 2
/tmp/UB1604-64_K4.4.0_GCC5.4.0/x86_64-native-linuxapp-gcc/2cd42b5301b443f29da60d354fbf4f09/dpdk/mk/rte.sdkroot.mk:98: recipe for target 'all' failed
make[2]: *** [all] Error 2
/tmp/UB1604-64_K4.4.0_GCC5.4.0/x86_64-native-linuxapp-gcc/2cd42b5301b443f29da60d354fbf4f09/dpdk/mk/rte.sdkinstall.mk:60: recipe for target 'pre_install' failed
make[1]: *** [pre_install] Error 2
/tmp/UB1604-64_K4.4.0_GCC5.4.0/x86_64-native-linuxapp-gcc/2cd42b5301b443f29da60d354fbf4f09/dpdk/mk/rte.sdkroot.mk:77: recipe for target 'install' failed
make: *** [install] Error 2


*Make Build Failed #13:
OS: UB1804-64
Target: x86_64-native-linuxapp-gcc
  LD dsw_evdev.o
  CC ssovf_probe.o
  PMDINFO dpaa2_hw_dpcon.o.pmd.c
  CC dpaa2_hw_dpcon.o.pmd.o
  LD dpaa2_hw_dpcon.o
make[6]: *** No rule to make target 'dpaa2_eventdev_selftest.o', needed by 'librte_pmd_dpaa2_event.a'.  Stop.
make[6]: *** Waiting for unfinished jobs....
  CC dpaa2_eventdev.o
  PMDINFO sw_evdev.o.pmd.c
  CC sw_evdev.o.pmd.o
  LD sw_evdev.o
--
  CC opdl_evdev.o
  CC opdl_evdev_init.o
  PMDINFO dpaa2_eventdev.o.pmd.c
  CC dpaa2_eventdev.o.pmd.o
  LD dpaa2_eventdev.o
/tmp/UB1804-64_K4.15.0_GCC7.3.0/x86_64-native-linuxapp-gcc/2cd42b5301b443f29da60d354fbf4f09/dpdk/mk/rte.subdir.mk:35: recipe for target 'dpaa2' failed
make[5]: *** [dpaa2] Error 2
make[5]: *** Waiting for unfinished jobs....
  CC opdl_evdev_xstats.o
  PMDINFO opdl_evdev.o.pmd.c
  CC opdl_evdev.o.pmd.o
  CC opdl_test.o
--
  PMDINFO otx2_evdev.o.pmd.c
  CC otx2_evdev.o.pmd.o
  LD otx2_evdev.o
  AR librte_pmd_octeontx2_event.a
  INSTALL-LIB librte_pmd_octeontx2_event.a
/tmp/UB1804-64_K4.15.0_GCC7.3.0/x86_64-native-linuxapp-gcc/2cd42b5301b443f29da60d354fbf4f09/dpdk/mk/rte.subdir.mk:35: recipe for target 'event' failed
make[4]: *** [event] Error 2
/tmp/UB1804-64_K4.15.0_GCC7.3.0/x86_64-native-linuxapp-gcc/2cd42b5301b443f29da60d354fbf4f09/dpdk/mk/rte.sdkbuild.mk:46: recipe for target 'drivers' failed
make[3]: *** [drivers] Error 2
/tmp/UB1804-64_K4.15.0_GCC7.3.0/x86_64-native-linuxapp-gcc/2cd42b5301b443f29da60d354fbf4f09/dpdk/mk/rte.sdkroot.mk:98: recipe for target 'all' failed
make[2]: *** [all] Error 2
/tmp/UB1804-64_K4.15.0_GCC7.3.0/x86_64-native-linuxapp-gcc/2cd42b5301b443f29da60d354fbf4f09/dpdk/mk/rte.sdkinstall.mk:60: recipe for target 'pre_install' failed
make[1]: *** [pre_install] Error 2
/tmp/UB1804-64_K4.15.0_GCC7.3.0/x86_64-native-linuxapp-gcc/2cd42b5301b443f29da60d354fbf4f09/dpdk/mk/rte.sdkroot.mk:77: recipe for target 'install' failed
make: *** [install] Error 2


*Make Build Failed #14:
OS: CENTOS76-64
Target: x86_64-native-linuxapp-gcc+debug
  AR librte_pmd_skeleton_event.a
  PMDINFO dpaa_eventdev.o.pmd.c
  CC dpaa_eventdev.o.pmd.o
  INSTALL-LIB librte_pmd_skeleton_event.a
  LD dpaa_eventdev.o
make[6]: *** No rule to make target `dpaa2_eventdev_selftest.o', needed by `librte_pmd_dpaa2_event.a'.  Stop.
make[6]: *** Waiting for unfinished jobs....
  CC dpaa2_eventdev.o
  LD dsw_evdev.o
  CC sw_evdev_scheduler.o
  PMDINFO sw_evdev.o.pmd.c
--
  CC otx2_evdev.o
  CC dpaa2_eventdev.o.pmd.o
  LD dpaa2_eventdev.o
  CC opdl_evdev.o
  CC ssovf_evdev.o
make[5]: *** [dpaa2] Error 2
make[5]: *** Waiting for unfinished jobs....
  CC opdl_evdev_init.o
  PMDINFO opdl_evdev.o.pmd.c
  CC opdl_evdev.o.pmd.o
  PMDINFO ssovf_evdev.o.pmd.c
--
  INSTALL-LIB librte_pmd_octeontx_ssovf.a
  AR librte_pmd_sw_event.a
  INSTALL-LIB librte_pmd_sw_event.a
  AR librte_pmd_octeontx2_event.a
  INSTALL-LIB librte_pmd_octeontx2_event.a
make[4]: *** [event] Error 2
make[3]: *** [drivers] Error 2
make[2]: *** [all] Error 2
make[1]: *** [pre_install] Error 2
make: *** [install] Error 2


*Make Build Failed #15:
OS: CENTOS76-64
Target: x86_64-native-linuxapp-gcc
  CC dsw_evdev.o.pmd.o
  LD skeleton_eventdev.o
  LD dsw_evdev.o
  LD dpaa2_hw_dpcon.o
  CC opdl_ring.o
make[6]: *** No rule to make target `dpaa2_eventdev_selftest.o', needed by `librte_pmd_dpaa2_event.a'.  Stop.
make[6]: *** Waiting for unfinished jobs....
  CC dpaa2_eventdev.o
  CC dsw_xstats.o
  PMDINFO dpaa_eventdev.o.pmd.c
  CC dpaa_eventdev.o.pmd.o
--
  CC otx2_tim_evdev.o
  CC sw_evdev_worker.o
  CC sw_evdev_scheduler.o
  CC otx2_evdev_selftest.o
  CC otx2_evdev_irq.o
make[5]: *** [dpaa2] Error 2
make[5]: *** Waiting for unfinished jobs....
  CC opdl_evdev.o
  CC opdl_evdev_init.o
  CC ssovf_evdev_selftest.o
  CC ssovf_probe.o
--
  INSTALL-LIB librte_pmd_opdl_event.a
  AR librte_pmd_sw_event.a
  INSTALL-LIB librte_pmd_sw_event.a
  AR librte_pmd_octeontx2_event.a
  INSTALL-LIB librte_pmd_octeontx2_event.a
make[4]: *** [event] Error 2
make[3]: *** [drivers] Error 2
make[2]: *** [all] Error 2
make[1]: *** [pre_install] Error 2
make: *** [install] Error 2


*Make Build Failed #16:
OS: CENTOS76-64
Target: x86_64-native-linuxapp-clang
  CC otx2_evdev.o
  LD dpaa2_hw_dpcon.o
  CC dpaa_eventdev.o.pmd.o
  LD dpaa_eventdev.o
  CC sw_evdev_worker.o
make[6]: *** No rule to make target `dpaa2_eventdev_selftest.o', needed by `librte_pmd_dpaa2_event.a'.  Stop.
make[6]: *** Waiting for unfinished jobs....
  CC dpaa2_eventdev.o
  AR librte_pmd_dpaa_event.a
  INSTALL-LIB librte_pmd_dpaa_event.a
  PMDINFO ssovf_evdev.o.pmd.c
--
  CC otx2_tim_evdev.o
  LD dpaa2_eventdev.o
  AR librte_pmd_dsw_event.a
  INSTALL-LIB librte_pmd_dsw_event.a
  CC sw_evdev_selftest.o
make[5]: *** [dpaa2] Error 2
make[5]: *** Waiting for unfinished jobs....
  CC opdl_evdev.o
  CC otx2_evdev_selftest.o
  CC otx2_evdev_irq.o
  CC ssovf_probe.o
--
  INSTALL-LIB librte_pmd_octeontx_ssovf.a
  AR librte_pmd_opdl_event.a
  INSTALL-LIB librte_pmd_opdl_event.a
  AR librte_pmd_octeontx2_event.a
  INSTALL-LIB librte_pmd_octeontx2_event.a
make[4]: *** [event] Error 2
make[3]: *** [drivers] Error 2
make[2]: *** [all] Error 2
make[1]: *** [pre_install] Error 2
make: *** [install] Error 2


*Make Build Failed #17:
OS: CENTOS76-64
Target: x86_64-native-linuxapp-gcc+shared
  CC dsw_evdev.o.pmd.o
  CC opdl_ring.o
  LD dsw_evdev.o
  INSTALL-LIB librte_pmd_skeleton_event.so.1.1
  CC opdl_evdev.o
make[6]: *** No rule to make target `dpaa2_eventdev_selftest.o', needed by `librte_pmd_dpaa2_event.so.2.1'.  Stop.
make[6]: *** Waiting for unfinished jobs....
  CC dpaa2_eventdev.o
  CC sw_evdev_worker.o
  CC ssovf_evdev.o
  PMDINFO dpaa_eventdev.o.pmd.c
--
  LD ssovf_probe.o
  CC sw_evdev_selftest.o
  CC opdl_evdev_xstats.o
  CC timvf_probe.o
  CC otx2_worker.o
make[5]: *** [dpaa2] Error 2
make[5]: *** Waiting for unfinished jobs....
  CC otx2_tim_worker.o
  PMDINFO timvf_probe.o.pmd.c
  CC timvf_probe.o.pmd.o
  CC otx2_evdev.o
--
  LD otx2_evdev.o
  LD librte_pmd_sw_event.so.1.1
  INSTALL-LIB librte_pmd_sw_event.so.1.1
  LD librte_pmd_octeontx2_event.so.1.1
  INSTALL-LIB librte_pmd_octeontx2_event.so.1.1
make[4]: *** [event] Error 2
make[3]: *** [drivers] Error 2
make[2]: *** [all] Error 2
make[1]: *** [pre_install] Error 2
make: *** [install] Error 2


*Make Build Failed #18:
OS: CENTOS76-64
Target: x86_64-native-linuxapp-icc
  LD skeleton_eventdev.o
  PMDINFO sw_evdev.o.pmd.c
  CC sw_evdev.o.pmd.o
  PMDINFO dsw_evdev.o.pmd.c
  CC dsw_evdev.o.pmd.o
make[6]: *** No rule to make target `dpaa2_eventdev_selftest.o', needed by `librte_pmd_dpaa2_event.a'.  Stop.
make[6]: *** Waiting for unfinished jobs....
  CC dpaa2_eventdev.o
  AR librte_pmd_skeleton_event.a
  INSTALL-LIB librte_pmd_skeleton_event.a
  CC sw_evdev_scheduler.o
--
  CC opdl_evdev.o
  CC opdl_evdev_init.o
  LD ssovf_probe.o
  LD dpaa2_eventdev.o
  CC timvf_evdev.o
make[5]: *** [dpaa2] Error 2
make[5]: *** Waiting for unfinished jobs....
  CC opdl_evdev_xstats.o
  PMDINFO opdl_evdev.o.pmd.c
  CC opdl_evdev.o.pmd.o
  CC timvf_probe.o
--
  PMDINFO otx2_evdev.o.pmd.c
  CC otx2_evdev.o.pmd.o
  LD otx2_evdev.o
  AR librte_pmd_octeontx2_event.a
  INSTALL-LIB librte_pmd_octeontx2_event.a
make[4]: *** [event] Error 2
make[3]: *** [drivers] Error 2
make[2]: *** [all] Error 2
make[1]: *** [pre_install] Error 2
make: *** [install] Error 2

*Meson Build Failed #1:
OS: FC30-64
Target:build-gcc-static
Dependency libisal found: NO (tried pkgconfig and cmake)
Dependency zlib found: NO (tried pkgconfig and cmake)
WARNING: Newline character in a string detected, use ''' (three single quotes) for multiline strings instead.
This will become a hard error in a future Meson release. 		'dpaa2_eventdev_selftest.c) 13 2

drivers/event/dpaa2/meson.build:13:96: ERROR: Method name must be plain id
		'dpaa2_eventdev_selftest.c)
                                                                                                ^

A full log can be found at /tmp/FC30-64_K4.20_GCC9.1.1/x86_64-native-linuxapp-gcc/2cd42b5301b443f29da60d354fbf4f09/dpdk/build-gcc-static/meson-logs/meson-log.txt
ninja -C build-gcc-static
--
Dependency libisal found: NO (tried pkgconfig and cmake)
Dependency zlib found: NO (tried pkgconfig and cmake)
WARNING: Newline character in a string detected, use ''' (three single quotes) for multiline strings instead.
This will become a hard error in a future Meson release. 		'dpaa2_eventdev_selftest.c) 13 2

drivers/event/dpaa2/meson.build:13:96: ERROR: Method name must be plain id
		'dpaa2_eventdev_selftest.c)
                                                                                                ^

A full log can be found at /tmp/FC30-64_K4.20_GCC9.1.1/x86_64-native-linuxapp-gcc/2cd42b5301b443f29da60d354fbf4f09/dpdk/build-gcc-shared/meson-logs/meson-log.txt
ninja -C build-gcc-shared
--
Dependency libisal found: NO (tried pkgconfig and cmake)
Dependency zlib found: NO (tried pkgconfig and cmake)
WARNING: Newline character in a string detected, use ''' (three single quotes) for multiline strings instead.
This will become a hard error in a future Meson release. 		'dpaa2_eventdev_selftest.c) 13 2

drivers/event/dpaa2/meson.build:13:96: ERROR: Method name must be plain id
		'dpaa2_eventdev_selftest.c)
                                                                                                ^

A full log can be found at /tmp/FC30-64_K4.20_GCC9.1.1/x86_64-native-linuxapp-gcc/2cd42b5301b443f29da60d354fbf4f09/dpdk/build-clang-static/meson-logs/meson-log.txt
ninja -C build-clang-static
--
Dependency libisal found: NO (tried pkgconfig and cmake)
Dependency zlib found: NO (tried pkgconfig and cmake)
WARNING: Newline character in a string detected, use ''' (three single quotes) for multiline strings instead.
This will become a hard error in a future Meson release. 		'dpaa2_eventdev_selftest.c) 13 2

drivers/event/dpaa2/meson.build:13:96: ERROR: Method name must be plain id
		'dpaa2_eventdev_selftest.c)
                                                                                                ^

A full log can be found at /tmp/FC30-64_K4.20_GCC9.1.1/x86_64-native-linuxapp-gcc/2cd42b5301b443f29da60d354fbf4f09/dpdk/build-clang-shared/meson-logs/meson-log.txt
ninja -C build-clang-shared
--
Dependency libisal found: NO (tried pkgconfig and cmake)
Dependency zlib found: NO (tried pkgconfig and cmake)
WARNING: Newline character in a string detected, use ''' (three single quotes) for multiline strings instead.
This will become a hard error in a future Meson release. 		'dpaa2_eventdev_selftest.c) 13 2

drivers/event/dpaa2/meson.build:13:96: ERROR: Method name must be plain id
		'dpaa2_eventdev_selftest.c)
                                                                                                ^

A full log can be found at /tmp/FC30-64_K4.20_GCC9.1.1/x86_64-native-linuxapp-gcc/2cd42b5301b443f29da60d354fbf4f09/dpdk/build-x86-default/meson-logs/meson-log.txt
ninja -C build-x86-default
--
ninja: error: loading 'build.ninja': No such file or directory
find: ‘/tmp/FC30-64_K4.20_GCC9.1.1/x86_64-native-linuxapp-gcc/2cd42b5301b443f29da60d354fbf4f09/dpdk/build-x86-default/install-root’: No such file or directory
dirname: missing operand
Try 'dirname --help' for more information.
## Building cmdline
gmake: *** /tmp/FC30-64_K4.20_GCC9.1.1/x86_64-native-linuxapp-gcc/2cd42b5301b443f29da60d354fbf4f09/dpdk/build-x86-default/install-root/usr/local/share/dpdk/examples/cmdline: No such file or directory.  Stop.
## Building helloworld
gmake: *** /tmp/FC30-64_K4.20_GCC9.1.1/x86_64-native-linuxapp-gcc/2cd42b5301b443f29da60d354fbf4f09/dpdk/build-x86-default/install-root/usr/local/share/dpdk/examples/helloworld: No such file or directory.  Stop.
## Building l2fwd
gmake: *** /tmp/FC30-64_K4.20_GCC9.1.1/x86_64-native-linuxapp-gcc/2cd42b5301b443f29da60d354fbf4f09/dpdk/build-x86-default/install-root/usr/local/share/dpdk/examples/l2fwd: No such file or directory.  Stop.
## Building l3fwd
gmake: *** /tmp/FC30-64_K4.20_GCC9.1.1/x86_64-native-linuxapp-gcc/2cd42b5301b443f29da60d354fbf4f09/dpdk/build-x86-default/install-root/usr/local/share/dpdk/examples/l3fwd: No such file or directory.  Stop.
## Building skeleton
gmake: *** /tmp/FC30-64_K4.20_GCC9.1.1/x86_64-native-linuxapp-gcc/2cd42b5301b443f29da60d354fbf4f09/dpdk/build-x86-default/install-root/usr/local/share/dpdk/examples/skeleton: No such file or directory.  Stop.
## Building timer
gmake: *** /tmp/FC30-64_K4.20_GCC9.1.1/x86_64-native-linuxapp-gcc/2cd42b5301b443f29da60d354fbf4f09/dpdk/build-x86-default/install-root/usr/local/share/dpdk/examples/timer: No such file or directory.  Stop.


*Meson Build Failed #2:
OS: SUSE15-64
Target:build-gcc-static
Dependency libisal found: NO (tried pkgconfig and cmake)
Dependency zlib found: YES (cached)
WARNING: Newline character in a string detected, use ''' (three single quotes) for multiline strings instead.
This will become a hard error in a future Meson release. 		'dpaa2_eventdev_selftest.c) 13 2

drivers/event/dpaa2/meson.build:13:96: ERROR: Method name must be plain id
		'dpaa2_eventdev_selftest.c)
                                                                                                ^

A full log can be found at /tmp/SUSE15-64_K4.12.14_GCC7.3.1/x86_64-native-linuxapp-gcc/2cd42b5301b443f29da60d354fbf4f09/dpdk/build-gcc-static/meson-logs/meson-log.txt
ninja -C build-gcc-static
--
Dependency libisal found: NO (tried pkgconfig and cmake)
Dependency zlib found: YES (cached)
WARNING: Newline character in a string detected, use ''' (three single quotes) for multiline strings instead.
This will become a hard error in a future Meson release. 		'dpaa2_eventdev_selftest.c) 13 2

drivers/event/dpaa2/meson.build:13:96: ERROR: Method name must be plain id
		'dpaa2_eventdev_selftest.c)
                                                                                                ^

A full log can be found at /tmp/SUSE15-64_K4.12.14_GCC7.3.1/x86_64-native-linuxapp-gcc/2cd42b5301b443f29da60d354fbf4f09/dpdk/build-gcc-shared/meson-logs/meson-log.txt
ninja -C build-gcc-shared
--
Dependency libisal found: NO (tried pkgconfig and cmake)
Dependency zlib found: YES (cached)
WARNING: Newline character in a string detected, use ''' (three single quotes) for multiline strings instead.
This will become a hard error in a future Meson release. 		'dpaa2_eventdev_selftest.c) 13 2

drivers/event/dpaa2/meson.build:13:96: ERROR: Method name must be plain id
		'dpaa2_eventdev_selftest.c)
                                                                                                ^

A full log can be found at /tmp/SUSE15-64_K4.12.14_GCC7.3.1/x86_64-native-linuxapp-gcc/2cd42b5301b443f29da60d354fbf4f09/dpdk/build-clang-static/meson-logs/meson-log.txt
ninja -C build-clang-static
--
Dependency libisal found: NO (tried pkgconfig and cmake)
Dependency zlib found: YES (cached)
WARNING: Newline character in a string detected, use ''' (three single quotes) for multiline strings instead.
This will become a hard error in a future Meson release. 		'dpaa2_eventdev_selftest.c) 13 2

drivers/event/dpaa2/meson.build:13:96: ERROR: Method name must be plain id
		'dpaa2_eventdev_selftest.c)
                                                                                                ^

A full log can be found at /tmp/SUSE15-64_K4.12.14_GCC7.3.1/x86_64-native-linuxapp-gcc/2cd42b5301b443f29da60d354fbf4f09/dpdk/build-clang-shared/meson-logs/meson-log.txt
ninja -C build-clang-shared
--
Dependency libisal found: NO (tried pkgconfig and cmake)
Dependency zlib found: YES (cached)
WARNING: Newline character in a string detected, use ''' (three single quotes) for multiline strings instead.
This will become a hard error in a future Meson release. 		'dpaa2_eventdev_selftest.c) 13 2

drivers/event/dpaa2/meson.build:13:96: ERROR: Method name must be plain id
		'dpaa2_eventdev_selftest.c)
                                                                                                ^

A full log can be found at /tmp/SUSE15-64_K4.12.14_GCC7.3.1/x86_64-native-linuxapp-gcc/2cd42b5301b443f29da60d354fbf4f09/dpdk/build-x86-default/meson-logs/meson-log.txt
ninja -C build-x86-default
--
ninja: error: loading 'build.ninja': No such file or directory
find: ‘/tmp/SUSE15-64_K4.12.14_GCC7.3.1/x86_64-native-linuxapp-gcc/2cd42b5301b443f29da60d354fbf4f09/dpdk/build-x86-default/install-root’: No such file or directory
dirname: missing operand
Try 'dirname --help' for more information.
## Building cmdline
gmake: *** /tmp/SUSE15-64_K4.12.14_GCC7.3.1/x86_64-native-linuxapp-gcc/2cd42b5301b443f29da60d354fbf4f09/dpdk/build-x86-default/install-root/usr/local/share/dpdk/examples/cmdline: No such file or directory.  Stop.
## Building helloworld
gmake: *** /tmp/SUSE15-64_K4.12.14_GCC7.3.1/x86_64-native-linuxapp-gcc/2cd42b5301b443f29da60d354fbf4f09/dpdk/build-x86-default/install-root/usr/local/share/dpdk/examples/helloworld: No such file or directory.  Stop.
## Building l2fwd
gmake: *** /tmp/SUSE15-64_K4.12.14_GCC7.3.1/x86_64-native-linuxapp-gcc/2cd42b5301b443f29da60d354fbf4f09/dpdk/build-x86-default/install-root/usr/local/share/dpdk/examples/l2fwd: No such file or directory.  Stop.
## Building l3fwd
gmake: *** /tmp/SUSE15-64_K4.12.14_GCC7.3.1/x86_64-native-linuxapp-gcc/2cd42b5301b443f29da60d354fbf4f09/dpdk/build-x86-default/install-root/usr/local/share/dpdk/examples/l3fwd: No such file or directory.  Stop.
## Building skeleton
gmake: *** /tmp/SUSE15-64_K4.12.14_GCC7.3.1/x86_64-native-linuxapp-gcc/2cd42b5301b443f29da60d354fbf4f09/dpdk/build-x86-default/install-root/usr/local/share/dpdk/examples/skeleton: No such file or directory.  Stop.
## Building timer
gmake: *** /tmp/SUSE15-64_K4.12.14_GCC7.3.1/x86_64-native-linuxapp-gcc/2cd42b5301b443f29da60d354fbf4f09/dpdk/build-x86-default/install-root/usr/local/share/dpdk/examples/timer: No such file or directory.  Stop.


*Meson Build Failed #3:
OS: UB1604-32
Target:build-gcc-static
Dependency libisal found: NO (tried pkgconfig and cmake)
Dependency zlib found: NO (tried pkgconfig and cmake)
WARNING: Newline character in a string detected, use ''' (three single quotes) for multiline strings instead.
This will become a hard error in a future Meson release. 		'dpaa2_eventdev_selftest.c) 13 2

drivers/event/dpaa2/meson.build:13:96: ERROR: Method name must be plain id
		'dpaa2_eventdev_selftest.c)
                                                                                                ^

A full log can be found at /tmp/UB1604-32_K4.4.0_GCC5.4.0/i686-native-linuxapp-gcc/2cd42b5301b443f29da60d354fbf4f09/dpdk/build-gcc-static/meson-logs/meson-log.txt
ninja -C build-gcc-static
--
Dependency libisal found: NO (tried pkgconfig and cmake)
Dependency zlib found: NO (tried pkgconfig and cmake)
WARNING: Newline character in a string detected, use ''' (three single quotes) for multiline strings instead.
This will become a hard error in a future Meson release. 		'dpaa2_eventdev_selftest.c) 13 2

drivers/event/dpaa2/meson.build:13:96: ERROR: Method name must be plain id
		'dpaa2_eventdev_selftest.c)
                                                                                                ^

A full log can be found at /tmp/UB1604-32_K4.4.0_GCC5.4.0/i686-native-linuxapp-gcc/2cd42b5301b443f29da60d354fbf4f09/dpdk/build-gcc-shared/meson-logs/meson-log.txt
ninja -C build-gcc-shared
--
Dependency libisal found: NO (tried pkgconfig and cmake)
Dependency zlib found: NO (tried pkgconfig and cmake)
WARNING: Newline character in a string detected, use ''' (three single quotes) for multiline strings instead.
This will become a hard error in a future Meson release. 		'dpaa2_eventdev_selftest.c) 13 2

drivers/event/dpaa2/meson.build:13:96: ERROR: Method name must be plain id
		'dpaa2_eventdev_selftest.c)
                                                                                                ^

A full log can be found at /tmp/UB1604-32_K4.4.0_GCC5.4.0/i686-native-linuxapp-gcc/2cd42b5301b443f29da60d354fbf4f09/dpdk/build-clang-static/meson-logs/meson-log.txt
ninja -C build-clang-static
--
Dependency libisal found: NO (tried pkgconfig and cmake)
Dependency zlib found: NO (tried pkgconfig and cmake)
WARNING: Newline character in a string detected, use ''' (three single quotes) for multiline strings instead.
This will become a hard error in a future Meson release. 		'dpaa2_eventdev_selftest.c) 13 2

drivers/event/dpaa2/meson.build:13:96: ERROR: Method name must be plain id
		'dpaa2_eventdev_selftest.c)
                                                                                                ^

A full log can be found at /tmp/UB1604-32_K4.4.0_GCC5.4.0/i686-native-linuxapp-gcc/2cd42b5301b443f29da60d354fbf4f09/dpdk/build-clang-shared/meson-logs/meson-log.txt
ninja -C build-clang-shared
--
Dependency libisal found: NO (tried pkgconfig and cmake)
Dependency zlib found: NO (tried pkgconfig and cmake)
WARNING: Newline character in a string detected, use ''' (three single quotes) for multiline strings instead.
This will become a hard error in a future Meson release. 		'dpaa2_eventdev_selftest.c) 13 2

drivers/event/dpaa2/meson.build:13:96: ERROR: Method name must be plain id
		'dpaa2_eventdev_selftest.c)
                                                                                                ^

A full log can be found at /tmp/UB1604-32_K4.4.0_GCC5.4.0/i686-native-linuxapp-gcc/2cd42b5301b443f29da60d354fbf4f09/dpdk/build-x86-default/meson-logs/meson-log.txt
ninja -C build-x86-default
--
ninja: error: loading 'build.ninja': No such file or directory
find: ‘/tmp/UB1604-32_K4.4.0_GCC5.4.0/i686-native-linuxapp-gcc/2cd42b5301b443f29da60d354fbf4f09/dpdk/build-x86-default/install-root’: No such file or directory
dirname: missing operand
Try 'dirname --help' for more information.
## Building cmdline
make: *** /tmp/UB1604-32_K4.4.0_GCC5.4.0/i686-native-linuxapp-gcc/2cd42b5301b443f29da60d354fbf4f09/dpdk/build-x86-default/install-root/usr/local/share/dpdk/examples/cmdline: No such file or directory.  Stop.
## Building helloworld
make: *** /tmp/UB1604-32_K4.4.0_GCC5.4.0/i686-native-linuxapp-gcc/2cd42b5301b443f29da60d354fbf4f09/dpdk/build-x86-default/install-root/usr/local/share/dpdk/examples/helloworld: No such file or directory.  Stop.
## Building l2fwd
make: *** /tmp/UB1604-32_K4.4.0_GCC5.4.0/i686-native-linuxapp-gcc/2cd42b5301b443f29da60d354fbf4f09/dpdk/build-x86-default/install-root/usr/local/share/dpdk/examples/l2fwd: No such file or directory.  Stop.
## Building l3fwd
make: *** /tmp/UB1604-32_K4.4.0_GCC5.4.0/i686-native-linuxapp-gcc/2cd42b5301b443f29da60d354fbf4f09/dpdk/build-x86-default/install-root/usr/local/share/dpdk/examples/l3fwd: No such file or directory.  Stop.
## Building skeleton
make: *** /tmp/UB1604-32_K4.4.0_GCC5.4.0/i686-native-linuxapp-gcc/2cd42b5301b443f29da60d354fbf4f09/dpdk/build-x86-default/install-root/usr/local/share/dpdk/examples/skeleton: No such file or directory.  Stop.
## Building timer
make: *** /tmp/UB1604-32_K4.4.0_GCC5.4.0/i686-native-linuxapp-gcc/2cd42b5301b443f29da60d354fbf4f09/dpdk/build-x86-default/install-root/usr/local/share/dpdk/examples/timer: No such file or directory.  Stop.


*Meson Build Failed #4:
OS: UB1804-64
Target:build-gcc-static
Dependency libisal found: NO (tried pkgconfig and cmake)
Dependency zlib found: YES (cached)
WARNING: Newline character in a string detected, use ''' (three single quotes) for multiline strings instead.
This will become a hard error in a future Meson release. 		'dpaa2_eventdev_selftest.c) 13 2

drivers/event/dpaa2/meson.build:13:96: ERROR: Method name must be plain id
		'dpaa2_eventdev_selftest.c)
                                                                                                ^

A full log can be found at /tmp/UB1804-64_K4.15.0_GCC7.3.0/x86_64-native-linuxapp-gcc/2cd42b5301b443f29da60d354fbf4f09/dpdk/build-gcc-static/meson-logs/meson-log.txt
ninja -C build-gcc-static
--
Dependency libisal found: NO (tried pkgconfig and cmake)
Dependency zlib found: YES (cached)
WARNING: Newline character in a string detected, use ''' (three single quotes) for multiline strings instead.
This will become a hard error in a future Meson release. 		'dpaa2_eventdev_selftest.c) 13 2

drivers/event/dpaa2/meson.build:13:96: ERROR: Method name must be plain id
		'dpaa2_eventdev_selftest.c)
                                                                                                ^

A full log can be found at /tmp/UB1804-64_K4.15.0_GCC7.3.0/x86_64-native-linuxapp-gcc/2cd42b5301b443f29da60d354fbf4f09/dpdk/build-gcc-shared/meson-logs/meson-log.txt
ninja -C build-gcc-shared
--
Dependency libisal found: NO (tried pkgconfig and cmake)
Dependency zlib found: YES (cached)
WARNING: Newline character in a string detected, use ''' (three single quotes) for multiline strings instead.
This will become a hard error in a future Meson release. 		'dpaa2_eventdev_selftest.c) 13 2

drivers/event/dpaa2/meson.build:13:96: ERROR: Method name must be plain id
		'dpaa2_eventdev_selftest.c)
                                                                                                ^

A full log can be found at /tmp/UB1804-64_K4.15.0_GCC7.3.0/x86_64-native-linuxapp-gcc/2cd42b5301b443f29da60d354fbf4f09/dpdk/build-clang-static/meson-logs/meson-log.txt
ninja -C build-clang-static
--
Dependency libisal found: NO (tried pkgconfig and cmake)
Dependency zlib found: YES (cached)
WARNING: Newline character in a string detected, use ''' (three single quotes) for multiline strings instead.
This will become a hard error in a future Meson release. 		'dpaa2_eventdev_selftest.c) 13 2

drivers/event/dpaa2/meson.build:13:96: ERROR: Method name must be plain id
		'dpaa2_eventdev_selftest.c)
                                                                                                ^

A full log can be found at /tmp/UB1804-64_K4.15.0_GCC7.3.0/x86_64-native-linuxapp-gcc/2cd42b5301b443f29da60d354fbf4f09/dpdk/build-clang-shared/meson-logs/meson-log.txt
ninja -C build-clang-shared
--
Dependency libisal found: NO (tried pkgconfig and cmake)
Dependency zlib found: YES (cached)
WARNING: Newline character in a string detected, use ''' (three single quotes) for multiline strings instead.
This will become a hard error in a future Meson release. 		'dpaa2_eventdev_selftest.c) 13 2

drivers/event/dpaa2/meson.build:13:96: ERROR: Method name must be plain id
		'dpaa2_eventdev_selftest.c)
                                                                                                ^

A full log can be found at /tmp/UB1804-64_K4.15.0_GCC7.3.0/x86_64-native-linuxapp-gcc/2cd42b5301b443f29da60d354fbf4f09/dpdk/build-x86-default/meson-logs/meson-log.txt
ninja -C build-x86-default
--
ninja: error: loading 'build.ninja': No such file or directory
find: ‘/tmp/UB1804-64_K4.15.0_GCC7.3.0/x86_64-native-linuxapp-gcc/2cd42b5301b443f29da60d354fbf4f09/dpdk/build-x86-default/install-root’: No such file or directory
dirname: missing operand
Try 'dirname --help' for more information.
## Building cmdline
make: *** /tmp/UB1804-64_K4.15.0_GCC7.3.0/x86_64-native-linuxapp-gcc/2cd42b5301b443f29da60d354fbf4f09/dpdk/build-x86-default/install-root/usr/local/share/dpdk/examples/cmdline: No such file or directory.  Stop.
## Building helloworld
make: *** /tmp/UB1804-64_K4.15.0_GCC7.3.0/x86_64-native-linuxapp-gcc/2cd42b5301b443f29da60d354fbf4f09/dpdk/build-x86-default/install-root/usr/local/share/dpdk/examples/helloworld: No such file or directory.  Stop.
## Building l2fwd
make: *** /tmp/UB1804-64_K4.15.0_GCC7.3.0/x86_64-native-linuxapp-gcc/2cd42b5301b443f29da60d354fbf4f09/dpdk/build-x86-default/install-root/usr/local/share/dpdk/examples/l2fwd: No such file or directory.  Stop.
## Building l3fwd
make: *** /tmp/UB1804-64_K4.15.0_GCC7.3.0/x86_64-native-linuxapp-gcc/2cd42b5301b443f29da60d354fbf4f09/dpdk/build-x86-default/install-root/usr/local/share/dpdk/examples/l3fwd: No such file or directory.  Stop.
## Building skeleton
make: *** /tmp/UB1804-64_K4.15.0_GCC7.3.0/x86_64-native-linuxapp-gcc/2cd42b5301b443f29da60d354fbf4f09/dpdk/build-x86-default/install-root/usr/local/share/dpdk/examples/skeleton: No such file or directory.  Stop.
## Building timer
make: *** /tmp/UB1804-64_K4.15.0_GCC7.3.0/x86_64-native-linuxapp-gcc/2cd42b5301b443f29da60d354fbf4f09/dpdk/build-x86-default/install-root/usr/local/share/dpdk/examples/timer: No such file or directory.  Stop.


*Meson Build Failed #5:
OS: FreeBSD12-64
Target:build-gcc-static
Dependency libisal found: NO (tried pkgconfig and cmake)
Dependency zlib found: YES (cached)
WARNING: Newline character in a string detected, use ''' (three single quotes) for multiline strings instead.
This will become a hard error in a future Meson release. 		'dpaa2_eventdev_selftest.c) 13 2

drivers/event/dpaa2/meson.build:13:96: ERROR: Method name must be plain id
		'dpaa2_eventdev_selftest.c)
                                                                                                ^

A full log can be found at /tmp/FreeBSD12-64_K19.02_GCC7.3.0/x86_64-native-bsdapp-gcc/2cd42b5301b443f29da60d354fbf4f09/dpdk/build-gcc-static/meson-logs/meson-log.txt
ninja -C build-gcc-static
--
Dependency libisal found: NO (tried pkgconfig and cmake)
Dependency zlib found: YES (cached)
WARNING: Newline character in a string detected, use ''' (three single quotes) for multiline strings instead.
This will become a hard error in a future Meson release. 		'dpaa2_eventdev_selftest.c) 13 2

drivers/event/dpaa2/meson.build:13:96: ERROR: Method name must be plain id
		'dpaa2_eventdev_selftest.c)
                                                                                                ^

A full log can be found at /tmp/FreeBSD12-64_K19.02_GCC7.3.0/x86_64-native-bsdapp-gcc/2cd42b5301b443f29da60d354fbf4f09/dpdk/build-gcc-shared/meson-logs/meson-log.txt
ninja -C build-gcc-shared
--
Dependency libisal found: NO (tried pkgconfig and cmake)
Dependency zlib found: YES (cached)
WARNING: Newline character in a string detected, use ''' (three single quotes) for multiline strings instead.
This will become a hard error in a future Meson release. 		'dpaa2_eventdev_selftest.c) 13 2

drivers/event/dpaa2/meson.build:13:96: ERROR: Method name must be plain id
		'dpaa2_eventdev_selftest.c)
                                                                                                ^

A full log can be found at /tmp/FreeBSD12-64_K19.02_GCC7.3.0/x86_64-native-bsdapp-gcc/2cd42b5301b443f29da60d354fbf4f09/dpdk/build-clang-static/meson-logs/meson-log.txt
ninja -C build-clang-static
--
Dependency libisal found: NO (tried pkgconfig and cmake)
Dependency zlib found: YES (cached)
WARNING: Newline character in a string detected, use ''' (three single quotes) for multiline strings instead.
This will become a hard error in a future Meson release. 		'dpaa2_eventdev_selftest.c) 13 2

drivers/event/dpaa2/meson.build:13:96: ERROR: Method name must be plain id
		'dpaa2_eventdev_selftest.c)
                                                                                                ^

A full log can be found at /tmp/FreeBSD12-64_K19.02_GCC7.3.0/x86_64-native-bsdapp-gcc/2cd42b5301b443f29da60d354fbf4f09/dpdk/build-clang-shared/meson-logs/meson-log.txt
ninja -C build-clang-shared
--
Dependency libisal found: NO (tried pkgconfig and cmake)
Dependency zlib found: YES (cached)
WARNING: Newline character in a string detected, use ''' (three single quotes) for multiline strings instead.
This will become a hard error in a future Meson release. 		'dpaa2_eventdev_selftest.c) 13 2

drivers/event/dpaa2/meson.build:13:96: ERROR: Method name must be plain id
		'dpaa2_eventdev_selftest.c)
                                                                                                ^

A full log can be found at /tmp/FreeBSD12-64_K19.02_GCC7.3.0/x86_64-native-bsdapp-gcc/2cd42b5301b443f29da60d354fbf4f09/dpdk/build-x86-default/meson-logs/meson-log.txt
ninja -C build-x86-default
--
ninja: Entering directory `build-x86-default'
ninja: error: loading 'build.ninja': No such file or directory
find: /tmp/FreeBSD12-64_K19.02_GCC7.3.0/x86_64-native-bsdapp-gcc/2cd42b5301b443f29da60d354fbf4f09/dpdk/build-x86-default/install-root: No such file or directory
usage: dirname string [...]
## Building cmdline
gmake: *** /tmp/FreeBSD12-64_K19.02_GCC7.3.0/x86_64-native-bsdapp-gcc/2cd42b5301b443f29da60d354fbf4f09/dpdk/build-x86-default/install-root/usr/local/share/dpdk/examples/cmdline: No such file or directory.  Stop.
## Building helloworld
gmake: *** /tmp/FreeBSD12-64_K19.02_GCC7.3.0/x86_64-native-bsdapp-gcc/2cd42b5301b443f29da60d354fbf4f09/dpdk/build-x86-default/install-root/usr/local/share/dpdk/examples/helloworld: No such file or directory.  Stop.
## Building l2fwd
gmake: *** /tmp/FreeBSD12-64_K19.02_GCC7.3.0/x86_64-native-bsdapp-gcc/2cd42b5301b443f29da60d354fbf4f09/dpdk/build-x86-default/install-root/usr/local/share/dpdk/examples/l2fwd: No such file or directory.  Stop.
## Building l3fwd
gmake: *** /tmp/FreeBSD12-64_K19.02_GCC7.3.0/x86_64-native-bsdapp-gcc/2cd42b5301b443f29da60d354fbf4f09/dpdk/build-x86-default/install-root/usr/local/share/dpdk/examples/l3fwd: No such file or directory.  Stop.
## Building skeleton
gmake: *** /tmp/FreeBSD12-64_K19.02_GCC7.3.0/x86_64-native-bsdapp-gcc/2cd42b5301b443f29da60d354fbf4f09/dpdk/build-x86-default/install-root/usr/local/share/dpdk/examples/skeleton: No such file or directory.  Stop.
## Building timer
gmake: *** /tmp/FreeBSD12-64_K19.02_GCC7.3.0/x86_64-native-bsdapp-gcc/2cd42b5301b443f29da60d354fbf4f09/dpdk/build-x86-default/install-root/usr/local/share/dpdk/examples/timer: No such file or directory.  Stop.

DPDK STV team


More information about the test-report mailing list