[dpdk-test-report] |FAILURE| pw58812-58817 [PATCH] [v2, 1/6] doc/rcu: add RCU integration design details

dpdklab at iol.unh.edu dpdklab at iol.unh.edu
Sat Sep 7 03:56:37 CEST 2019


Test-Label: Performance-Testing
Test-Status: FAILURE
http://dpdk.org/patch/58812

_build patch failure_

Submitter: Ruifeng Wang <ruifeng.wang at arm.com>
Date: Friday, September 06 2019 09:45:29 
Applied on: CommitID:e7fd5a3bbe5636e93a66fd5086f182756624c97a
Apply patch set 58812-58817 failed:

Configuration done using x86_64-native-linuxapp-gcc
== Build lib
== Build lib/librte_kvargs
== Build lib/librte_eal
== Build lib/librte_eal/common
== Build lib/librte_eal/linux
== Build lib/librte_eal/linux/eal
== Build lib/librte_pci
== Build lib/librte_ring
== Build lib/librte_stack
== Build lib/librte_mempool
== Build lib/librte_mbuf
== Build lib/librte_timer
== Build lib/librte_cfgfile
== Build lib/librte_net
== Build lib/librte_cmdline
  SYMLINK-FILE include/cmdline.h
  SYMLINK-FILE include/cmdline_parse.h
  SYMLINK-FILE include/cmdline_parse_num.h
  SYMLINK-FILE include/cmdline_parse_ipaddr.h
  SYMLINK-FILE include/cmdline_parse_etheraddr.h
  SYMLINK-FILE include/cmdline_parse_string.h
  SYMLINK-FILE include/cmdline_rdline.h
  SYMLINK-FILE include/cmdline_vt100.h
  SYMLINK-FILE include/cmdline_socket.h
  SYMLINK-FILE include/cmdline_cirbuf.h
  SYMLINK-FILE include/cmdline_parse_portlist.h
  CC cmdline.o
  CC cmdline_cirbuf.o
  CC cmdline_parse.o
  CC cmdline_parse_etheraddr.o
  CC cmdline_parse_ipaddr.o
  CC cmdline_parse_num.o
  CC cmdline_parse_string.o
  CC cmdline_rdline.o
  CC cmdline_vt100.o
  CC cmdline_socket.o
  CC cmdline_parse_portlist.o
  AR librte_cmdline.a
  INSTALL-LIB librte_cmdline.a
== Build lib/librte_meter
== Build lib/librte_ethdev
  SYMLINK-FILE include/rte_ethdev.h
  SYMLINK-FILE include/rte_ethdev_driver.h
  SYMLINK-FILE include/rte_ethdev_core.h
  SYMLINK-FILE include/rte_ethdev_pci.h
  SYMLINK-FILE include/rte_ethdev_vdev.h
  SYMLINK-FILE include/rte_eth_ctrl.h
  SYMLINK-FILE include/rte_dev_info.h
  SYMLINK-FILE include/rte_flow.h
  SYMLINK-FILE include/rte_flow_driver.h
  SYMLINK-FILE include/rte_tm.h
  SYMLINK-FILE include/rte_tm_driver.h
  SYMLINK-FILE include/rte_mtr.h
  SYMLINK-FILE include/rte_mtr_driver.h
  CC ethdev_private.o
  CC rte_ethdev.o
  CC rte_class_eth.o
  CC rte_flow.o
  CC rte_tm.o
  CC rte_mtr.o
  CC ethdev_profile.o
  AR librte_ethdev.a
  INSTALL-LIB librte_ethdev.a
== Build lib/librte_bbdev
== Build lib/librte_cryptodev
  SYMLINK-FILE include/rte_crypto.h
  SYMLINK-FILE include/rte_crypto_sym.h
  SYMLINK-FILE include/rte_cryptodev.h
  SYMLINK-FILE include/rte_cryptodev_pmd.h
  SYMLINK-FILE include/rte_crypto_asym.h
  CC rte_cryptodev.o
  CC rte_cryptodev_pmd.o
  AR librte_cryptodev.a
  INSTALL-LIB librte_cryptodev.a
== Build lib/librte_security
  SYMLINK-FILE include/rte_security.h
  SYMLINK-FILE include/rte_security_driver.h
  CC rte_security.o
  AR librte_security.a
  INSTALL-LIB librte_security.a
== Build lib/librte_compressdev
  SYMLINK-FILE include/rte_comp.h
  SYMLINK-FILE include/rte_compressdev.h
  SYMLINK-FILE include/rte_compressdev_pmd.h
  SYMLINK-FILE include/rte_compressdev_internal.h
  CC rte_compressdev.o
  CC rte_compressdev_pmd.o
  CC rte_comp.o
  AR librte_compressdev.a
  INSTALL-LIB librte_compressdev.a
== Build lib/librte_hash
== Build lib/librte_eventdev
  SYMLINK-FILE include/rte_eventdev.h
  SYMLINK-FILE include/rte_eventdev_pmd.h
  SYMLINK-FILE include/rte_eventdev_pmd_pci.h
  SYMLINK-FILE include/rte_eventdev_pmd_vdev.h
  SYMLINK-FILE include/rte_event_ring.h
  SYMLINK-FILE include/rte_event_eth_rx_adapter.h
  SYMLINK-FILE include/rte_event_timer_adapter.h
  SYMLINK-FILE include/rte_event_timer_adapter_pmd.h
  SYMLINK-FILE include/rte_event_crypto_adapter.h
  SYMLINK-FILE include/rte_event_eth_tx_adapter.h
  CC rte_eventdev.o
  CC rte_event_ring.o
  CC rte_event_eth_rx_adapter.o
  CC rte_event_timer_adapter.o
  CC rte_event_crypto_adapter.o
  CC rte_event_eth_tx_adapter.o
  AR librte_eventdev.a
  INSTALL-LIB librte_eventdev.a
== Build lib/librte_rawdev
  SYMLINK-FILE include/rte_rawdev.h
  SYMLINK-FILE include/rte_rawdev_pmd.h
  CC rte_rawdev.o
  AR librte_rawdev.a
  INSTALL-LIB librte_rawdev.a
== Build lib/librte_vhost
  SYMLINK-FILE include/rte_vhost.h
  SYMLINK-FILE include/rte_vdpa.h
  SYMLINK-FILE include/rte_vhost_crypto.h
  CC fd_man.o
  CC iotlb.o
  CC socket.o
  CC vhost.o
  CC vhost_user.o
  CC virtio_net.o
  CC vdpa.o
  CC vhost_crypto.o
  AR librte_vhost.a
  INSTALL-LIB librte_vhost.a
== Build lib/librte_efd
== Build lib/librte_lpm
  CC rte_lpm.o
/var/lib/jenkins/workspace/Apply-Custom-Patch-Set/dpdk/lib/librte_lpm/rte_lpm.c: In function ‘__rte_lpm_rcu_qsbr_reclaim_chunk’:
/var/lib/jenkins/workspace/Apply-Custom-Patch-Set/dpdk/lib/librte_lpm/rte_lpm.c:482:11: error: ‘qs_item.index’ may be used uninitialized in this function [-Werror=maybe-uninitialized]
    *index = qs_item.index;
           ^
/var/lib/jenkins/workspace/Apply-Custom-Patch-Set/dpdk/lib/librte_lpm/rte_lpm.c: At top level:
cc1: error: unrecognized command line option "-Wno-address-of-packed-member" [-Werror]
cc1: all warnings being treated as errors
make[5]: *** [rte_lpm.o] Error 1
make[4]: *** [librte_lpm] Error 2
make[3]: *** [lib] Error 2
make[2]: *** [all] Error 2
make[1]: *** [pre_install] Error 2
make: *** [install] Error 2

https://lab.dpdk.org/results/dashboard/patchsets/7385/

UNH-IOL DPDK Performance Test Lab


More information about the test-report mailing list