[dpdk-test-report] |FAILURE| pw58739-58795 [PATCH] [v3, 01/54] ethdev: remove redundunt device info cleanup before get

dpdklab at iol.unh.edu dpdklab at iol.unh.edu
Sat Sep 7 08:17:04 CEST 2019


Test-Label: Performance-Testing
Test-Status: FAILURE
http://dpdk.org/patch/58739

_build patch failure_

Submitter: Andrew Rybchenko <arybchenko at solarflare.com>
Date: Friday, September 06 2019 07:30:13 
Applied on: CommitID:e7fd5a3bbe5636e93a66fd5086f182756624c97a
Apply patch set 58739-58795 failed:

Configuration done using x86_64-native-linuxapp-gcc
== Build lib
== Build lib/librte_kvargs
== Build lib/librte_eal
== Build lib/librte_eal/common
== Build lib/librte_eal/linux
== Build lib/librte_eal/linux/eal
== Build lib/librte_pci
== Build lib/librte_ring
== Build lib/librte_stack
== Build lib/librte_mempool
== Build lib/librte_mbuf
== Build lib/librte_timer
== Build lib/librte_cfgfile
== Build lib/librte_net
== Build lib/librte_cmdline
== Build lib/librte_meter
== Build lib/librte_ethdev
== Build lib/librte_bbdev
== Build lib/librte_cryptodev
== Build lib/librte_security
== Build lib/librte_compressdev
== Build lib/librte_hash
== Build lib/librte_eventdev
== Build lib/librte_rawdev
== Build lib/librte_vhost
== Build lib/librte_efd
== Build lib/librte_lpm
== Build lib/librte_acl
== Build lib/librte_member
== Build lib/librte_ip_frag
== Build lib/librte_gro
== Build lib/librte_jobstats
== Build lib/librte_metrics
== Build lib/librte_bitratestats
== Build lib/librte_latencystats
== Build lib/librte_power
== Build lib/librte_sched
== Build lib/librte_kni
== Build lib/librte_port
== Build lib/librte_table
== Build lib/librte_flow_classify
== Build lib/librte_distributor
== Build lib/librte_pipeline
== Build lib/librte_reorder
== Build lib/librte_pdump
== Build lib/librte_gso
== Build lib/librte_bpf
== Build lib/librte_ipsec
== Build lib/librte_rcu
== Build buildtools
== Build buildtools/pmdinfogen
== Build kernel
== Build kernel/linux
== Build kernel/linux/igb_uio
  Building modules, stage 2.
  MODPOST 1 modules
== Build kernel/linux/kni
  Building modules, stage 2.
  MODPOST 1 modules
== Build drivers
== Build drivers/common
== Build drivers/common/cpt
== Build drivers/common/octeontx
== Build drivers/common/octeontx2
== Build drivers/common/dpaax
== Build drivers/bus
== Build drivers/bus/dpaa
== Build drivers/bus/fslmc
== Build drivers/bus/ifpga
== Build drivers/bus/pci
== Build drivers/bus/vdev
== Build drivers/bus/vmbus
== Build drivers/mempool
== Build drivers/mempool/bucket
== Build drivers/mempool/dpaa
== Build drivers/mempool/dpaa2
== Build drivers/mempool/ring
== Build drivers/mempool/stack
== Build drivers/mempool/octeontx
== Build drivers/mempool/octeontx2
== Build drivers/net
== Build drivers/net/af_packet
== Build drivers/net/ark
== Build drivers/net/atlantic
  CC atl_ethdev.o
/var/lib/jenkins/workspace/Apply-Custom-Patch-Set/dpdk/drivers/net/atlantic/atl_ethdev.c:123:12: error: conflicting types for ‘atl_dev_info_get’
 static int atl_dev_info_get(struct rte_eth_dev *dev,
            ^
/var/lib/jenkins/workspace/Apply-Custom-Patch-Set/dpdk/drivers/net/atlantic/atl_ethdev.c:48:13: note: previous declaration of ‘atl_dev_info_get’ was here
 static void atl_dev_info_get(struct rte_eth_dev *dev,
             ^
cc1: error: unrecognized command line option "-Wno-address-of-packed-member" [-Werror]
cc1: all warnings being treated as errors
make[6]: *** [atl_ethdev.o] Error 1
make[5]: *** [atlantic] Error 2
make[4]: *** [net] Error 2
make[3]: *** [drivers] Error 2
make[2]: *** [all] Error 2
make[1]: *** [pre_install] Error 2
make: *** [install] Error 2

https://lab.dpdk.org/results/dashboard/patchsets/7376/

UNH-IOL DPDK Performance Test Lab


More information about the test-report mailing list