[dpdk-test-report] |FAILURE| pw58949[v2, 1/5] event/dpaa2: fix def queue conf

sys_stv at intel.com sys_stv at intel.com
Sat Sep 7 10:26:07 CEST 2019


Test-Label: Intel-compilation
Test-Status: FAILURE
http://dpdk.org/patch/58949

_Compilation issues_

Submitter: Hemant Agrawal <hemant.agrawal at nxp.com>
Date: 2019-09-07 06:42:05
Reply_mail: 20190907064209.30686-2-hemant.agrawal at nxp.com
DPDK git baseline: Repo:dpdk-next-eventdev, CommitID: 4ba6fa790cfadc9065c3cf6aa62b84031248e76d

Makefile build Summary: 22 Builds Done, 16 Successful, 6 Failures

Meson build Summary: 7 Builds Done, 3 Successful, 4 Failures

               +==============================================+===========+==========+
               |                   Makefile                   |   Meson   | Document |
+--------------+------+-------+------+------------+-----------+-----------+----------+
| os           | gcc  | clang | icc  | gcc+shared | gcc+debug | gcc/clang | pdf/html |
+--------------+------+-------+------+------------+-----------+-----------+----------+
| RHEL76-64    | pass |       |      |            |           |           |          |
| CENTOS76-64  | pass | FAIL  | pass | FAIL       | pass      |           |          |
| UB1804-64    | pass | FAIL  | pass |            |           | FAIL      | pass     |
| UB1604-32    | pass |       |      |            |           | FAIL      |          |
| UB1904-64    | pass |       |      |            |           |           |          |
| UB1604-64    | pass | FAIL  |      |            |           |           |          |
| FC30-64      | pass | FAIL  |      |            |           | FAIL      |          |
| WIN10-64     |      |       |      |            |           | pass      |          |
| FreeBSD12-64 | pass | pass  |      | pass       | pass      | pass      |          |
| RHEL80-64    | pass |       |      |            |           |           |          |
| SUSE15-64    | pass | FAIL  |      |            |           | FAIL      |          |
+--------------+------+-------+------+------------+-----------+-----------+----------+

Test environment and configuration as below:

** Makefile build **


OS: RHEL76-64
	Kernel Version: 3.10.0-957.el7.x86_64
	CPU info: Intel(R) Xeon(R) CPU E5-2699 v4 @ 2.20GHz
	GCC Version: gcc (GCC) 4.8.5 20150623 (Red Hat 4.8.5-36)
	Clang Version: NA
	x86_64-native-linuxapp-gcc


OS: CENTOS76-64
	Kernel Version: 3.10.0-957.10.1.el7.x86_64
	CPU info: Intel(R) Xeon(R) CPU E5-2699 v4 @ 2.20GHz
	GCC Version: gcc (GCC) 4.8.5 20150623 (Red Hat 4.8.5-36)
	Clang Version: 3.4.2 (tags/RELEASE_34/dot2-final)
	x86_64-native-linuxapp-clang
	x86_64-native-linuxapp-gcc
	x86_64-native-linuxapp-gcc+debug
	x86_64-native-linuxapp-gcc+shared
	x86_64-native-linuxapp-icc


OS: UB1804-64
	Kernel Version: 4.15.0-20-generic
	CPU info: Intel(R) Xeon(R) CPU E5-2699 v3 @ 2.30GHz
	GCC Version: gcc (Ubuntu 7.3.0-27ubuntu1~18.04) 7.3.0
	Clang Version: 6.0.0-1ubuntu2 (tags/RELEASE_600/final)
	x86_64-native-linuxapp-icc
	x86_64-native-linuxapp-clang
	x86_64-native-linuxapp-gcc


OS: UB1904-64
	Kernel Version: 5.0.0-13-generic
	CPU info: Intel(R) Xeon(R) CPU E5-2699 v3 @ 2.30GHz
	GCC Version: gcc (Ubuntu 8.3.0-6ubuntu1) 8.3.0
	Clang Version: 8.0.0-3 (tags/RELEASE_800/final)
	x86_64-native-linuxapp-gcc


OS: UB1604-32
	Kernel Version: 4.4.0-131-generic
	CPU info: Intel(R) Xeon(R) CPU E5-2699 v3 @ 2.30GHz
	GCC Version: gcc (Ubuntu 5.4.0-6ubuntu1~16.04.11) 5.4.0 20160609
	Clang Version: 3.8.0-2ubuntu4 (tags/RELEASE_380/final)
	i686-native-linuxapp-gcc


OS: UB1604-64
	Kernel Version: 4.4.0-47-generic
	CPU info: Intel(R) Xeon(R) CPU E5-2699 v3 @ 2.30GHz
	GCC Version: gcc (Ubuntu 5.4.0-6ubuntu1~16.04.10) 5.4.0 20160609
	Clang Version: 3.8.0-2ubuntu4 (tags/RELEASE_380/final)
	x86_64-native-linuxapp-clang
	x86_64-native-linuxapp-gcc


OS: FC30-64
	Kernel Version: 5.1.7-300.fc30.x86_64
	CPU info: Intel(R) Xeon(R) CPU E5-2699 v4 @ 2.20GHz
	GCC Version: gcc (GCC) 9.1.1 20190503 (Red Hat 9.1.1-1)
	Clang Version: 8.0.0 (Fedora 8.0.0-1.fc30)
	x86_64-native-linuxapp-gcc
	x86_64-native-linuxapp-clang


OS: FreeBSD12-64
	Kernel Version: 12.0-RC3
	CPU info: Intel(R) Xeon(R) CPU E5-2699 v4 @ 2.20GHz (2194.97-MHz K8-class CPU)
	GCC Version: gcc (FreeBSD Ports Collection) 7.3.0
	Clang Version: 6.0.1 (tags/RELEASE_601/final 335540) (based on LLVM 6.0.1)
	x86_64-native-bsdapp-clang
	x86_64-native-bsdapp-gcc+debug
	x86_64-native-bsdapp-gcc+shared
	x86_64-native-bsdapp-gcc


OS: RHEL80-64
	Kernel Version: 4.18.0-80.el8.x86_64
	CPU info: Intel(R) Xeon(R) CPU E5-2699 v4 @ 2.20GHz
	GCC Version: gcc (GCC) 8.2.1 20180905 (Red Hat 8.2.1-3)
	Clang Version: 6.0.1 (tags/RELEASE_601/final)
	x86_64-native-linuxapp-gcc


OS: SUSE15-64
	Kernel Version: 4.12.14-lp150.11-default
	CPU info: Intel(R) Xeon(R) CPU E5-2699 v4 @ 2.20GHz
	GCC Version: gcc (SUSE Linux) 7.3.1 20180323 [gcc-7-branch revision 258812]
	Clang Version: 5.0.1 (tags/RELEASE_501/final 312548)
	x86_64-native-linuxapp-gcc
	x86_64-native-linuxapp-clang


** Meson build **


OS: UB1804-64
	Kernel Version: 4.15.0-20-generic
	CPU info: Intel(R) Xeon(R) CPU E5-2699 v4 @ 2.20GHz
	GCC Version: gcc (Ubuntu 7.3.0-27ubuntu1~18.04) 7.3.0
	Clang Version: 6.0.0-1ubuntu2 (tags/RELEASE_600/final)
	x86_64-native-linuxapp-doc
	build-gcc-static
	build-gcc-shared
	build-clang-static
	build-clang-shared
	build-x86-default


OS: UB1604-32
	Kernel Version: 4.4.0-131-generic
	CPU info: Intel(R) Xeon(R) CPU E5-2699 v4 @ 2.20GHz
	GCC Version: gcc (Ubuntu 5.4.0-6ubuntu1~16.04.11) 5.4.0 20160609
	Clang Version: 3.8.0-2ubuntu4 (tags/RELEASE_380/final)
	build-gcc-static
	build-gcc-shared
	build-clang-static
	build-clang-shared
	build-x86-default


OS: FC30-64
	Kernel Version: 5.0.9-301.fc30.x86_64
	CPU info: Intel(R) Xeon(R) CPU E5-2699 v4 @ 2.20GHz
	GCC Version: gcc (GCC) 9.1.1 20190503 (Red Hat 9.1.1-1)
	Clang Version: 8.0.0 (Fedora 8.0.0-1.fc30)
	build-gcc-static
	build-gcc-shared
	build-clang-static
	build-clang-shared
	build-x86-default


OS: WIN10-64
	Kernel Version: N/A
	CPU info: N/A
	GCC Version: N/A
	Clang Version: Clang 8.0.0
	x86_64-windows-clang


OS: FreeBSD12-64
	Kernel Version: 12.0-RC3
	CPU info: Intel(R) Xeon(R) CPU E5-2699 v4 @ 2.20GHz (2194.99-MHz K8-class CPU)
	GCC Version: gcc (FreeBSD Ports Collection) 7.3.0
	Clang Version: 6.0.1 (tags/RELEASE_601/final 335540) (based on LLVM 6.0.1)
	build-gcc-static
	build-gcc-shared
	build-clang-static
	build-clang-shared
	build-x86-default


OS: SUSE15-64
	Kernel Version: 4.12.14-lp150.11-default
	CPU info: Intel(R) Xeon(R) CPU E5-2699 v4 @ 2.20GHz
	GCC Version: gcc (SUSE Linux) 7.3.1 20180323 [gcc-7-branch revision 258812]
	Clang Version: 5.0.1 (tags/RELEASE_501/final 312548)
	build-gcc-static
	build-gcc-shared
	build-clang-static
	build-clang-shared
	build-x86-default


*Make Build Failed #1:
OS: UB1604-64
Target: x86_64-native-linuxapp-clang
^
/tmp/UB1604-64_K4.4.0_Clang3.8.0/x86_64-native-linuxapp-clang/bfed894fe68b433aa22239777305ffdb/dpdk/drivers/event/dpaa2/dpaa2_eventdev_selftest.c:255:1: error: unused function 'eventdev_setup_dequeue_timeout' [-Werror,-Wunused-function]
eventdev_setup_dequeue_timeout(void)
^
4 errors generated.
/tmp/UB1604-64_K4.4.0_Clang3.8.0/x86_64-native-linuxapp-clang/bfed894fe68b433aa22239777305ffdb/dpdk/mk/internal/rte.compile-pre.mk:114: recipe for target 'dpaa2_eventdev_selftest.o' failed
make[6]: *** [dpaa2_eventdev_selftest.o] Error 1
/tmp/UB1604-64_K4.4.0_Clang3.8.0/x86_64-native-linuxapp-clang/bfed894fe68b433aa22239777305ffdb/dpdk/mk/rte.subdir.mk:35: recipe for target 'dpaa2' failed
make[5]: *** [dpaa2] Error 2
make[5]: *** Waiting for unfinished jobs....
  CC sw_evdev_xstats.o
  CC otx2_evdev.o
  PMDINFO ssovf_probe.o.pmd.c
  CC ssovf_probe.o.pmd.o
--
  INSTALL-LIB librte_pmd_octeontx_ssovf.a
  AR librte_pmd_sw_event.a
  INSTALL-LIB librte_pmd_sw_event.a
  AR librte_pmd_octeontx2_event.a
  INSTALL-LIB librte_pmd_octeontx2_event.a
/tmp/UB1604-64_K4.4.0_Clang3.8.0/x86_64-native-linuxapp-clang/bfed894fe68b433aa22239777305ffdb/dpdk/mk/rte.subdir.mk:35: recipe for target 'event' failed
make[4]: *** [event] Error 2
/tmp/UB1604-64_K4.4.0_Clang3.8.0/x86_64-native-linuxapp-clang/bfed894fe68b433aa22239777305ffdb/dpdk/mk/rte.sdkbuild.mk:46: recipe for target 'drivers' failed
make[3]: *** [drivers] Error 2
/tmp/UB1604-64_K4.4.0_Clang3.8.0/x86_64-native-linuxapp-clang/bfed894fe68b433aa22239777305ffdb/dpdk/mk/rte.sdkroot.mk:98: recipe for target 'all' failed
make[2]: *** [all] Error 2
/tmp/UB1604-64_K4.4.0_Clang3.8.0/x86_64-native-linuxapp-clang/bfed894fe68b433aa22239777305ffdb/dpdk/mk/rte.sdkinstall.mk:60: recipe for target 'pre_install' failed
make[1]: *** [pre_install] Error 2
/tmp/UB1604-64_K4.4.0_Clang3.8.0/x86_64-native-linuxapp-clang/bfed894fe68b433aa22239777305ffdb/dpdk/mk/rte.sdkroot.mk:77: recipe for target 'install' failed
make: *** [install] Error 2


*Make Build Failed #2:
OS: UB1804-64
Target: x86_64-native-linuxapp-clang
^
/tmp/UB1804-64_K4.15.0_Clang6.0.0/x86_64-native-linuxapp-clang/bfed894fe68b433aa22239777305ffdb/dpdk/drivers/event/dpaa2/dpaa2_eventdev_selftest.c:255:1: error: unused function 'eventdev_setup_dequeue_timeout' [-Werror,-Wunused-function]
eventdev_setup_dequeue_timeout(void)
^
4 errors generated.
/tmp/UB1804-64_K4.15.0_Clang6.0.0/x86_64-native-linuxapp-clang/bfed894fe68b433aa22239777305ffdb/dpdk/mk/internal/rte.compile-pre.mk:114: recipe for target 'dpaa2_eventdev_selftest.o' failed
make[6]: *** [dpaa2_eventdev_selftest.o] Error 1
make[6]: *** Waiting for unfinished jobs....
  LD sw_evdev.o
  CC dsw_xstats.o
  LD dpaa2_hw_dpcon.o
  CC sw_evdev_worker.o
--
  PMDINFO dpaa2_eventdev.o.pmd.c
  CC dpaa2_eventdev.o.pmd.o
  CC otx2_tim_worker.o
  LD dpaa2_eventdev.o
  CC otx2_evdev.o
/tmp/UB1804-64_K4.15.0_Clang6.0.0/x86_64-native-linuxapp-clang/bfed894fe68b433aa22239777305ffdb/dpdk/mk/rte.subdir.mk:35: recipe for target 'dpaa2' failed
make[5]: *** [dpaa2] Error 2
make[5]: *** Waiting for unfinished jobs....
  CC otx2_evdev_adptr.o
  PMDINFO dpaa_eventdev.o.pmd.c
  CC dpaa_eventdev.o.pmd.o
  LD dpaa_eventdev.o
--
  INSTALL-LIB librte_pmd_octeontx_ssovf.a
  AR librte_pmd_opdl_event.a
  INSTALL-LIB librte_pmd_opdl_event.a
  AR librte_pmd_octeontx2_event.a
  INSTALL-LIB librte_pmd_octeontx2_event.a
/tmp/UB1804-64_K4.15.0_Clang6.0.0/x86_64-native-linuxapp-clang/bfed894fe68b433aa22239777305ffdb/dpdk/mk/rte.subdir.mk:35: recipe for target 'event' failed
make[4]: *** [event] Error 2
/tmp/UB1804-64_K4.15.0_Clang6.0.0/x86_64-native-linuxapp-clang/bfed894fe68b433aa22239777305ffdb/dpdk/mk/rte.sdkbuild.mk:46: recipe for target 'drivers' failed
make[3]: *** [drivers] Error 2
/tmp/UB1804-64_K4.15.0_Clang6.0.0/x86_64-native-linuxapp-clang/bfed894fe68b433aa22239777305ffdb/dpdk/mk/rte.sdkroot.mk:98: recipe for target 'all' failed
make[2]: *** [all] Error 2
/tmp/UB1804-64_K4.15.0_Clang6.0.0/x86_64-native-linuxapp-clang/bfed894fe68b433aa22239777305ffdb/dpdk/mk/rte.sdkinstall.mk:60: recipe for target 'pre_install' failed
make[1]: *** [pre_install] Error 2
/tmp/UB1804-64_K4.15.0_Clang6.0.0/x86_64-native-linuxapp-clang/bfed894fe68b433aa22239777305ffdb/dpdk/mk/rte.sdkroot.mk:77: recipe for target 'install' failed
make: *** [install] Error 2


*Make Build Failed #3:
OS: FC30-64
Target: x86_64-native-linuxapp-clang
^
/tmp/FC30-64_K4.20_Clang8.0.0/x86_64-native-linuxapp-clang/bfed894fe68b433aa22239777305ffdb/dpdk/drivers/event/dpaa2/dpaa2_eventdev_selftest.c:255:1: error: unused function 'eventdev_setup_dequeue_timeout' [-Werror,-Wunused-function]
eventdev_setup_dequeue_timeout(void)
^
4 errors generated.
make[6]: *** [/tmp/FC30-64_K4.20_Clang8.0.0/x86_64-native-linuxapp-clang/bfed894fe68b433aa22239777305ffdb/dpdk/mk/internal/rte.compile-pre.mk:114: dpaa2_eventdev_selftest.o] Error 1
make[5]: *** [/tmp/FC30-64_K4.20_Clang8.0.0/x86_64-native-linuxapp-clang/bfed894fe68b433aa22239777305ffdb/dpdk/mk/rte.subdir.mk:35: dpaa2] Error 2
make[5]: *** Waiting for unfinished jobs....
  CC otx2_evdev_adptr.o
  CC sw_evdev_worker.o
  CC sw_evdev_scheduler.o
  PMDINFO timvf_probe.o.pmd.c
--
  LD otx2_evdev.o
  AR librte_pmd_sw_event.a
  INSTALL-LIB librte_pmd_sw_event.a
  AR librte_pmd_octeontx2_event.a
  INSTALL-LIB librte_pmd_octeontx2_event.a
make[4]: *** [/tmp/FC30-64_K4.20_Clang8.0.0/x86_64-native-linuxapp-clang/bfed894fe68b433aa22239777305ffdb/dpdk/mk/rte.subdir.mk:37: event] Error 2
make[3]: *** [/tmp/FC30-64_K4.20_Clang8.0.0/x86_64-native-linuxapp-clang/bfed894fe68b433aa22239777305ffdb/dpdk/mk/rte.sdkbuild.mk:46: drivers] Error 2
make[2]: *** [/tmp/FC30-64_K4.20_Clang8.0.0/x86_64-native-linuxapp-clang/bfed894fe68b433aa22239777305ffdb/dpdk/mk/rte.sdkroot.mk:99: all] Error 2
make[1]: *** [/tmp/FC30-64_K4.20_Clang8.0.0/x86_64-native-linuxapp-clang/bfed894fe68b433aa22239777305ffdb/dpdk/mk/rte.sdkinstall.mk:61: pre_install] Error 2
make: *** [/tmp/FC30-64_K4.20_Clang8.0.0/x86_64-native-linuxapp-clang/bfed894fe68b433aa22239777305ffdb/dpdk/mk/rte.sdkroot.mk:77: install] Error 2


*Make Build Failed #4:
OS: SUSE15-64
Target: x86_64-native-linuxapp-clang
^
/tmp/SUSE15-64_K4.12.14_Clang5.0.1/x86_64-native-linuxapp-clang/bfed894fe68b433aa22239777305ffdb/dpdk/drivers/event/dpaa2/dpaa2_eventdev_selftest.c:255:1: error: unused function 'eventdev_setup_dequeue_timeout' [-Werror,-Wunused-function]
eventdev_setup_dequeue_timeout(void)
^
4 errors generated.
make[6]: *** [/tmp/SUSE15-64_K4.12.14_Clang5.0.1/x86_64-native-linuxapp-clang/bfed894fe68b433aa22239777305ffdb/dpdk/mk/internal/rte.compile-pre.mk:114: dpaa2_eventdev_selftest.o] Error 1
make[5]: *** [/tmp/SUSE15-64_K4.12.14_Clang5.0.1/x86_64-native-linuxapp-clang/bfed894fe68b433aa22239777305ffdb/dpdk/mk/rte.subdir.mk:35: dpaa2] Error 2
make[5]: *** Waiting for unfinished jobs....
  CC sw_evdev_xstats.o
  CC timvf_probe.o
  CC otx2_tim_worker.o
  CC sw_evdev_selftest.o
--
  LD otx2_evdev.o
  AR librte_pmd_sw_event.a
  INSTALL-LIB librte_pmd_sw_event.a
  AR librte_pmd_octeontx2_event.a
  INSTALL-LIB librte_pmd_octeontx2_event.a
make[4]: *** [/tmp/SUSE15-64_K4.12.14_Clang5.0.1/x86_64-native-linuxapp-clang/bfed894fe68b433aa22239777305ffdb/dpdk/mk/rte.subdir.mk:37: event] Error 2
make[3]: *** [/tmp/SUSE15-64_K4.12.14_Clang5.0.1/x86_64-native-linuxapp-clang/bfed894fe68b433aa22239777305ffdb/dpdk/mk/rte.sdkbuild.mk:46: drivers] Error 2
make[2]: *** [/tmp/SUSE15-64_K4.12.14_Clang5.0.1/x86_64-native-linuxapp-clang/bfed894fe68b433aa22239777305ffdb/dpdk/mk/rte.sdkroot.mk:99: all] Error 2
make[1]: *** [/tmp/SUSE15-64_K4.12.14_Clang5.0.1/x86_64-native-linuxapp-clang/bfed894fe68b433aa22239777305ffdb/dpdk/mk/rte.sdkinstall.mk:61: pre_install] Error 2
make: *** [/tmp/SUSE15-64_K4.12.14_Clang5.0.1/x86_64-native-linuxapp-clang/bfed894fe68b433aa22239777305ffdb/dpdk/mk/rte.sdkroot.mk:77: install] Error 2


*Make Build Failed #5:
OS: CENTOS76-64
Target: x86_64-native-linuxapp-clang
^
/tmp/CENTOS76-64_K3.10.0_Clang3.4.2/x86_64-native-linuxapp-clang/bfed894fe68b433aa22239777305ffdb/dpdk/drivers/event/dpaa2/dpaa2_eventdev_selftest.c:255:1: error: unused function 'eventdev_setup_dequeue_timeout' [-Werror,-Wunused-function]
eventdev_setup_dequeue_timeout(void)
^
4 errors generated.
make[6]: *** [dpaa2_eventdev_selftest.o] Error 1
make[5]: *** [dpaa2] Error 2
make[5]: *** Waiting for unfinished jobs....
  CC otx2_evdev_selftest.o
  CC otx2_evdev_irq.o
  PMDINFO otx2_evdev.o.pmd.c
  CC otx2_evdev.o.pmd.o
--
  INSTALL-LIB librte_pmd_sw_event.a
  AR librte_pmd_opdl_event.a
  INSTALL-LIB librte_pmd_opdl_event.a
  AR librte_pmd_octeontx2_event.a
  INSTALL-LIB librte_pmd_octeontx2_event.a
make[4]: *** [event] Error 2
make[3]: *** [drivers] Error 2
make[2]: *** [all] Error 2
make[1]: *** [pre_install] Error 2
make: *** [install] Error 2


*Make Build Failed #6:
OS: CENTOS76-64
Target: x86_64-native-linuxapp-gcc+shared
dpaa2_eventdev_selftest.o: In function `_eventdev_setup':
dpaa2_eventdev_selftest.c:(.text+0x3bf0): undefined reference to `rte_pktmbuf_pool_create'
dpaa2_eventdev_selftest.o: In function `eventdev_teardown':
dpaa2_eventdev_selftest.c:(.text+0x410e): undefined reference to `rte_mempool_free'
collect2: error: ld returned 1 exit status
make[6]: *** [librte_pmd_dpaa2_event.so.2.1] Error 1
make[5]: *** [dpaa2] Error 2
make[5]: *** Waiting for unfinished jobs....
  CC ssovf_evdev.o
  CC opdl_evdev.o
  CC ssovf_evdev_selftest.o
  LD dpaa_eventdev.o
--
  LD otx2_evdev.o
  LD librte_pmd_sw_event.so.1.1
  INSTALL-LIB librte_pmd_sw_event.so.1.1
  LD librte_pmd_octeontx2_event.so.1.1
  INSTALL-LIB librte_pmd_octeontx2_event.so.1.1
make[4]: *** [event] Error 2
make[3]: *** [drivers] Error 2
make[2]: *** [all] Error 2
make[1]: *** [pre_install] Error 2
make: *** [install] Error 2

*Meson Build Failed #1:
OS: SUSE15-64
Target:build-gcc-static
[1321/1832] Compiling C object 'drivers/a715181@@tmp_rte_pmd_zlib at sta/compress_zlib_zlib_pmd.c.o'.
[1322/1832] Linking target drivers/librte_pmd_dpaa_event.so.1.1.
[1323/1832] Linking static target drivers/libtmp_rte_pmd_zlib.a.
[1324/1832] Generating rte_pmd_zlib.pmd.c with a custom command.
[1325/1832] Compiling C object 'drivers/a715181@@tmp_rte_pmd_dpaa2_event at sta/event_dpaa2_dpaa2_eventdev_selftest.c.o'.
FAILED: drivers/a715181@@tmp_rte_pmd_dpaa2_event at sta/event_dpaa2_dpaa2_eventdev_selftest.c.o 
clang -Idrivers/a715181@@tmp_rte_pmd_dpaa2_event at sta -Idrivers -I../drivers -Idrivers/event/dpaa2 -I../drivers/event/dpaa2 -Idrivers/event/dpaa2/../../crypto/dpaa2_sec/ -I../drivers/event/dpaa2/../../crypto/dpaa2_sec/ -Ilib/librte_eventdev -I../lib/librte_eventdev -I. -I../ -Iconfig -I../config -Ilib/librte_eal/common/include -I../lib/librte_eal/common/include -I../lib/librte_eal/linux/eal/include -Ilib/librte_eal/common -I../lib/librte_eal/common -Ilib/librte_eal/common/include/arch/x86 -I../lib/librte_eal/common/include/arch/x86 -Ilib/librte_eal -I../lib/librte_eal -Ilib/librte_kvargs -I../lib/librte_kvargs -Ilib/librte_ring -I../lib/librte_ring -Ilib/librte_ethdev -I../lib/librte_ethdev -Ilib/librte_net -I../lib/librte_net -Ilib/librte_mbuf -I../lib/librte_mbuf -Ilib/librte_mempool -I../lib/librte_mempool -Ilib/librte_meter -I../lib/librte_meter -Ilib/librte_hash -I../lib/librte_hash -Ilib/librte_timer -I../lib/librte_timer -Ilib/librte_cryptodev -I../lib/librte_cryptodev -Idrivers/bus/vdev -I../drivers/bus/vdev -Idrivers/net/dpaa2 -I../drivers/net/dpaa2 -I../drivers/net/dpaa2/base -I../drivers/net/dpaa2/mc -Idrivers/bus/pci -I../drivers/bus/pci -I../drivers/bus/pci/linux -Ilib/librte_pci -I../lib/librte_pci -Idrivers/mempool/dpaa2 -I../drivers/mempool/dpaa2 -Idrivers/bus/fslmc -I../drivers/bus/fslmc -I../drivers/bus/fslmc/mc -I../drivers/bus/fslmc/qbman/include -I../drivers/bus/fslmc/portal -Idrivers/common/dpaax -I../drivers/common/dpaax -Idrivers/crypto/dpaa2_sec -I../drivers/crypto/dpaa2_sec -I../drivers/crypto/dpaa2_sec/mc -I../drivers/crypto/dpaa2_sec/hw -Ilib/librte_security -I../lib/librte_security -Xclang -fcolor-diagnostics -pipe -D_FILE_OFFSET_BITS=64 -Wall -Winvalid-pch -Werror -O3 -include rte_config.h -Wunused-parameter -Wsign-compare -Wcast-qual -Wno-address-of-packed-member -D_GNU_SOURCE -fPIC -march=native -DALLOW_EXPERIMENTAL_API -MD -MQ 'drivers/a715181@@tmp_rte_pmd_dpaa2_event at sta/event_dpaa2_dpaa2_eventdev_selftest.c.o' -MF 'drivers/a715181@@tmp_rte_pmd_dpaa2_event at sta/event_dpaa2_dpaa2_eventdev_selftest.c.o.d' -o 'drivers/a715181@@tmp_rte_pmd_dpaa2_event at sta/event_dpaa2_dpaa2_eventdev_selftest.c.o' -c ../drivers/event/dpaa2/dpaa2_eventdev_selftest.c
../drivers/event/dpaa2/dpaa2_eventdev_selftest.c:63:1: error: unused function 'seqn_list_update' [-Werror,-Wunused-function]
seqn_list_update(int val)
^
../drivers/event/dpaa2/dpaa2_eventdev_selftest.c:74:1: error: unused function 'seqn_list_check' [-Werror,-Wunused-function]
--
[1328/1832] Compiling C object 'drivers/a715181@@tmp_rte_pmd_dpaa2_event at sta/event_dpaa2_dpaa2_eventdev.c.o'.
[1329/1832] Compiling C object 'drivers/a715181@@tmp_rte_pmd_octeontx2_event at sta/event_octeontx2_otx2_evdev_irq.c.o'.
[1330/1832] Compiling C object 'drivers/a715181@@tmp_rte_pmd_octeontx2_event at sta/event_octeontx2_otx2_evdev_adptr.c.o'.
[1331/1832] Compiling C object 'drivers/a715181@@tmp_rte_pmd_octeontx2_event at sta/event_octeontx2_otx2_evdev.c.o'.
[1332/1832] Compiling C object 'drivers/a715181@@tmp_rte_pmd_octeontx2_event at sta/event_octeontx2_otx2_worker_dual.c.o'.
ninja: build stopped: subcommand failed.
meson --werror -Dexamples=all --default-library=shared /tmp/SUSE15-64_K4.12.14_GCC7.3.1/x86_64-native-linuxapp-gcc/bfed894fe68b433aa22239777305ffdb/dpdk/devtools/.. build-clang-shared
The Meson build system
Version: 0.50.1
Source dir: /tmp/SUSE15-64_K4.12.14_GCC7.3.1/x86_64-native-linuxapp-gcc/bfed894fe68b433aa22239777305ffdb/dpdk
Build dir: /tmp/SUSE15-64_K4.12.14_GCC7.3.1/x86_64-native-linuxapp-gcc/bfed894fe68b433aa22239777305ffdb/dpdk/build-clang-shared
--
[1330/1853] Compiling C object 'drivers/a715181@@tmp_rte_pmd_zlib at sta/compress_zlib_zlib_pmd_ops.c.o'.
[1331/1853] Compiling C object 'drivers/a715181@@tmp_rte_pmd_qat at sta/crypto_qat_qat_asym.c.o'.
[1332/1853] Compiling C object 'drivers/a715181@@tmp_rte_pmd_qat at sta/compress_qat_qat_comp.c.o'.
[1333/1853] Linking static target drivers/libtmp_rte_pmd_qat.a.
[1334/1853] Compiling C object 'drivers/a715181@@tmp_rte_pmd_dpaa2_event at sta/event_dpaa2_dpaa2_eventdev_selftest.c.o'.
FAILED: drivers/a715181@@tmp_rte_pmd_dpaa2_event at sta/event_dpaa2_dpaa2_eventdev_selftest.c.o 
clang -Idrivers/a715181@@tmp_rte_pmd_dpaa2_event at sta -Idrivers -I../drivers -Idrivers/event/dpaa2 -I../drivers/event/dpaa2 -Idrivers/event/dpaa2/../../crypto/dpaa2_sec/ -I../drivers/event/dpaa2/../../crypto/dpaa2_sec/ -Ilib/librte_eventdev -I../lib/librte_eventdev -I. -I../ -Iconfig -I../config -Ilib/librte_eal/common/include -I../lib/librte_eal/common/include -I../lib/librte_eal/linux/eal/include -Ilib/librte_eal/common -I../lib/librte_eal/common -Ilib/librte_eal/common/include/arch/x86 -I../lib/librte_eal/common/include/arch/x86 -Ilib/librte_eal -I../lib/librte_eal -Ilib/librte_kvargs -I../lib/librte_kvargs -Ilib/librte_ring -I../lib/librte_ring -Ilib/librte_ethdev -I../lib/librte_ethdev -Ilib/librte_net -I../lib/librte_net -Ilib/librte_mbuf -I../lib/librte_mbuf -Ilib/librte_mempool -I../lib/librte_mempool -Ilib/librte_meter -I../lib/librte_meter -Ilib/librte_hash -I../lib/librte_hash -Ilib/librte_timer -I../lib/librte_timer -Ilib/librte_cryptodev -I../lib/librte_cryptodev -Idrivers/bus/vdev -I../drivers/bus/vdev -Idrivers/net/dpaa2 -I../drivers/net/dpaa2 -I../drivers/net/dpaa2/base -I../drivers/net/dpaa2/mc -Idrivers/bus/pci -I../drivers/bus/pci -I../drivers/bus/pci/linux -Ilib/librte_pci -I../lib/librte_pci -Idrivers/mempool/dpaa2 -I../drivers/mempool/dpaa2 -Idrivers/bus/fslmc -I../drivers/bus/fslmc -I../drivers/bus/fslmc/mc -I../drivers/bus/fslmc/qbman/include -I../drivers/bus/fslmc/portal -Idrivers/common/dpaax -I../drivers/common/dpaax -Idrivers/crypto/dpaa2_sec -I../drivers/crypto/dpaa2_sec -I../drivers/crypto/dpaa2_sec/mc -I../drivers/crypto/dpaa2_sec/hw -Ilib/librte_security -I../lib/librte_security -Xclang -fcolor-diagnostics -pipe -D_FILE_OFFSET_BITS=64 -Wall -Winvalid-pch -Werror -O3 -include rte_config.h -Wunused-parameter -Wsign-compare -Wcast-qual -Wno-address-of-packed-member -D_GNU_SOURCE -fPIC -march=native -DALLOW_EXPERIMENTAL_API -MD -MQ 'drivers/a715181@@tmp_rte_pmd_dpaa2_event at sta/event_dpaa2_dpaa2_eventdev_selftest.c.o' -MF 'drivers/a715181@@tmp_rte_pmd_dpaa2_event at sta/event_dpaa2_dpaa2_eventdev_selftest.c.o.d' -o 'drivers/a715181@@tmp_rte_pmd_dpaa2_event at sta/event_dpaa2_dpaa2_eventdev_selftest.c.o' -c ../drivers/event/dpaa2/dpaa2_eventdev_selftest.c
../drivers/event/dpaa2/dpaa2_eventdev_selftest.c:63:1: error: unused function 'seqn_list_update' [-Werror,-Wunused-function]
seqn_list_update(int val)
^
../drivers/event/dpaa2/dpaa2_eventdev_selftest.c:74:1: error: unused function 'seqn_list_check' [-Werror,-Wunused-function]
--
[1337/1853] Compiling C object 'drivers/a715181@@tmp_rte_pmd_octeontx2_event at sta/event_octeontx2_otx2_evdev_irq.c.o'.
[1338/1853] Compiling C object 'drivers/a715181@@tmp_rte_pmd_dpaa_event at sta/event_dpaa_dpaa_eventdev.c.o'.
[1339/1853] Compiling C object 'drivers/a715181@@tmp_rte_pmd_dpaa2_event at sta/event_dpaa2_dpaa2_hw_dpcon.c.o'.
[1340/1853] Compiling C object 'drivers/a715181@@tmp_rte_pmd_dpaa2_event at sta/event_dpaa2_dpaa2_eventdev.c.o'.
[1341/1853] Compiling C object 'drivers/a715181@@tmp_rte_pmd_octeontx2_event at sta/event_octeontx2_otx2_evdev.c.o'.
ninja: build stopped: subcommand failed.
meson --werror -Dexamples=all -Dlibdir=lib -Dmachine=nehalem --default-library=shared /tmp/SUSE15-64_K4.12.14_GCC7.3.1/x86_64-native-linuxapp-gcc/bfed894fe68b433aa22239777305ffdb/dpdk/devtools/.. build-x86-default
The Meson build system
Version: 0.50.1
Source dir: /tmp/SUSE15-64_K4.12.14_GCC7.3.1/x86_64-native-linuxapp-gcc/bfed894fe68b433aa22239777305ffdb/dpdk
Build dir: /tmp/SUSE15-64_K4.12.14_GCC7.3.1/x86_64-native-linuxapp-gcc/bfed894fe68b433aa22239777305ffdb/dpdk/build-x86-default


*Meson Build Failed #2:
OS: FC30-64
Target:build-gcc-static
[1260/1785] Compiling C object 'drivers/a715181@@rte_pmd_qat at sta/meson-generated_.._rte_pmd_qat.pmd.c.o'.
[1261/1785] Linking static target drivers/librte_pmd_qat.a.
[1262/1785] Compiling C object 'drivers/a715181@@rte_pmd_qat at sha/meson-generated_.._rte_pmd_qat.pmd.c.o'.
[1263/1785] Linking target drivers/librte_pmd_dpaa2_sec.so.2.1.
[1264/1785] Compiling C object 'drivers/a715181@@tmp_rte_pmd_dpaa2_event at sta/event_dpaa2_dpaa2_eventdev_selftest.c.o'.
FAILED: drivers/a715181@@tmp_rte_pmd_dpaa2_event at sta/event_dpaa2_dpaa2_eventdev_selftest.c.o 
clang -Idrivers/a715181@@tmp_rte_pmd_dpaa2_event at sta -Idrivers -I../drivers -Idrivers/event/dpaa2 -I../drivers/event/dpaa2 -Idrivers/event/dpaa2/../../crypto/dpaa2_sec/ -I../drivers/event/dpaa2/../../crypto/dpaa2_sec/ -Ilib/librte_eventdev -I../lib/librte_eventdev -I. -I../ -Iconfig -I../config -Ilib/librte_eal/common/include -I../lib/librte_eal/common/include -I../lib/librte_eal/linux/eal/include -Ilib/librte_eal/common -I../lib/librte_eal/common -Ilib/librte_eal/common/include/arch/x86 -I../lib/librte_eal/common/include/arch/x86 -Ilib/librte_eal -I../lib/librte_eal -Ilib/librte_kvargs -I../lib/librte_kvargs -Ilib/librte_ring -I../lib/librte_ring -Ilib/librte_ethdev -I../lib/librte_ethdev -Ilib/librte_net -I../lib/librte_net -Ilib/librte_mbuf -I../lib/librte_mbuf -Ilib/librte_mempool -I../lib/librte_mempool -Ilib/librte_meter -I../lib/librte_meter -Ilib/librte_hash -I../lib/librte_hash -Ilib/librte_timer -I../lib/librte_timer -Ilib/librte_cryptodev -I../lib/librte_cryptodev -Idrivers/bus/vdev -I../drivers/bus/vdev -Idrivers/net/dpaa2 -I../drivers/net/dpaa2 -I../drivers/net/dpaa2/base -I../drivers/net/dpaa2/mc -Idrivers/bus/pci -I../drivers/bus/pci -I../drivers/bus/pci/linux -Ilib/librte_pci -I../lib/librte_pci -Idrivers/mempool/dpaa2 -I../drivers/mempool/dpaa2 -Idrivers/bus/fslmc -I../drivers/bus/fslmc -I../drivers/bus/fslmc/mc -I../drivers/bus/fslmc/qbman/include -I../drivers/bus/fslmc/portal -Idrivers/common/dpaax -I../drivers/common/dpaax -Idrivers/crypto/dpaa2_sec -I../drivers/crypto/dpaa2_sec -I../drivers/crypto/dpaa2_sec/mc -I../drivers/crypto/dpaa2_sec/hw -Ilib/librte_security -I../lib/librte_security -Xclang -fcolor-diagnostics -pipe -D_FILE_OFFSET_BITS=64 -Wall -Winvalid-pch -Werror -O3 -include rte_config.h -Wunused-parameter -Wsign-compare -Wcast-qual -Wno-address-of-packed-member -D_GNU_SOURCE -fPIC -march=native -mno-avx512f -DALLOW_EXPERIMENTAL_API -MD -MQ 'drivers/a715181@@tmp_rte_pmd_dpaa2_event at sta/event_dpaa2_dpaa2_eventdev_selftest.c.o' -MF 'drivers/a715181@@tmp_rte_pmd_dpaa2_event at sta/event_dpaa2_dpaa2_eventdev_selftest.c.o.d' -o 'drivers/a715181@@tmp_rte_pmd_dpaa2_event at sta/event_dpaa2_dpaa2_eventdev_selftest.c.o' -c ../drivers/event/dpaa2/dpaa2_eventdev_selftest.c
../drivers/event/dpaa2/dpaa2_eventdev_selftest.c:63:1: error: unused function 'seqn_list_update' [-Werror,-Wunused-function]
seqn_list_update(int val)
^
../drivers/event/dpaa2/dpaa2_eventdev_selftest.c:74:1: error: unused function 'seqn_list_check' [-Werror,-Wunused-function]
--
[1267/1785] Generating symbol file 'drivers/a715181@@rte_pmd_dpaa2_sec at sha/librte_pmd_dpaa2_sec.so.2.1.symbols'.
[1268/1785] Compiling C object 'drivers/a715181@@tmp_rte_pmd_dpaa_event at sta/event_dpaa_dpaa_eventdev.c.o'.
[1269/1785] Compiling C object 'drivers/a715181@@tmp_rte_pmd_octeontx2_event at sta/event_octeontx2_otx2_evdev_irq.c.o'.
[1270/1785] Compiling C object 'drivers/a715181@@tmp_rte_pmd_octeontx2_event at sta/event_octeontx2_otx2_evdev.c.o'.
[1271/1785] Compiling C object 'drivers/a715181@@tmp_rte_pmd_octeontx2_event at sta/event_octeontx2_otx2_evdev_adptr.c.o'.
ninja: build stopped: subcommand failed.
meson --werror -Dexamples=all --default-library=shared /tmp/FC30-64_K4.20_GCC9.1.1/x86_64-native-linuxapp-gcc/bfed894fe68b433aa22239777305ffdb/dpdk/devtools/.. build-clang-shared
The Meson build system
Version: 0.50.1
Source dir: /tmp/FC30-64_K4.20_GCC9.1.1/x86_64-native-linuxapp-gcc/bfed894fe68b433aa22239777305ffdb/dpdk
Build dir: /tmp/FC30-64_K4.20_GCC9.1.1/x86_64-native-linuxapp-gcc/bfed894fe68b433aa22239777305ffdb/dpdk/build-clang-shared
--
[1279/1806] Linking target drivers/librte_pmd_dpaa2_sec.so.2.1.
[1280/1806] Generating rte_pmd_qat.pmd.c with a custom command.
[1281/1806] Compiling C object 'drivers/a715181@@rte_pmd_qat at sha/meson-generated_.._rte_pmd_qat.pmd.c.o'.
[1282/1806] Compiling C object 'drivers/a715181@@tmp_rte_pmd_dpaa2_event at sta/event_dpaa2_dpaa2_eventdev.c.o'.
[1283/1806] Compiling C object 'drivers/a715181@@tmp_rte_pmd_dpaa2_event at sta/event_dpaa2_dpaa2_eventdev_selftest.c.o'.
FAILED: drivers/a715181@@tmp_rte_pmd_dpaa2_event at sta/event_dpaa2_dpaa2_eventdev_selftest.c.o 
clang -Idrivers/a715181@@tmp_rte_pmd_dpaa2_event at sta -Idrivers -I../drivers -Idrivers/event/dpaa2 -I../drivers/event/dpaa2 -Idrivers/event/dpaa2/../../crypto/dpaa2_sec/ -I../drivers/event/dpaa2/../../crypto/dpaa2_sec/ -Ilib/librte_eventdev -I../lib/librte_eventdev -I. -I../ -Iconfig -I../config -Ilib/librte_eal/common/include -I../lib/librte_eal/common/include -I../lib/librte_eal/linux/eal/include -Ilib/librte_eal/common -I../lib/librte_eal/common -Ilib/librte_eal/common/include/arch/x86 -I../lib/librte_eal/common/include/arch/x86 -Ilib/librte_eal -I../lib/librte_eal -Ilib/librte_kvargs -I../lib/librte_kvargs -Ilib/librte_ring -I../lib/librte_ring -Ilib/librte_ethdev -I../lib/librte_ethdev -Ilib/librte_net -I../lib/librte_net -Ilib/librte_mbuf -I../lib/librte_mbuf -Ilib/librte_mempool -I../lib/librte_mempool -Ilib/librte_meter -I../lib/librte_meter -Ilib/librte_hash -I../lib/librte_hash -Ilib/librte_timer -I../lib/librte_timer -Ilib/librte_cryptodev -I../lib/librte_cryptodev -Idrivers/bus/vdev -I../drivers/bus/vdev -Idrivers/net/dpaa2 -I../drivers/net/dpaa2 -I../drivers/net/dpaa2/base -I../drivers/net/dpaa2/mc -Idrivers/bus/pci -I../drivers/bus/pci -I../drivers/bus/pci/linux -Ilib/librte_pci -I../lib/librte_pci -Idrivers/mempool/dpaa2 -I../drivers/mempool/dpaa2 -Idrivers/bus/fslmc -I../drivers/bus/fslmc -I../drivers/bus/fslmc/mc -I../drivers/bus/fslmc/qbman/include -I../drivers/bus/fslmc/portal -Idrivers/common/dpaax -I../drivers/common/dpaax -Idrivers/crypto/dpaa2_sec -I../drivers/crypto/dpaa2_sec -I../drivers/crypto/dpaa2_sec/mc -I../drivers/crypto/dpaa2_sec/hw -Ilib/librte_security -I../lib/librte_security -Xclang -fcolor-diagnostics -pipe -D_FILE_OFFSET_BITS=64 -Wall -Winvalid-pch -Werror -O3 -include rte_config.h -Wunused-parameter -Wsign-compare -Wcast-qual -Wno-address-of-packed-member -D_GNU_SOURCE -fPIC -march=native -mno-avx512f -DALLOW_EXPERIMENTAL_API -MD -MQ 'drivers/a715181@@tmp_rte_pmd_dpaa2_event at sta/event_dpaa2_dpaa2_eventdev_selftest.c.o' -MF 'drivers/a715181@@tmp_rte_pmd_dpaa2_event at sta/event_dpaa2_dpaa2_eventdev_selftest.c.o.d' -o 'drivers/a715181@@tmp_rte_pmd_dpaa2_event at sta/event_dpaa2_dpaa2_eventdev_selftest.c.o' -c ../drivers/event/dpaa2/dpaa2_eventdev_selftest.c
../drivers/event/dpaa2/dpaa2_eventdev_selftest.c:63:1: error: unused function 'seqn_list_update' [-Werror,-Wunused-function]
seqn_list_update(int val)
^
../drivers/event/dpaa2/dpaa2_eventdev_selftest.c:74:1: error: unused function 'seqn_list_check' [-Werror,-Wunused-function]
--
[1286/1806] Compiling C object 'drivers/a715181@@tmp_rte_pmd_dpaa_event at sta/event_dpaa_dpaa_eventdev.c.o'.
[1287/1806] Generating symbol file 'drivers/a715181@@rte_pmd_dpaa2_sec at sha/librte_pmd_dpaa2_sec.so.2.1.symbols'.
[1288/1806] Compiling C object 'drivers/a715181@@tmp_rte_pmd_octeontx2_event at sta/event_octeontx2_otx2_evdev_irq.c.o'.
[1289/1806] Compiling C object 'drivers/a715181@@tmp_rte_pmd_octeontx_crypto at sta/crypto_octeontx_otx_cryptodev_ops.c.o'.
[1290/1806] Compiling C object 'drivers/a715181@@tmp_rte_pmd_octeontx2_event at sta/event_octeontx2_otx2_evdev.c.o'.
ninja: build stopped: subcommand failed.
meson --werror -Dexamples=all -Dlibdir=lib -Dmachine=nehalem --default-library=shared /tmp/FC30-64_K4.20_GCC9.1.1/x86_64-native-linuxapp-gcc/bfed894fe68b433aa22239777305ffdb/dpdk/devtools/.. build-x86-default
The Meson build system
Version: 0.50.1
Source dir: /tmp/FC30-64_K4.20_GCC9.1.1/x86_64-native-linuxapp-gcc/bfed894fe68b433aa22239777305ffdb/dpdk
Build dir: /tmp/FC30-64_K4.20_GCC9.1.1/x86_64-native-linuxapp-gcc/bfed894fe68b433aa22239777305ffdb/dpdk/build-x86-default


*Meson Build Failed #3:
OS: UB1604-32
Target:build-gcc-static
[1143/1657] Generating rte_pmd_dpaa_event.pmd.c with a custom command.
[1144/1657] Compiling C object 'drivers/a715181@@rte_pmd_dpaa_event at sta/meson-generated_.._rte_pmd_dpaa_event.pmd.c.o'.
[1145/1657] Linking static target drivers/librte_pmd_dpaa_event.a.
[1146/1657] Compiling C object 'drivers/a715181@@rte_pmd_dpaa_event at sha/meson-generated_.._rte_pmd_dpaa_event.pmd.c.o'.
[1147/1657] Compiling C object 'drivers/a715181@@tmp_rte_pmd_dpaa2_event at sta/event_dpaa2_dpaa2_eventdev_selftest.c.o'.
FAILED: drivers/a715181@@tmp_rte_pmd_dpaa2_event at sta/event_dpaa2_dpaa2_eventdev_selftest.c.o 
clang -Idrivers/a715181@@tmp_rte_pmd_dpaa2_event at sta -Idrivers -I../drivers -Idrivers/event/dpaa2 -I../drivers/event/dpaa2 -Idrivers/event/dpaa2/../../crypto/dpaa2_sec/ -I../drivers/event/dpaa2/../../crypto/dpaa2_sec/ -Ilib/librte_eventdev -I../lib/librte_eventdev -I. -I../ -Iconfig -I../config -Ilib/librte_eal/common/include -I../lib/librte_eal/common/include -I../lib/librte_eal/linux/eal/include -Ilib/librte_eal/common -I../lib/librte_eal/common -Ilib/librte_eal/common/include/arch/x86 -I../lib/librte_eal/common/include/arch/x86 -Ilib/librte_eal -I../lib/librte_eal -Ilib/librte_kvargs -I../lib/librte_kvargs -Ilib/librte_ring -I../lib/librte_ring -Ilib/librte_ethdev -I../lib/librte_ethdev -Ilib/librte_net -I../lib/librte_net -Ilib/librte_mbuf -I../lib/librte_mbuf -Ilib/librte_mempool -I../lib/librte_mempool -Ilib/librte_meter -I../lib/librte_meter -Ilib/librte_hash -I../lib/librte_hash -Ilib/librte_timer -I../lib/librte_timer -Ilib/librte_cryptodev -I../lib/librte_cryptodev -Idrivers/bus/vdev -I../drivers/bus/vdev -Idrivers/net/dpaa2 -I../drivers/net/dpaa2 -I../drivers/net/dpaa2/base -I../drivers/net/dpaa2/mc -Idrivers/bus/pci -I../drivers/bus/pci -I../drivers/bus/pci/linux -Ilib/librte_pci -I../lib/librte_pci -Idrivers/mempool/dpaa2 -I../drivers/mempool/dpaa2 -Idrivers/bus/fslmc -I../drivers/bus/fslmc -I../drivers/bus/fslmc/mc -I../drivers/bus/fslmc/qbman/include -I../drivers/bus/fslmc/portal -Idrivers/common/dpaax -I../drivers/common/dpaax -Idrivers/crypto/dpaa2_sec -I../drivers/crypto/dpaa2_sec -I../drivers/crypto/dpaa2_sec/mc -I../drivers/crypto/dpaa2_sec/hw -Ilib/librte_security -I../lib/librte_security -Xclang -fcolor-diagnostics -pipe -D_FILE_OFFSET_BITS=64 -Wall -Winvalid-pch -Werror -O3 -include rte_config.h -Wunused-parameter -Wsign-compare -Wcast-qual -Wno-pointer-to-int-cast -D_GNU_SOURCE -fPIC -march=native -DALLOW_EXPERIMENTAL_API -MD -MQ 'drivers/a715181@@tmp_rte_pmd_dpaa2_event at sta/event_dpaa2_dpaa2_eventdev_selftest.c.o' -MF 'drivers/a715181@@tmp_rte_pmd_dpaa2_event at sta/event_dpaa2_dpaa2_eventdev_selftest.c.o.d' -o 'drivers/a715181@@tmp_rte_pmd_dpaa2_event at sta/event_dpaa2_dpaa2_eventdev_selftest.c.o' -c ../drivers/event/dpaa2/dpaa2_eventdev_selftest.c
../drivers/event/dpaa2/dpaa2_eventdev_selftest.c:63:1: error: unused function 'seqn_list_update' [-Werror,-Wunused-function]
seqn_list_update(int val)
^
../drivers/event/dpaa2/dpaa2_eventdev_selftest.c:74:1: error: unused function 'seqn_list_check' [-Werror,-Wunused-function]
--
[1148/1657] Compiling C object 'drivers/a715181@@tmp_rte_pmd_dpaa2_event at sta/event_dpaa2_dpaa2_eventdev.c.o'.
[1149/1657] Linking target drivers/librte_pmd_dpaa_event.so.1.1.
[1150/1657] Compiling C object 'drivers/a715181@@tmp_rte_pmd_octeontx_crypto at sta/crypto_octeontx_otx_cryptodev_ops.c.o'.
[1151/1657] Compiling C object 'drivers/a715181@@tmp_rte_pmd_octeontx2_event at sta/event_octeontx2_otx2_evdev.c.o'.
[1152/1657] Compiling C object 'drivers/a715181@@tmp_rte_pmd_octeontx2_event at sta/event_octeontx2_otx2_worker_dual.c.o'.
ninja: build stopped: subcommand failed.
meson --werror -Dexamples=all --default-library=shared /tmp/UB1604-32_K4.4.0_GCC5.4.0/i686-native-linuxapp-gcc/bfed894fe68b433aa22239777305ffdb/dpdk/devtools/.. build-clang-shared
The Meson build system
Version: 0.50.1
Source dir: /tmp/UB1604-32_K4.4.0_GCC5.4.0/i686-native-linuxapp-gcc/bfed894fe68b433aa22239777305ffdb/dpdk
Build dir: /tmp/UB1604-32_K4.4.0_GCC5.4.0/i686-native-linuxapp-gcc/bfed894fe68b433aa22239777305ffdb/dpdk/build-clang-shared
--
[1175/1678] Linking static target drivers/librte_pmd_octeontx_crypto.a.
[1176/1678] Linking target drivers/librte_pmd_octeontx_crypto.so.1.1.
[1177/1678] Linking target drivers/librte_pmd_dpaa_event.so.1.1.
[1178/1678] Compiling C object 'drivers/a715181@@tmp_rte_pmd_dpaa2_event at sta/event_dpaa2_dpaa2_eventdev.c.o'.
[1179/1678] Compiling C object 'drivers/a715181@@tmp_rte_pmd_dpaa2_event at sta/event_dpaa2_dpaa2_eventdev_selftest.c.o'.
FAILED: drivers/a715181@@tmp_rte_pmd_dpaa2_event at sta/event_dpaa2_dpaa2_eventdev_selftest.c.o 
clang -Idrivers/a715181@@tmp_rte_pmd_dpaa2_event at sta -Idrivers -I../drivers -Idrivers/event/dpaa2 -I../drivers/event/dpaa2 -Idrivers/event/dpaa2/../../crypto/dpaa2_sec/ -I../drivers/event/dpaa2/../../crypto/dpaa2_sec/ -Ilib/librte_eventdev -I../lib/librte_eventdev -I. -I../ -Iconfig -I../config -Ilib/librte_eal/common/include -I../lib/librte_eal/common/include -I../lib/librte_eal/linux/eal/include -Ilib/librte_eal/common -I../lib/librte_eal/common -Ilib/librte_eal/common/include/arch/x86 -I../lib/librte_eal/common/include/arch/x86 -Ilib/librte_eal -I../lib/librte_eal -Ilib/librte_kvargs -I../lib/librte_kvargs -Ilib/librte_ring -I../lib/librte_ring -Ilib/librte_ethdev -I../lib/librte_ethdev -Ilib/librte_net -I../lib/librte_net -Ilib/librte_mbuf -I../lib/librte_mbuf -Ilib/librte_mempool -I../lib/librte_mempool -Ilib/librte_meter -I../lib/librte_meter -Ilib/librte_hash -I../lib/librte_hash -Ilib/librte_timer -I../lib/librte_timer -Ilib/librte_cryptodev -I../lib/librte_cryptodev -Idrivers/bus/vdev -I../drivers/bus/vdev -Idrivers/net/dpaa2 -I../drivers/net/dpaa2 -I../drivers/net/dpaa2/base -I../drivers/net/dpaa2/mc -Idrivers/bus/pci -I../drivers/bus/pci -I../drivers/bus/pci/linux -Ilib/librte_pci -I../lib/librte_pci -Idrivers/mempool/dpaa2 -I../drivers/mempool/dpaa2 -Idrivers/bus/fslmc -I../drivers/bus/fslmc -I../drivers/bus/fslmc/mc -I../drivers/bus/fslmc/qbman/include -I../drivers/bus/fslmc/portal -Idrivers/common/dpaax -I../drivers/common/dpaax -Idrivers/crypto/dpaa2_sec -I../drivers/crypto/dpaa2_sec -I../drivers/crypto/dpaa2_sec/mc -I../drivers/crypto/dpaa2_sec/hw -Ilib/librte_security -I../lib/librte_security -Xclang -fcolor-diagnostics -pipe -D_FILE_OFFSET_BITS=64 -Wall -Winvalid-pch -Werror -O3 -include rte_config.h -Wunused-parameter -Wsign-compare -Wcast-qual -Wno-pointer-to-int-cast -D_GNU_SOURCE -fPIC -march=native -DALLOW_EXPERIMENTAL_API -MD -MQ 'drivers/a715181@@tmp_rte_pmd_dpaa2_event at sta/event_dpaa2_dpaa2_eventdev_selftest.c.o' -MF 'drivers/a715181@@tmp_rte_pmd_dpaa2_event at sta/event_dpaa2_dpaa2_eventdev_selftest.c.o.d' -o 'drivers/a715181@@tmp_rte_pmd_dpaa2_event at sta/event_dpaa2_dpaa2_eventdev_selftest.c.o' -c ../drivers/event/dpaa2/dpaa2_eventdev_selftest.c
../drivers/event/dpaa2/dpaa2_eventdev_selftest.c:63:1: error: unused function 'seqn_list_update' [-Werror,-Wunused-function]
seqn_list_update(int val)
^
../drivers/event/dpaa2/dpaa2_eventdev_selftest.c:74:1: error: unused function 'seqn_list_check' [-Werror,-Wunused-function]
--
[1180/1678] Compiling C object 'drivers/a715181@@tmp_rte_pmd_octeontx2_event at sta/event_octeontx2_otx2_evdev_adptr.c.o'.
[1181/1678] Compiling C object 'drivers/a715181@@tmp_rte_pmd_octeontx2_event at sta/event_octeontx2_otx2_evdev_irq.c.o'.
[1182/1678] Compiling C object 'drivers/a715181@@tmp_rte_pmd_octeontx2_event at sta/event_octeontx2_otx2_evdev.c.o'.
[1183/1678] Compiling C object 'drivers/a715181@@tmp_rte_pmd_octeontx2_event at sta/event_octeontx2_otx2_worker.c.o'.
[1184/1678] Compiling C object 'drivers/a715181@@tmp_rte_pmd_octeontx2_event at sta/event_octeontx2_otx2_worker_dual.c.o'.
ninja: build stopped: subcommand failed.
meson --werror -Dexamples=all -Dlibdir=lib -Dmachine=nehalem --default-library=shared /tmp/UB1604-32_K4.4.0_GCC5.4.0/i686-native-linuxapp-gcc/bfed894fe68b433aa22239777305ffdb/dpdk/devtools/.. build-x86-default
The Meson build system
Version: 0.50.1
Source dir: /tmp/UB1604-32_K4.4.0_GCC5.4.0/i686-native-linuxapp-gcc/bfed894fe68b433aa22239777305ffdb/dpdk
Build dir: /tmp/UB1604-32_K4.4.0_GCC5.4.0/i686-native-linuxapp-gcc/bfed894fe68b433aa22239777305ffdb/dpdk/build-x86-default


*Meson Build Failed #4:
OS: UB1804-64
Target:build-gcc-static
[1271/1792] Compiling C object 'drivers/a715181@@rte_pmd_qat at sta/meson-generated_.._rte_pmd_qat.pmd.c.o'.
[1272/1792] Compiling C object 'drivers/a715181@@tmp_rte_pmd_dpaa_event at sta/event_dpaa_dpaa_eventdev.c.o'.
[1273/1792] Linking static target drivers/librte_pmd_qat.a.
[1274/1792] Compiling C object 'drivers/a715181@@rte_pmd_zlib at sta/meson-generated_.._rte_pmd_zlib.pmd.c.o'.
[1275/1792] Compiling C object 'drivers/a715181@@tmp_rte_pmd_dpaa2_event at sta/event_dpaa2_dpaa2_eventdev_selftest.c.o'.
FAILED: drivers/a715181@@tmp_rte_pmd_dpaa2_event at sta/event_dpaa2_dpaa2_eventdev_selftest.c.o 
clang -Idrivers/a715181@@tmp_rte_pmd_dpaa2_event at sta -Idrivers -I../drivers -Idrivers/event/dpaa2 -I../drivers/event/dpaa2 -Idrivers/event/dpaa2/../../crypto/dpaa2_sec/ -I../drivers/event/dpaa2/../../crypto/dpaa2_sec/ -Ilib/librte_eventdev -I../lib/librte_eventdev -I. -I../ -Iconfig -I../config -Ilib/librte_eal/common/include -I../lib/librte_eal/common/include -I../lib/librte_eal/linux/eal/include -Ilib/librte_eal/common -I../lib/librte_eal/common -Ilib/librte_eal/common/include/arch/x86 -I../lib/librte_eal/common/include/arch/x86 -Ilib/librte_eal -I../lib/librte_eal -Ilib/librte_kvargs -I../lib/librte_kvargs -Ilib/librte_ring -I../lib/librte_ring -Ilib/librte_ethdev -I../lib/librte_ethdev -Ilib/librte_net -I../lib/librte_net -Ilib/librte_mbuf -I../lib/librte_mbuf -Ilib/librte_mempool -I../lib/librte_mempool -Ilib/librte_meter -I../lib/librte_meter -Ilib/librte_hash -I../lib/librte_hash -Ilib/librte_timer -I../lib/librte_timer -Ilib/librte_cryptodev -I../lib/librte_cryptodev -Idrivers/bus/vdev -I../drivers/bus/vdev -Idrivers/net/dpaa2 -I../drivers/net/dpaa2 -I../drivers/net/dpaa2/base -I../drivers/net/dpaa2/mc -Idrivers/bus/pci -I../drivers/bus/pci -I../drivers/bus/pci/linux -Ilib/librte_pci -I../lib/librte_pci -Idrivers/mempool/dpaa2 -I../drivers/mempool/dpaa2 -Idrivers/bus/fslmc -I../drivers/bus/fslmc -I../drivers/bus/fslmc/mc -I../drivers/bus/fslmc/qbman/include -I../drivers/bus/fslmc/portal -Idrivers/common/dpaax -I../drivers/common/dpaax -Idrivers/crypto/dpaa2_sec -I../drivers/crypto/dpaa2_sec -I../drivers/crypto/dpaa2_sec/mc -I../drivers/crypto/dpaa2_sec/hw -Ilib/librte_security -I../lib/librte_security -Xclang -fcolor-diagnostics -pipe -D_FILE_OFFSET_BITS=64 -Wall -Winvalid-pch -Werror -O3 -include rte_config.h -Wunused-parameter -Wsign-compare -Wcast-qual -Wno-address-of-packed-member -D_GNU_SOURCE -fPIC -march=native -mno-avx512f -DALLOW_EXPERIMENTAL_API -MD -MQ 'drivers/a715181@@tmp_rte_pmd_dpaa2_event at sta/event_dpaa2_dpaa2_eventdev_selftest.c.o' -MF 'drivers/a715181@@tmp_rte_pmd_dpaa2_event at sta/event_dpaa2_dpaa2_eventdev_selftest.c.o.d' -o 'drivers/a715181@@tmp_rte_pmd_dpaa2_event at sta/event_dpaa2_dpaa2_eventdev_selftest.c.o' -c ../drivers/event/dpaa2/dpaa2_eventdev_selftest.c
../drivers/event/dpaa2/dpaa2_eventdev_selftest.c:63:1: error: unused function 'seqn_list_update' [-Werror,-Wunused-function]
seqn_list_update(int val)
^
../drivers/event/dpaa2/dpaa2_eventdev_selftest.c:74:1: error: unused function 'seqn_list_check' [-Werror,-Wunused-function]
--
[1276/1792] Linking static target drivers/libtmp_rte_pmd_dpaa_event.a.
[1277/1792] Linking static target drivers/librte_pmd_zlib.a.
[1278/1792] Linking target drivers/librte_pmd_qat.so.1.1.
[1279/1792] Compiling C object 'drivers/a715181@@rte_pmd_zlib at sha/meson-generated_.._rte_pmd_zlib.pmd.c.o'.
[1280/1792] Compiling C object 'drivers/a715181@@tmp_rte_pmd_dpaa2_event at sta/event_dpaa2_dpaa2_eventdev.c.o'.
ninja: build stopped: subcommand failed.
meson --werror -Dexamples=all --default-library=shared /tmp/UB1804-64_K4.15.0_GCC7.3.0/x86_64-native-linuxapp-gcc/bfed894fe68b433aa22239777305ffdb/dpdk/devtools/.. build-clang-shared
The Meson build system
Version: 0.50.0
Source dir: /tmp/UB1804-64_K4.15.0_GCC7.3.0/x86_64-native-linuxapp-gcc/bfed894fe68b433aa22239777305ffdb/dpdk
Build dir: /tmp/UB1804-64_K4.15.0_GCC7.3.0/x86_64-native-linuxapp-gcc/bfed894fe68b433aa22239777305ffdb/dpdk/build-clang-shared
--
[1299/1813] Compiling C object 'drivers/a715181@@rte_pmd_zlib at sha/meson-generated_.._rte_pmd_zlib.pmd.c.o'.
[1300/1813] Linking static target drivers/libtmp_rte_pmd_dpaa_event.a.
[1301/1813] Compiling C object 'drivers/a715181@@tmp_rte_pmd_dpaa2_event at sta/event_dpaa2_dpaa2_hw_dpcon.c.o'.
[1302/1813] Generating rte_pmd_dpaa_event.pmd.c with a custom command.
[1303/1813] Compiling C object 'drivers/a715181@@tmp_rte_pmd_dpaa2_event at sta/event_dpaa2_dpaa2_eventdev_selftest.c.o'.
FAILED: drivers/a715181@@tmp_rte_pmd_dpaa2_event at sta/event_dpaa2_dpaa2_eventdev_selftest.c.o 
clang -Idrivers/a715181@@tmp_rte_pmd_dpaa2_event at sta -Idrivers -I../drivers -Idrivers/event/dpaa2 -I../drivers/event/dpaa2 -Idrivers/event/dpaa2/../../crypto/dpaa2_sec/ -I../drivers/event/dpaa2/../../crypto/dpaa2_sec/ -Ilib/librte_eventdev -I../lib/librte_eventdev -I. -I../ -Iconfig -I../config -Ilib/librte_eal/common/include -I../lib/librte_eal/common/include -I../lib/librte_eal/linux/eal/include -Ilib/librte_eal/common -I../lib/librte_eal/common -Ilib/librte_eal/common/include/arch/x86 -I../lib/librte_eal/common/include/arch/x86 -Ilib/librte_eal -I../lib/librte_eal -Ilib/librte_kvargs -I../lib/librte_kvargs -Ilib/librte_ring -I../lib/librte_ring -Ilib/librte_ethdev -I../lib/librte_ethdev -Ilib/librte_net -I../lib/librte_net -Ilib/librte_mbuf -I../lib/librte_mbuf -Ilib/librte_mempool -I../lib/librte_mempool -Ilib/librte_meter -I../lib/librte_meter -Ilib/librte_hash -I../lib/librte_hash -Ilib/librte_timer -I../lib/librte_timer -Ilib/librte_cryptodev -I../lib/librte_cryptodev -Idrivers/bus/vdev -I../drivers/bus/vdev -Idrivers/net/dpaa2 -I../drivers/net/dpaa2 -I../drivers/net/dpaa2/base -I../drivers/net/dpaa2/mc -Idrivers/bus/pci -I../drivers/bus/pci -I../drivers/bus/pci/linux -Ilib/librte_pci -I../lib/librte_pci -Idrivers/mempool/dpaa2 -I../drivers/mempool/dpaa2 -Idrivers/bus/fslmc -I../drivers/bus/fslmc -I../drivers/bus/fslmc/mc -I../drivers/bus/fslmc/qbman/include -I../drivers/bus/fslmc/portal -Idrivers/common/dpaax -I../drivers/common/dpaax -Idrivers/crypto/dpaa2_sec -I../drivers/crypto/dpaa2_sec -I../drivers/crypto/dpaa2_sec/mc -I../drivers/crypto/dpaa2_sec/hw -Ilib/librte_security -I../lib/librte_security -Xclang -fcolor-diagnostics -pipe -D_FILE_OFFSET_BITS=64 -Wall -Winvalid-pch -Werror -O3 -include rte_config.h -Wunused-parameter -Wsign-compare -Wcast-qual -Wno-address-of-packed-member -D_GNU_SOURCE -fPIC -march=native -mno-avx512f -DALLOW_EXPERIMENTAL_API -MD -MQ 'drivers/a715181@@tmp_rte_pmd_dpaa2_event at sta/event_dpaa2_dpaa2_eventdev_selftest.c.o' -MF 'drivers/a715181@@tmp_rte_pmd_dpaa2_event at sta/event_dpaa2_dpaa2_eventdev_selftest.c.o.d' -o 'drivers/a715181@@tmp_rte_pmd_dpaa2_event at sta/event_dpaa2_dpaa2_eventdev_selftest.c.o' -c ../drivers/event/dpaa2/dpaa2_eventdev_selftest.c
../drivers/event/dpaa2/dpaa2_eventdev_selftest.c:63:1: error: unused function 'seqn_list_update' [-Werror,-Wunused-function]
seqn_list_update(int val)
^
../drivers/event/dpaa2/dpaa2_eventdev_selftest.c:74:1: error: unused function 'seqn_list_check' [-Werror,-Wunused-function]
--
[1304/1813] Linking target drivers/librte_pmd_zlib.so.1.1.
[1305/1813] Compiling C object 'drivers/a715181@@rte_pmd_dpaa_event at sta/meson-generated_.._rte_pmd_dpaa_event.pmd.c.o'.
[1306/1813] Compiling C object 'drivers/a715181@@tmp_rte_pmd_octeontx2_event at sta/event_octeontx2_otx2_evdev_irq.c.o'.
[1307/1813] Compiling C object 'drivers/a715181@@tmp_rte_pmd_octeontx2_event at sta/event_octeontx2_otx2_evdev_adptr.c.o'.
[1308/1813] Compiling C object 'drivers/a715181@@tmp_rte_pmd_octeontx2_event at sta/event_octeontx2_otx2_evdev.c.o'.
ninja: build stopped: subcommand failed.
meson --werror -Dexamples=all -Dlibdir=lib -Dmachine=nehalem --default-library=shared /tmp/UB1804-64_K4.15.0_GCC7.3.0/x86_64-native-linuxapp-gcc/bfed894fe68b433aa22239777305ffdb/dpdk/devtools/.. build-x86-default
The Meson build system
Version: 0.50.0
Source dir: /tmp/UB1804-64_K4.15.0_GCC7.3.0/x86_64-native-linuxapp-gcc/bfed894fe68b433aa22239777305ffdb/dpdk
Build dir: /tmp/UB1804-64_K4.15.0_GCC7.3.0/x86_64-native-linuxapp-gcc/bfed894fe68b433aa22239777305ffdb/dpdk/build-x86-default

DPDK STV team


More information about the test-report mailing list