[dpdk-test-report] |FAILURE| pw59010[3/7] net/bonding: check code of allmulticast mode switch

sys_stv at intel.com sys_stv at intel.com
Tue Sep 10 05:52:37 CEST 2019


Test-Label: Intel-compilation
Test-Status: FAILURE
http://dpdk.org/patch/59010

_Compilation issues_

Submitter: Andrew Rybchenko <arybchenko at solarflare.com>
Date: 2019-09-09 12:13:05
Reply_mail: 1568031190-16510-4-git-send-email-arybchenko at solarflare.com
DPDK git baseline: Repo:dpdk-next-net, CommitID: 2afa82430f0a60824fa4e0bf2a23191a5bc32a6d

Makefile build Summary: 22 Builds Done, 0 Successful, 22 Failures

Meson build Summary: 7 Builds Done, 2 Successful, 5 Failures

               +==============================================+===========+==========+
               |                   Makefile                   |   Meson   | Document |
+--------------+------+-------+------+------------+-----------+-----------+----------+
| os           | gcc  | clang | icc  | gcc+shared | gcc+debug | gcc/clang | pdf/html |
+--------------+------+-------+------+------------+-----------+-----------+----------+
| RHEL76-64    | FAIL |       |      |            |           |           |          |
| CENTOS76-64  | FAIL | FAIL  | FAIL | FAIL       | FAIL      |           |          |
| UB1804-64    | FAIL | FAIL  | FAIL |            |           | FAIL      | pass     |
| UB1604-32    | FAIL |       |      |            |           | FAIL      |          |
| UB1904-64    | FAIL |       |      |            |           |           |          |
| UB1604-64    | FAIL | FAIL  |      |            |           |           |          |
| FC30-64      | FAIL | FAIL  |      |            |           | FAIL      |          |
| WIN10-64     |      |       |      |            |           | pass      |          |
| FreeBSD12-64 | FAIL | FAIL  |      | FAIL       | FAIL      | FAIL      |          |
| RHEL80-64    | FAIL |       |      |            |           |           |          |
| SUSE15-64    | FAIL | FAIL  |      |            |           | FAIL      |          |
+--------------+------+-------+------+------------+-----------+-----------+----------+

Test environment and configuration as below:

** Makefile build **


OS: RHEL76-64
	Kernel Version: 3.10.0-957.el7.x86_64
	CPU info: Intel(R) Xeon(R) CPU E5-2699 v4 @ 2.20GHz
	GCC Version: gcc (GCC) 4.8.5 20150623 (Red Hat 4.8.5-36)
	Clang Version: NA
	x86_64-native-linuxapp-gcc


OS: CENTOS76-64
	Kernel Version: 3.10.0-957.10.1.el7.x86_64
	CPU info: Intel(R) Xeon(R) CPU E5-2699 v4 @ 2.20GHz
	GCC Version: gcc (GCC) 4.8.5 20150623 (Red Hat 4.8.5-36)
	Clang Version: 3.4.2 (tags/RELEASE_34/dot2-final)
	x86_64-native-linuxapp-gcc
	x86_64-native-linuxapp-gcc+debug
	x86_64-native-linuxapp-clang
	x86_64-native-linuxapp-gcc+shared
	x86_64-native-linuxapp-icc


OS: UB1804-64
	Kernel Version: 4.15.0-20-generic
	CPU info: Intel(R) Xeon(R) CPU E5-2699 v3 @ 2.30GHz
	GCC Version: gcc (Ubuntu 7.3.0-27ubuntu1~18.04) 7.3.0
	Clang Version: 6.0.0-1ubuntu2 (tags/RELEASE_600/final)
	x86_64-native-linuxapp-icc
	x86_64-native-linuxapp-clang
	x86_64-native-linuxapp-gcc


OS: UB1904-64
	Kernel Version: 5.0.0-13-generic
	CPU info: Intel(R) Xeon(R) CPU E5-2699 v3 @ 2.30GHz
	GCC Version: gcc (Ubuntu 8.3.0-6ubuntu1) 8.3.0
	Clang Version: 8.0.0-3 (tags/RELEASE_800/final)
	x86_64-native-linuxapp-gcc


OS: UB1604-32
	Kernel Version: 4.4.0-131-generic
	CPU info: Intel(R) Xeon(R) CPU E5-2699 v3 @ 2.30GHz
	GCC Version: gcc (Ubuntu 5.4.0-6ubuntu1~16.04.11) 5.4.0 20160609
	Clang Version: 3.8.0-2ubuntu4 (tags/RELEASE_380/final)
	i686-native-linuxapp-gcc


OS: UB1604-64
	Kernel Version: 4.4.0-47-generic
	CPU info: Intel(R) Xeon(R) CPU E5-2699 v3 @ 2.30GHz
	GCC Version: gcc (Ubuntu 5.4.0-6ubuntu1~16.04.10) 5.4.0 20160609
	Clang Version: 3.8.0-2ubuntu4 (tags/RELEASE_380/final)
	x86_64-native-linuxapp-clang
	x86_64-native-linuxapp-gcc


OS: FC30-64
	Kernel Version: 5.1.7-300.fc30.x86_64
	CPU info: Intel(R) Xeon(R) CPU E5-2699 v4 @ 2.20GHz
	GCC Version: gcc (GCC) 9.1.1 20190503 (Red Hat 9.1.1-1)
	Clang Version: 8.0.0 (Fedora 8.0.0-1.fc30)
	x86_64-native-linuxapp-gcc
	x86_64-native-linuxapp-clang


OS: FreeBSD12-64
	Kernel Version: 12.0-RC3
	CPU info: Intel(R) Xeon(R) CPU E5-2699 v4 @ 2.20GHz (2194.97-MHz K8-class CPU)
	GCC Version: gcc (FreeBSD Ports Collection) 7.3.0
	Clang Version: 6.0.1 (tags/RELEASE_601/final 335540) (based on LLVM 6.0.1)
	x86_64-native-bsdapp-gcc
	x86_64-native-bsdapp-gcc+debug
	x86_64-native-bsdapp-gcc+shared
	x86_64-native-bsdapp-clang


OS: RHEL80-64
	Kernel Version: 4.18.0-80.el8.x86_64
	CPU info: Intel(R) Xeon(R) CPU E5-2699 v4 @ 2.20GHz
	GCC Version: gcc (GCC) 8.2.1 20180905 (Red Hat 8.2.1-3)
	Clang Version: 6.0.1 (tags/RELEASE_601/final)
	x86_64-native-linuxapp-gcc


OS: SUSE15-64
	Kernel Version: 4.12.14-lp150.11-default
	CPU info: Intel(R) Xeon(R) CPU E5-2699 v4 @ 2.20GHz
	GCC Version: gcc (SUSE Linux) 7.3.1 20180323 [gcc-7-branch revision 258812]
	Clang Version: 5.0.1 (tags/RELEASE_501/final 312548)
	x86_64-native-linuxapp-gcc
	x86_64-native-linuxapp-clang


** Meson build **


OS: UB1804-64
	Kernel Version: 4.15.0-20-generic
	CPU info: Intel(R) Xeon(R) CPU E5-2699 v4 @ 2.20GHz
	GCC Version: gcc (Ubuntu 7.3.0-27ubuntu1~18.04) 7.3.0
	Clang Version: 6.0.0-1ubuntu2 (tags/RELEASE_600/final)
	x86_64-native-linuxapp-doc
	build-gcc-static
	build-gcc-shared
	build-clang-static
	build-clang-shared
	build-x86-default


OS: UB1604-32
	Kernel Version: 4.4.0-131-generic
	CPU info: Intel(R) Xeon(R) CPU E5-2699 v4 @ 2.20GHz
	GCC Version: gcc (Ubuntu 5.4.0-6ubuntu1~16.04.11) 5.4.0 20160609
	Clang Version: 3.8.0-2ubuntu4 (tags/RELEASE_380/final)
	build-gcc-static
	build-gcc-shared
	build-clang-static
	build-clang-shared
	build-x86-default


OS: FC30-64
	Kernel Version: 5.0.9-301.fc30.x86_64
	CPU info: Intel(R) Xeon(R) CPU E5-2699 v4 @ 2.20GHz
	GCC Version: gcc (GCC) 9.1.1 20190503 (Red Hat 9.1.1-1)
	Clang Version: 8.0.0 (Fedora 8.0.0-1.fc30)
	build-gcc-static
	build-gcc-shared
	build-clang-static
	build-clang-shared
	build-x86-default


OS: WIN10-64
	Kernel Version: N/A
	CPU info: N/A
	GCC Version: N/A
	Clang Version: Clang 8.0.0
	x86_64-windows-clang


OS: FreeBSD12-64
	Kernel Version: 12.0-RC3
	CPU info: Intel(R) Xeon(R) CPU E5-2699 v4 @ 2.20GHz (2194.99-MHz K8-class CPU)
	GCC Version: gcc (FreeBSD Ports Collection) 7.3.0
	Clang Version: 6.0.1 (tags/RELEASE_601/final 335540) (based on LLVM 6.0.1)
	build-gcc-static
	build-gcc-shared
	build-clang-static
	build-clang-shared
	build-x86-default


OS: SUSE15-64
	Kernel Version: 4.12.14-lp150.11-default
	CPU info: Intel(R) Xeon(R) CPU E5-2699 v4 @ 2.20GHz
	GCC Version: gcc (SUSE Linux) 7.3.1 20180323 [gcc-7-branch revision 258812]
	Clang Version: 5.0.1 (tags/RELEASE_501/final 312548)
	build-gcc-static
	build-gcc-shared
	build-clang-static
	build-clang-shared
	build-x86-default


*Make Build Failed #1:
OS: UB1604-64
Target: x86_64-native-linuxapp-clang
                    ^ ~~~~~~~~~~~~~~~~~~~~~~~~~~~~~~~~~~~~~~~~~~~
/tmp/UB1604-64_K4.4.0_Clang3.8.0/x86_64-native-linuxapp-clang/ef64b8ea0d6a4027819f6af01be37668/dpdk/drivers/net/failsafe/failsafe_ops.c:731:8: error: assigning to 'int' from incompatible type 'void'
                        ret = rte_eth_allmulticast_enable(PORT_ID(sdev));
                            ^ ~~~~~~~~~~~~~~~~~~~~~~~~~~~~~~~~~~~~~~~~~~
4 errors generated.
/tmp/UB1604-64_K4.4.0_Clang3.8.0/x86_64-native-linuxapp-clang/ef64b8ea0d6a4027819f6af01be37668/dpdk/mk/internal/rte.compile-pre.mk:114: recipe for target 'failsafe_ops.o' failed
make[6]: *** [failsafe_ops.o] Error 1
/tmp/UB1604-64_K4.4.0_Clang3.8.0/x86_64-native-linuxapp-clang/ef64b8ea0d6a4027819f6af01be37668/dpdk/mk/rte.subdir.mk:35: recipe for target 'failsafe' failed
make[5]: *** [failsafe] Error 2
make[5]: *** Waiting for unfinished jobs....
  CC t4_hw.o
  CC clip_tbl.o
  CC e1000_manage.o
  CC enic_clsf.o
--
  LD igb_ethdev.o
  AR librte_pmd_e1000.a
  INSTALL-LIB librte_pmd_e1000.a
  AR librte_pmd_bnx2x.a
  INSTALL-LIB librte_pmd_bnx2x.a
/tmp/UB1604-64_K4.4.0_Clang3.8.0/x86_64-native-linuxapp-clang/ef64b8ea0d6a4027819f6af01be37668/dpdk/mk/rte.subdir.mk:35: recipe for target 'net' failed
make[4]: *** [net] Error 2
/tmp/UB1604-64_K4.4.0_Clang3.8.0/x86_64-native-linuxapp-clang/ef64b8ea0d6a4027819f6af01be37668/dpdk/mk/rte.sdkbuild.mk:46: recipe for target 'drivers' failed
make[3]: *** [drivers] Error 2
/tmp/UB1604-64_K4.4.0_Clang3.8.0/x86_64-native-linuxapp-clang/ef64b8ea0d6a4027819f6af01be37668/dpdk/mk/rte.sdkroot.mk:98: recipe for target 'all' failed
make[2]: *** [all] Error 2
/tmp/UB1604-64_K4.4.0_Clang3.8.0/x86_64-native-linuxapp-clang/ef64b8ea0d6a4027819f6af01be37668/dpdk/mk/rte.sdkinstall.mk:60: recipe for target 'pre_install' failed
make[1]: *** [pre_install] Error 2
/tmp/UB1604-64_K4.4.0_Clang3.8.0/x86_64-native-linuxapp-clang/ef64b8ea0d6a4027819f6af01be37668/dpdk/mk/rte.sdkroot.mk:77: recipe for target 'install' failed
make: *** [install] Error 2


*Make Build Failed #2:
OS: UB1604-32
Target: i686-native-linuxapp-gcc
    ret = rte_eth_allmulticast_enable(PORT_ID(sdev));
        ^
/tmp/UB1604-32_K4.4.0_GCC5.4.0/i686-native-linuxapp-gcc/ef64b8ea0d6a4027819f6af01be37668/dpdk/drivers/net/failsafe/failsafe_ops.c: At top level:
cc1: error: unrecognized command line option ‘-Wno-address-of-packed-member’ [-Werror]
cc1: all warnings being treated as errors
/tmp/UB1604-32_K4.4.0_GCC5.4.0/i686-native-linuxapp-gcc/ef64b8ea0d6a4027819f6af01be37668/dpdk/mk/internal/rte.compile-pre.mk:114: recipe for target 'failsafe_ops.o' failed
make[6]: *** [failsafe_ops.o] Error 1
make[6]: *** Waiting for unfinished jobs....
  CC fm10k_pf.o
== Build drivers/net/ice
== Build drivers/net/ipn3ke
  CC e1000_nvm.o
  CC iavf_adminq.o
/tmp/UB1604-32_K4.4.0_GCC5.4.0/i686-native-linuxapp-gcc/ef64b8ea0d6a4027819f6af01be37668/dpdk/mk/rte.subdir.mk:35: recipe for target 'failsafe' failed
make[5]: *** [failsafe] Error 2
make[5]: *** Waiting for unfinished jobs....
  CC i40e_hmc.o
  CC iavf_common.o
  CC fm10k_tlv.o
  CC i40e_lan_hmc.o
--
  PMDINFO ice_ethdev.o.pmd.c
  CC ice_ethdev.o.pmd.o
  LD ice_ethdev.o
  AR librte_pmd_ice.a
  INSTALL-LIB librte_pmd_ice.a
/tmp/UB1604-32_K4.4.0_GCC5.4.0/i686-native-linuxapp-gcc/ef64b8ea0d6a4027819f6af01be37668/dpdk/mk/rte.subdir.mk:35: recipe for target 'net' failed
make[4]: *** [net] Error 2
/tmp/UB1604-32_K4.4.0_GCC5.4.0/i686-native-linuxapp-gcc/ef64b8ea0d6a4027819f6af01be37668/dpdk/mk/rte.sdkbuild.mk:46: recipe for target 'drivers' failed
make[3]: *** [drivers] Error 2
/tmp/UB1604-32_K4.4.0_GCC5.4.0/i686-native-linuxapp-gcc/ef64b8ea0d6a4027819f6af01be37668/dpdk/mk/rte.sdkroot.mk:98: recipe for target 'all' failed
make[2]: *** [all] Error 2
/tmp/UB1604-32_K4.4.0_GCC5.4.0/i686-native-linuxapp-gcc/ef64b8ea0d6a4027819f6af01be37668/dpdk/mk/rte.sdkinstall.mk:60: recipe for target 'pre_install' failed
make[1]: *** [pre_install] Error 2
/tmp/UB1604-32_K4.4.0_GCC5.4.0/i686-native-linuxapp-gcc/ef64b8ea0d6a4027819f6af01be37668/dpdk/mk/rte.sdkroot.mk:77: recipe for target 'install' failed
make: *** [install] Error 2


*Make Build Failed #3:
OS: UB1904-64
Target: x86_64-native-linuxapp-gcc
        ^
  CC enic_clsf.o
/tmp/UB1904-64_K4.18.0_GCC8.3.0/x86_64-native-linuxapp-gcc/ef64b8ea0d6a4027819f6af01be37668/dpdk/drivers/net/failsafe/failsafe_ops.c: At top level:
cc1: error: unrecognized command line option ‘-Wno-address-of-packed-member’ [-Werror]
cc1: all warnings being treated as errors
make[6]: *** [/tmp/UB1904-64_K4.18.0_GCC8.3.0/x86_64-native-linuxapp-gcc/ef64b8ea0d6a4027819f6af01be37668/dpdk/mk/internal/rte.compile-pre.mk:116: failsafe_ops.o] Error 1
  CC fm10k_rxtx.o
make[5]: *** [/tmp/UB1904-64_K4.18.0_GCC8.3.0/x86_64-native-linuxapp-gcc/ef64b8ea0d6a4027819f6af01be37668/dpdk/mk/rte.subdir.mk:37: failsafe] Error 2
make[5]: *** Waiting for unfinished jobs....
  CC hinic_pmd_cmdq.o
  CC igb_flow.o
  CC i40e_diag.o
  CC em_ethdev.o
--
  PMDINFO i40e_ethdev.o.pmd.c
  CC i40e_ethdev.o.pmd.o
  LD i40e_ethdev.o
  AR librte_pmd_i40e.a
  INSTALL-LIB librte_pmd_i40e.a
make[4]: *** [/tmp/UB1904-64_K4.18.0_GCC8.3.0/x86_64-native-linuxapp-gcc/ef64b8ea0d6a4027819f6af01be37668/dpdk/mk/rte.subdir.mk:35: net] Error 2
make[3]: *** [/tmp/UB1904-64_K4.18.0_GCC8.3.0/x86_64-native-linuxapp-gcc/ef64b8ea0d6a4027819f6af01be37668/dpdk/mk/rte.sdkbuild.mk:46: drivers] Error 2
make[2]: *** [/tmp/UB1904-64_K4.18.0_GCC8.3.0/x86_64-native-linuxapp-gcc/ef64b8ea0d6a4027819f6af01be37668/dpdk/mk/rte.sdkroot.mk:99: all] Error 2
make[1]: *** [/tmp/UB1904-64_K4.18.0_GCC8.3.0/x86_64-native-linuxapp-gcc/ef64b8ea0d6a4027819f6af01be37668/dpdk/mk/rte.sdkinstall.mk:61: pre_install] Error 2
make: *** [/tmp/UB1904-64_K4.18.0_GCC8.3.0/x86_64-native-linuxapp-gcc/ef64b8ea0d6a4027819f6af01be37668/dpdk/mk/rte.sdkroot.mk:77: install] Error 2


*Make Build Failed #4:
OS: UB1804-64
Target: x86_64-native-linuxapp-icc
/tmp/UB1804-64_K4.15.0_ICC19.0.0/x86_64-native-linuxapp-icc/ef64b8ea0d6a4027819f6af01be37668/dpdk/drivers/net/failsafe/failsafe_ops.c(731): error: a value of type "void" cannot be assigned to an entity of type "int"
  			ret = rte_eth_allmulticast_enable(PORT_ID(sdev));
  			    ^

compilation aborted for /tmp/UB1804-64_K4.15.0_ICC19.0.0/x86_64-native-linuxapp-icc/ef64b8ea0d6a4027819f6af01be37668/dpdk/drivers/net/failsafe/failsafe_ops.c (code 2)
/tmp/UB1804-64_K4.15.0_ICC19.0.0/x86_64-native-linuxapp-icc/ef64b8ea0d6a4027819f6af01be37668/dpdk/mk/internal/rte.compile-pre.mk:114: recipe for target 'failsafe_ops.o' failed
make[6]: *** [failsafe_ops.o] Error 2
make[6]: *** Waiting for unfinished jobs....
  CC i40e_diag.o
  CC mc/dpdmux.o
  CC i40e_hmc.o
  CC e1000_logs.o
  AR librte_pmd_cxgbe.a
  INSTALL-LIB librte_pmd_cxgbe.a
== Build drivers/net/ice
  CC enic_clsf.o
/tmp/UB1804-64_K4.15.0_ICC19.0.0/x86_64-native-linuxapp-icc/ef64b8ea0d6a4027819f6af01be37668/dpdk/mk/rte.subdir.mk:35: recipe for target 'failsafe' failed
make[5]: *** [failsafe] Error 2
make[5]: *** Waiting for unfinished jobs....
  CC enic_res.o
  CC i40e_lan_hmc.o
  CC iavf_ethdev.o
  CC e1000_mac.o
--
  PMDINFO ice_ethdev.o.pmd.c
  CC ice_ethdev.o.pmd.o
  LD ice_ethdev.o
  AR librte_pmd_ice.a
  INSTALL-LIB librte_pmd_ice.a
/tmp/UB1804-64_K4.15.0_ICC19.0.0/x86_64-native-linuxapp-icc/ef64b8ea0d6a4027819f6af01be37668/dpdk/mk/rte.subdir.mk:35: recipe for target 'net' failed
make[4]: *** [net] Error 2
/tmp/UB1804-64_K4.15.0_ICC19.0.0/x86_64-native-linuxapp-icc/ef64b8ea0d6a4027819f6af01be37668/dpdk/mk/rte.sdkbuild.mk:46: recipe for target 'drivers' failed
make[3]: *** [drivers] Error 2
/tmp/UB1804-64_K4.15.0_ICC19.0.0/x86_64-native-linuxapp-icc/ef64b8ea0d6a4027819f6af01be37668/dpdk/mk/rte.sdkroot.mk:98: recipe for target 'all' failed
make[2]: *** [all] Error 2
/tmp/UB1804-64_K4.15.0_ICC19.0.0/x86_64-native-linuxapp-icc/ef64b8ea0d6a4027819f6af01be37668/dpdk/mk/rte.sdkinstall.mk:60: recipe for target 'pre_install' failed
make[1]: *** [pre_install] Error 2
/tmp/UB1804-64_K4.15.0_ICC19.0.0/x86_64-native-linuxapp-icc/ef64b8ea0d6a4027819f6af01be37668/dpdk/mk/rte.sdkroot.mk:77: recipe for target 'install' failed
make: *** [install] Error 2


*Make Build Failed #5:
OS: UB1804-64
Target: x86_64-native-linuxapp-clang
                    ^ ~~~~~~~~~~~~~~~~~~~~~~~~~~~~~~~~~~~~~~~~~~~
/tmp/UB1804-64_K4.15.0_Clang6.0.0/x86_64-native-linuxapp-clang/ef64b8ea0d6a4027819f6af01be37668/dpdk/drivers/net/failsafe/failsafe_ops.c:731:8: error: assigning to 'int' from incompatible type 'void'
                        ret = rte_eth_allmulticast_enable(PORT_ID(sdev));
                            ^ ~~~~~~~~~~~~~~~~~~~~~~~~~~~~~~~~~~~~~~~~~~
4 errors generated.
/tmp/UB1804-64_K4.15.0_Clang6.0.0/x86_64-native-linuxapp-clang/ef64b8ea0d6a4027819f6af01be37668/dpdk/mk/internal/rte.compile-pre.mk:114: recipe for target 'failsafe_ops.o' failed
make[6]: *** [failsafe_ops.o] Error 1
/tmp/UB1804-64_K4.15.0_Clang6.0.0/x86_64-native-linuxapp-clang/ef64b8ea0d6a4027819f6af01be37668/dpdk/mk/rte.subdir.mk:35: recipe for target 'failsafe' failed
make[5]: *** [failsafe] Error 2
make[5]: *** Waiting for unfinished jobs....
  CC hinic_pmd_hwif.o
  CC hinic_pmd_mgmt.o
  CC igb_flow.o
  CC hinic_pmd_niccfg.o
--
  PMDINFO i40e_ethdev.o.pmd.c
  CC i40e_ethdev.o.pmd.o
  LD i40e_ethdev.o
  AR librte_pmd_i40e.a
  INSTALL-LIB librte_pmd_i40e.a
/tmp/UB1804-64_K4.15.0_Clang6.0.0/x86_64-native-linuxapp-clang/ef64b8ea0d6a4027819f6af01be37668/dpdk/mk/rte.subdir.mk:35: recipe for target 'net' failed
make[4]: *** [net] Error 2
/tmp/UB1804-64_K4.15.0_Clang6.0.0/x86_64-native-linuxapp-clang/ef64b8ea0d6a4027819f6af01be37668/dpdk/mk/rte.sdkbuild.mk:46: recipe for target 'drivers' failed
make[3]: *** [drivers] Error 2
/tmp/UB1804-64_K4.15.0_Clang6.0.0/x86_64-native-linuxapp-clang/ef64b8ea0d6a4027819f6af01be37668/dpdk/mk/rte.sdkroot.mk:98: recipe for target 'all' failed
make[2]: *** [all] Error 2
/tmp/UB1804-64_K4.15.0_Clang6.0.0/x86_64-native-linuxapp-clang/ef64b8ea0d6a4027819f6af01be37668/dpdk/mk/rte.sdkinstall.mk:60: recipe for target 'pre_install' failed
make[1]: *** [pre_install] Error 2
/tmp/UB1804-64_K4.15.0_Clang6.0.0/x86_64-native-linuxapp-clang/ef64b8ea0d6a4027819f6af01be37668/dpdk/mk/rte.sdkroot.mk:77: recipe for target 'install' failed
make: *** [install] Error 2


*Make Build Failed #6:
OS: FC30-64
Target: x86_64-native-linuxapp-gcc
  720 |   ret = rte_eth_allmulticast_disable(PORT_ID(sdev));
      |       ^
/tmp/FC30-64_K4.20_GCC9.1.1/x86_64-native-linuxapp-gcc/ef64b8ea0d6a4027819f6af01be37668/dpdk/drivers/net/failsafe/failsafe_ops.c:731:8: error: void value not ignored as it ought to be
  731 |    ret = rte_eth_allmulticast_enable(PORT_ID(sdev));
      |        ^
make[6]: *** [/tmp/FC30-64_K4.20_GCC9.1.1/x86_64-native-linuxapp-gcc/ef64b8ea0d6a4027819f6af01be37668/dpdk/mk/internal/rte.compile-pre.mk:116: failsafe_ops.o] Error 1
  CC rte_eth_bond_alb.o
  CC e1000_mac.o
  CC e1000_manage.o
  CC base/vnic_wq.o
  CC hinic_pmd_cmdq.o
  CC hinic_pmd_eqs.o
  CC rte_eth_bond_flow.o
make[5]: *** [/tmp/FC30-64_K4.20_GCC9.1.1/x86_64-native-linuxapp-gcc/ef64b8ea0d6a4027819f6af01be37668/dpdk/mk/rte.subdir.mk:35: failsafe] Error 2
make[5]: *** Waiting for unfinished jobs....
  CC hinic_pmd_hwdev.o
== Build drivers/net/i40e
  CC e1000_mbx.o
  CC e1000_nvm.o
--
  PMDINFO i40e_ethdev.o.pmd.c
  CC i40e_ethdev.o.pmd.o
  LD i40e_ethdev.o
  AR librte_pmd_i40e.a
  INSTALL-LIB librte_pmd_i40e.a
make[4]: *** [/tmp/FC30-64_K4.20_GCC9.1.1/x86_64-native-linuxapp-gcc/ef64b8ea0d6a4027819f6af01be37668/dpdk/mk/rte.subdir.mk:35: net] Error 2
make[3]: *** [/tmp/FC30-64_K4.20_GCC9.1.1/x86_64-native-linuxapp-gcc/ef64b8ea0d6a4027819f6af01be37668/dpdk/mk/rte.sdkbuild.mk:46: drivers] Error 2
make[2]: *** [/tmp/FC30-64_K4.20_GCC9.1.1/x86_64-native-linuxapp-gcc/ef64b8ea0d6a4027819f6af01be37668/dpdk/mk/rte.sdkroot.mk:99: all] Error 2
make[1]: *** [/tmp/FC30-64_K4.20_GCC9.1.1/x86_64-native-linuxapp-gcc/ef64b8ea0d6a4027819f6af01be37668/dpdk/mk/rte.sdkinstall.mk:61: pre_install] Error 2
make: *** [/tmp/FC30-64_K4.20_GCC9.1.1/x86_64-native-linuxapp-gcc/ef64b8ea0d6a4027819f6af01be37668/dpdk/mk/rte.sdkroot.mk:77: install] Error 2


*Make Build Failed #7:
OS: SUSE15-64
Target: x86_64-native-linuxapp-gcc
    ret = rte_eth_allmulticast_enable(PORT_ID(sdev));
        ^
/tmp/SUSE15-64_K4.12.14_GCC7.3.1/x86_64-native-linuxapp-gcc/ef64b8ea0d6a4027819f6af01be37668/dpdk/drivers/net/failsafe/failsafe_ops.c: At top level:
cc1: error: unrecognized command line option ‘-Wno-address-of-packed-member’ [-Werror]
cc1: all warnings being treated as errors
make[6]: *** [/tmp/SUSE15-64_K4.12.14_GCC7.3.1/x86_64-native-linuxapp-gcc/ef64b8ea0d6a4027819f6af01be37668/dpdk/mk/internal/rte.compile-pre.mk:116: failsafe_ops.o] Error 1
  CC fm10k_pf.o
  CC iavf_ethdev.o
  CC hinic_pmd_hwdev.o
  CC hinic_pmd_hwif.o
  CC e1000_logs.o
  CC base/vnic_cq.o
  CC e1000_mac.o
  CC e1000_manage.o
  CC base/vnic_wq.o
make[5]: *** [/tmp/SUSE15-64_K4.12.14_GCC7.3.1/x86_64-native-linuxapp-gcc/ef64b8ea0d6a4027819f6af01be37668/dpdk/mk/rte.subdir.mk:35: failsafe] Error 2
make[5]: *** Waiting for unfinished jobs....
  PMDINFO iavf_ethdev.o.pmd.c
  CC i40e_diag.o
  CC e1000_mbx.o
== Build drivers/net/ice
--
  PMDINFO ice_ethdev.o.pmd.c
  CC ice_ethdev.o.pmd.o
  LD ice_ethdev.o
  AR librte_pmd_ice.a
  INSTALL-LIB librte_pmd_ice.a
make[4]: *** [/tmp/SUSE15-64_K4.12.14_GCC7.3.1/x86_64-native-linuxapp-gcc/ef64b8ea0d6a4027819f6af01be37668/dpdk/mk/rte.subdir.mk:35: net] Error 2
make[3]: *** [/tmp/SUSE15-64_K4.12.14_GCC7.3.1/x86_64-native-linuxapp-gcc/ef64b8ea0d6a4027819f6af01be37668/dpdk/mk/rte.sdkbuild.mk:46: drivers] Error 2
make[2]: *** [/tmp/SUSE15-64_K4.12.14_GCC7.3.1/x86_64-native-linuxapp-gcc/ef64b8ea0d6a4027819f6af01be37668/dpdk/mk/rte.sdkroot.mk:99: all] Error 2
make[1]: *** [/tmp/SUSE15-64_K4.12.14_GCC7.3.1/x86_64-native-linuxapp-gcc/ef64b8ea0d6a4027819f6af01be37668/dpdk/mk/rte.sdkinstall.mk:61: pre_install] Error 2
make: *** [/tmp/SUSE15-64_K4.12.14_GCC7.3.1/x86_64-native-linuxapp-gcc/ef64b8ea0d6a4027819f6af01be37668/dpdk/mk/rte.sdkroot.mk:77: install] Error 2


*Make Build Failed #8:
OS: RHEL76-64
Target: x86_64-native-linuxapp-gcc
    ret = rte_eth_allmulticast_enable(PORT_ID(sdev));
        ^
/tmp/RHEL76-64_K3.10.0_GCC4.8.5/x86_64-native-linuxapp-gcc/ef64b8ea0d6a4027819f6af01be37668/dpdk/drivers/net/failsafe/failsafe_ops.c: At top level:
cc1: error: unrecognized command line option "-Wno-address-of-packed-member" [-Werror]
cc1: all warnings being treated as errors
make[6]: *** [failsafe_ops.o] Error 1
make[5]: *** [failsafe] Error 2
make[5]: *** Waiting for unfinished jobs....
  CC enic_rxtx.o
  CC enic_clsf.o
  CC iavf_common.o
  CC hinic_pmd_cfg.o
--
  LD ice_ethdev.o
  AR librte_pmd_i40e.a
  INSTALL-LIB librte_pmd_i40e.a
  AR librte_pmd_ice.a
  INSTALL-LIB librte_pmd_ice.a
make[4]: *** [net] Error 2
make[3]: *** [drivers] Error 2
make[2]: *** [all] Error 2
make[1]: *** [pre_install] Error 2
make: *** [install] Error 2


*Make Build Failed #9:
OS: SUSE15-64
Target: x86_64-native-linuxapp-clang
                    ^ ~~~~~~~~~~~~~~~~~~~~~~~~~~~~~~~~~~~~~~~~~~~
/tmp/SUSE15-64_K4.12.14_Clang5.0.1/x86_64-native-linuxapp-clang/ef64b8ea0d6a4027819f6af01be37668/dpdk/drivers/net/failsafe/failsafe_ops.c:731:8: error: assigning to 'int' from incompatible type 'void'
                        ret = rte_eth_allmulticast_enable(PORT_ID(sdev));
                            ^ ~~~~~~~~~~~~~~~~~~~~~~~~~~~~~~~~~~~~~~~~~~
4 errors generated.
make[6]: *** [/tmp/SUSE15-64_K4.12.14_Clang5.0.1/x86_64-native-linuxapp-clang/ef64b8ea0d6a4027819f6af01be37668/dpdk/mk/internal/rte.compile-pre.mk:114: failsafe_ops.o] Error 1
  CC e1000_mac.o
  CC clip_tbl.o
  CC mps_tcam.o
  CC e1000_manage.o
  CC enic_clsf.o
--
  AR librte_pmd_bnx2x.a
  INSTALL-LIB librte_pmd_bnx2x.a
  PMDINFO virtio_cryptodev.o.pmd.c
  CC virtio_cryptodev.o.pmd.o
  LD virtio_cryptodev.o
make[5]: *** [/tmp/SUSE15-64_K4.12.14_Clang5.0.1/x86_64-native-linuxapp-clang/ef64b8ea0d6a4027819f6af01be37668/dpdk/mk/rte.subdir.mk:35: failsafe] Error 2
make[5]: *** Waiting for unfinished jobs....
== Build drivers/net/fm10k
  AR librte_pmd_virtio_crypto.a
  INSTALL-LIB librte_pmd_virtio_crypto.a
  CC fm10k_ethdev.o
--
  PMDINFO fm10k_ethdev.o.pmd.c
  CC fm10k_ethdev.o.pmd.o
  LD fm10k_ethdev.o
  AR librte_pmd_fm10k.a
  INSTALL-LIB librte_pmd_fm10k.a
make[4]: *** [/tmp/SUSE15-64_K4.12.14_Clang5.0.1/x86_64-native-linuxapp-clang/ef64b8ea0d6a4027819f6af01be37668/dpdk/mk/rte.subdir.mk:35: net] Error 2
make[3]: *** [/tmp/SUSE15-64_K4.12.14_Clang5.0.1/x86_64-native-linuxapp-clang/ef64b8ea0d6a4027819f6af01be37668/dpdk/mk/rte.sdkbuild.mk:46: drivers] Error 2
make[2]: *** [/tmp/SUSE15-64_K4.12.14_Clang5.0.1/x86_64-native-linuxapp-clang/ef64b8ea0d6a4027819f6af01be37668/dpdk/mk/rte.sdkroot.mk:99: all] Error 2
make[1]: *** [/tmp/SUSE15-64_K4.12.14_Clang5.0.1/x86_64-native-linuxapp-clang/ef64b8ea0d6a4027819f6af01be37668/dpdk/mk/rte.sdkinstall.mk:61: pre_install] Error 2
make: *** [/tmp/SUSE15-64_K4.12.14_Clang5.0.1/x86_64-native-linuxapp-clang/ef64b8ea0d6a4027819f6af01be37668/dpdk/mk/rte.sdkroot.mk:77: install] Error 2


*Make Build Failed #10:
OS: FC30-64
Target: x86_64-native-linuxapp-clang
                    ^ ~~~~~~~~~~~~~~~~~~~~~~~~~~~~~~~~~~~~~~~~~~~
/tmp/FC30-64_K4.20_Clang8.0.0/x86_64-native-linuxapp-clang/ef64b8ea0d6a4027819f6af01be37668/dpdk/drivers/net/failsafe/failsafe_ops.c:731:8: error: assigning to 'int' from incompatible type 'void'
                        ret = rte_eth_allmulticast_enable(PORT_ID(sdev));
                            ^ ~~~~~~~~~~~~~~~~~~~~~~~~~~~~~~~~~~~~~~~~~~
4 errors generated.
make[6]: *** [/tmp/FC30-64_K4.20_Clang8.0.0/x86_64-native-linuxapp-clang/ef64b8ea0d6a4027819f6af01be37668/dpdk/mk/internal/rte.compile-pre.mk:116: failsafe_ops.o] Error 1
make[6]: *** Waiting for unfinished jobs....
== Build drivers/net/iavf
  CC e1000_82575.o
== Build drivers/net/ice
make[5]: *** [/tmp/FC30-64_K4.20_Clang8.0.0/x86_64-native-linuxapp-clang/ef64b8ea0d6a4027819f6af01be37668/dpdk/mk/rte.subdir.mk:37: failsafe] Error 2
make[5]: *** Waiting for unfinished jobs....
  CC hinic_pmd_cfg.o
  SYMLINK-FILE include/rte_pmd_i40e.h
  CC i40e_adminq.o
  CC iavf_adminq.o
--
  LD em_ethdev.o
  AR librte_pmd_e1000.a
  INSTALL-LIB librte_pmd_e1000.a
  AR librte_pmd_i40e.a
  INSTALL-LIB librte_pmd_i40e.a
make[4]: *** [/tmp/FC30-64_K4.20_Clang8.0.0/x86_64-native-linuxapp-clang/ef64b8ea0d6a4027819f6af01be37668/dpdk/mk/rte.subdir.mk:35: net] Error 2
make[3]: *** [/tmp/FC30-64_K4.20_Clang8.0.0/x86_64-native-linuxapp-clang/ef64b8ea0d6a4027819f6af01be37668/dpdk/mk/rte.sdkbuild.mk:46: drivers] Error 2
make[2]: *** [/tmp/FC30-64_K4.20_Clang8.0.0/x86_64-native-linuxapp-clang/ef64b8ea0d6a4027819f6af01be37668/dpdk/mk/rte.sdkroot.mk:99: all] Error 2
make[1]: *** [/tmp/FC30-64_K4.20_Clang8.0.0/x86_64-native-linuxapp-clang/ef64b8ea0d6a4027819f6af01be37668/dpdk/mk/rte.sdkinstall.mk:61: pre_install] Error 2
make: *** [/tmp/FC30-64_K4.20_Clang8.0.0/x86_64-native-linuxapp-clang/ef64b8ea0d6a4027819f6af01be37668/dpdk/mk/rte.sdkroot.mk:77: install] Error 2


*Make Build Failed #11:
OS: RHEL80-64
Target: x86_64-native-linuxapp-gcc
        ^
/tmp/RHEL80-64_K3.10.0_GCC8.2.1/x86_64-native-linuxapp-gcc/ef64b8ea0d6a4027819f6af01be37668/dpdk/drivers/net/failsafe/failsafe_ops.c: At top level:
cc1: error: unrecognized command line option ‘-Wno-address-of-packed-member’ [-Werror]
cc1: all warnings being treated as errors
  AR librte_pmd_dpaa2.a
make[6]: *** [/tmp/RHEL80-64_K3.10.0_GCC8.2.1/x86_64-native-linuxapp-gcc/ef64b8ea0d6a4027819f6af01be37668/dpdk/mk/internal/rte.compile-pre.mk:114: failsafe_ops.o] Error 1
make[5]: *** [/tmp/RHEL80-64_K3.10.0_GCC8.2.1/x86_64-native-linuxapp-gcc/ef64b8ea0d6a4027819f6af01be37668/dpdk/mk/rte.subdir.mk:35: failsafe] Error 2
make[5]: *** Waiting for unfinished jobs....
  INSTALL-LIB librte_pmd_dpaa2.a
  CC mc/dpseci.o
  CC i40e_adminq.o
  CC i40e_common.o
--
  INSTALL-LIB librte_pmd_virtio_crypto.a
  AR librte_pmd_i40e.a
  INSTALL-LIB librte_pmd_i40e.a
  AR librte_pmd_hinic.a
  INSTALL-LIB librte_pmd_hinic.a
make[4]: *** [/tmp/RHEL80-64_K3.10.0_GCC8.2.1/x86_64-native-linuxapp-gcc/ef64b8ea0d6a4027819f6af01be37668/dpdk/mk/rte.subdir.mk:35: net] Error 2
make[3]: *** [/tmp/RHEL80-64_K3.10.0_GCC8.2.1/x86_64-native-linuxapp-gcc/ef64b8ea0d6a4027819f6af01be37668/dpdk/mk/rte.sdkbuild.mk:46: drivers] Error 2
make[2]: *** [/tmp/RHEL80-64_K3.10.0_GCC8.2.1/x86_64-native-linuxapp-gcc/ef64b8ea0d6a4027819f6af01be37668/dpdk/mk/rte.sdkroot.mk:99: all] Error 2
make[1]: *** [/tmp/RHEL80-64_K3.10.0_GCC8.2.1/x86_64-native-linuxapp-gcc/ef64b8ea0d6a4027819f6af01be37668/dpdk/mk/rte.sdkinstall.mk:61: pre_install] Error 2
make: *** [/tmp/RHEL80-64_K3.10.0_GCC8.2.1/x86_64-native-linuxapp-gcc/ef64b8ea0d6a4027819f6af01be37668/dpdk/mk/rte.sdkroot.mk:77: install] Error 2


*Make Build Failed #12:
OS: UB1604-64
Target: x86_64-native-linuxapp-gcc
    ret = rte_eth_allmulticast_enable(PORT_ID(sdev));
        ^
/tmp/UB1604-64_K4.4.0_GCC5.4.0/x86_64-native-linuxapp-gcc/ef64b8ea0d6a4027819f6af01be37668/dpdk/drivers/net/failsafe/failsafe_ops.c: At top level:
cc1: error: unrecognized command line option ‘-Wno-address-of-packed-member’ [-Werror]
cc1: all warnings being treated as errors
/tmp/UB1604-64_K4.4.0_GCC5.4.0/x86_64-native-linuxapp-gcc/ef64b8ea0d6a4027819f6af01be37668/dpdk/mk/internal/rte.compile-pre.mk:114: recipe for target 'failsafe_ops.o' failed
make[6]: *** [failsafe_ops.o] Error 1
/tmp/UB1604-64_K4.4.0_GCC5.4.0/x86_64-native-linuxapp-gcc/ef64b8ea0d6a4027819f6af01be37668/dpdk/mk/rte.subdir.mk:35: recipe for target 'failsafe' failed
make[5]: *** [failsafe] Error 2
make[5]: *** Waiting for unfinished jobs....
== Build drivers/crypto/caam_jr
== Build drivers/crypto/virtio
  CC enic_rxtx.o
  CC mc/dpseci.o
--
  PMDINFO igb_ethdev.o.pmd.c
  CC igb_ethdev.o.pmd.o
  LD igb_ethdev.o
  AR librte_pmd_e1000.a
  INSTALL-LIB librte_pmd_e1000.a
/tmp/UB1604-64_K4.4.0_GCC5.4.0/x86_64-native-linuxapp-gcc/ef64b8ea0d6a4027819f6af01be37668/dpdk/mk/rte.subdir.mk:35: recipe for target 'net' failed
make[4]: *** [net] Error 2
/tmp/UB1604-64_K4.4.0_GCC5.4.0/x86_64-native-linuxapp-gcc/ef64b8ea0d6a4027819f6af01be37668/dpdk/mk/rte.sdkbuild.mk:46: recipe for target 'drivers' failed
make[3]: *** [drivers] Error 2
/tmp/UB1604-64_K4.4.0_GCC5.4.0/x86_64-native-linuxapp-gcc/ef64b8ea0d6a4027819f6af01be37668/dpdk/mk/rte.sdkroot.mk:98: recipe for target 'all' failed
make[2]: *** [all] Error 2
/tmp/UB1604-64_K4.4.0_GCC5.4.0/x86_64-native-linuxapp-gcc/ef64b8ea0d6a4027819f6af01be37668/dpdk/mk/rte.sdkinstall.mk:60: recipe for target 'pre_install' failed
make[1]: *** [pre_install] Error 2
/tmp/UB1604-64_K4.4.0_GCC5.4.0/x86_64-native-linuxapp-gcc/ef64b8ea0d6a4027819f6af01be37668/dpdk/mk/rte.sdkroot.mk:77: recipe for target 'install' failed
make: *** [install] Error 2


*Make Build Failed #13:
OS: UB1804-64
Target: x86_64-native-linuxapp-gcc
    ret = rte_eth_allmulticast_enable(PORT_ID(sdev));
        ^
/tmp/UB1804-64_K4.15.0_GCC7.3.0/x86_64-native-linuxapp-gcc/ef64b8ea0d6a4027819f6af01be37668/dpdk/drivers/net/failsafe/failsafe_ops.c: At top level:
cc1: error: unrecognized command line option ‘-Wno-address-of-packed-member’ [-Werror]
cc1: all warnings being treated as errors
/tmp/UB1804-64_K4.15.0_GCC7.3.0/x86_64-native-linuxapp-gcc/ef64b8ea0d6a4027819f6af01be37668/dpdk/mk/internal/rte.compile-pre.mk:114: recipe for target 'failsafe_ops.o' failed
make[6]: *** [failsafe_ops.o] Error 1
/tmp/UB1804-64_K4.15.0_GCC7.3.0/x86_64-native-linuxapp-gcc/ef64b8ea0d6a4027819f6af01be37668/dpdk/mk/rte.subdir.mk:35: recipe for target 'failsafe' failed
make[5]: *** [failsafe] Error 2
make[5]: *** Waiting for unfinished jobs....
  CC iavf_common.o
  CC e1000_82571.o
  CC hinic_pmd_cfg.o
  PMDINFO ena_ethdev.o.pmd.c
--
  PMDINFO i40e_ethdev.o.pmd.c
  CC i40e_ethdev.o.pmd.o
  LD i40e_ethdev.o
  AR librte_pmd_i40e.a
  INSTALL-LIB librte_pmd_i40e.a
/tmp/UB1804-64_K4.15.0_GCC7.3.0/x86_64-native-linuxapp-gcc/ef64b8ea0d6a4027819f6af01be37668/dpdk/mk/rte.subdir.mk:35: recipe for target 'net' failed
make[4]: *** [net] Error 2
/tmp/UB1804-64_K4.15.0_GCC7.3.0/x86_64-native-linuxapp-gcc/ef64b8ea0d6a4027819f6af01be37668/dpdk/mk/rte.sdkbuild.mk:46: recipe for target 'drivers' failed
make[3]: *** [drivers] Error 2
/tmp/UB1804-64_K4.15.0_GCC7.3.0/x86_64-native-linuxapp-gcc/ef64b8ea0d6a4027819f6af01be37668/dpdk/mk/rte.sdkroot.mk:98: recipe for target 'all' failed
make[2]: *** [all] Error 2
/tmp/UB1804-64_K4.15.0_GCC7.3.0/x86_64-native-linuxapp-gcc/ef64b8ea0d6a4027819f6af01be37668/dpdk/mk/rte.sdkinstall.mk:60: recipe for target 'pre_install' failed
make[1]: *** [pre_install] Error 2
/tmp/UB1804-64_K4.15.0_GCC7.3.0/x86_64-native-linuxapp-gcc/ef64b8ea0d6a4027819f6af01be37668/dpdk/mk/rte.sdkroot.mk:77: recipe for target 'install' failed
make: *** [install] Error 2


*Make Build Failed #14:
OS: FreeBSD12-64
Target: x86_64-native-bsdapp-gcc
  INSTALL-LIB librte_pmd_atlantic.a
  CC e1000_mac.o
  CC clip_tbl.o
  AR librte_pmd_bnx2x.a
  INSTALL-LIB librte_pmd_bnx2x.a
gmake[6]: *** [/tmp/FreeBSD12-64_K19.02_GCC7.3.0/x86_64-native-bsdapp-gcc/ef64b8ea0d6a4027819f6af01be37668/dpdk/mk/internal/rte.compile-pre.mk:116: failsafe_ops.o] Error 1
gmake[6]: *** Waiting for unfinished jobs....
  CC failsafe_rxtx.o
  CC enic_flow.o
  CC i40e_nvm.o
  CC e1000_manage.o
--
  CC fm10k_common.o
  CC iavf_vchnl.o
  CC mps_tcam.o
== Build drivers/net/ipn3ke
  CC i40e_dcb.o
gmake[5]: *** [/tmp/FreeBSD12-64_K19.02_GCC7.3.0/x86_64-native-bsdapp-gcc/ef64b8ea0d6a4027819f6af01be37668/dpdk/mk/rte.subdir.mk:37: failsafe] Error 2
gmake[5]: *** Waiting for unfinished jobs....
  CC base/vnic_cq.o
  CC iavf_rxtx.o
  CC e1000_mbx.o
  CC fm10k_mbx.o
--
  PMDINFO ice_ethdev.o.pmd.c
  CC ice_ethdev.o.pmd.o
  LD ice_ethdev.o
  AR librte_pmd_ice.a
  INSTALL-LIB librte_pmd_ice.a
gmake[4]: *** [/tmp/FreeBSD12-64_K19.02_GCC7.3.0/x86_64-native-bsdapp-gcc/ef64b8ea0d6a4027819f6af01be37668/dpdk/mk/rte.subdir.mk:35: net] Error 2
gmake[3]: *** [/tmp/FreeBSD12-64_K19.02_GCC7.3.0/x86_64-native-bsdapp-gcc/ef64b8ea0d6a4027819f6af01be37668/dpdk/mk/rte.sdkbuild.mk:46: drivers] Error 2
gmake[2]: *** [/tmp/FreeBSD12-64_K19.02_GCC7.3.0/x86_64-native-bsdapp-gcc/ef64b8ea0d6a4027819f6af01be37668/dpdk/mk/rte.sdkroot.mk:99: all] Error 2
gmake[1]: *** [/tmp/FreeBSD12-64_K19.02_GCC7.3.0/x86_64-native-bsdapp-gcc/ef64b8ea0d6a4027819f6af01be37668/dpdk/mk/rte.sdkinstall.mk:61: pre_install] Error 2
gmake: *** [/tmp/FreeBSD12-64_K19.02_GCC7.3.0/x86_64-native-bsdapp-gcc/ef64b8ea0d6a4027819f6af01be37668/dpdk/mk/rte.sdkroot.mk:77: install] Error 2


*Make Build Failed #15:
OS: CENTOS76-64
Target: x86_64-native-linuxapp-gcc
    ret = rte_eth_allmulticast_enable(PORT_ID(sdev));
        ^
/tmp/CENTOS76-64_K3.10.0_GCC4.8.5/x86_64-native-linuxapp-gcc/ef64b8ea0d6a4027819f6af01be37668/dpdk/drivers/net/failsafe/failsafe_ops.c: At top level:
cc1: error: unrecognized command line option "-Wno-address-of-packed-member" [-Werror]
cc1: all warnings being treated as errors
make[6]: *** [failsafe_ops.o] Error 1
make[5]: *** [failsafe] Error 2
make[5]: *** Waiting for unfinished jobs....
  CC i40e_common.o
  CC e1000_api.o
  CC bnx2x_ethdev.o
  CC enic_res.o
--
  PMDINFO virtio_cryptodev.o.pmd.c
  CC virtio_cryptodev.o.pmd.o
  AR librte_pmd_i40e.a
  INSTALL-LIB librte_pmd_i40e.a
  LD virtio_cryptodev.o
make[4]: *** [net] Error 2
make[4]: *** Waiting for unfinished jobs....
  AR librte_pmd_virtio_crypto.a
  INSTALL-LIB librte_pmd_virtio_crypto.a
  PMDINFO caam_jr.o.pmd.c
  CC caam_jr.o.pmd.o
--
  PMDINFO dpaa2_sec_dpseci.o.pmd.c
  CC dpaa2_sec_dpseci.o.pmd.o
  LD dpaa2_sec_dpseci.o
  AR librte_pmd_dpaa2_sec.a
  INSTALL-LIB librte_pmd_dpaa2_sec.a
make[3]: *** [drivers] Error 2
make[2]: *** [all] Error 2
make[1]: *** [pre_install] Error 2
make: *** [install] Error 2


*Make Build Failed #16:
OS: CENTOS76-64
Target: x86_64-native-linuxapp-gcc+debug
    ret = rte_eth_allmulticast_enable(PORT_ID(sdev));
        ^
/tmp/CENTOS76-64_K3.10.0_GCC4.8.5/x86_64-native-linuxapp-gcc+debug/ef64b8ea0d6a4027819f6af01be37668/dpdk/drivers/net/failsafe/failsafe_ops.c: At top level:
cc1: error: unrecognized command line option "-Wno-address-of-packed-member" [-Werror]
cc1: all warnings being treated as errors
make[6]: *** [failsafe_ops.o] Error 1
make[6]: *** Waiting for unfinished jobs....
make[5]: *** [failsafe] Error 2
make[5]: *** Waiting for unfinished jobs....
  CC hinic_pmd_api_cmd.o
  CC hinic_pmd_cfg.o
  CC fm10k_ethdev.o
  CC base/vnic_wq.o
--
  AR librte_pmd_fm10k.a
  INSTALL-LIB librte_pmd_bnx2x.a
  INSTALL-LIB librte_pmd_fm10k.a
  AR librte_pmd_hinic.a
  INSTALL-LIB librte_pmd_hinic.a
make[4]: *** [net] Error 2
make[3]: *** [drivers] Error 2
make[2]: *** [all] Error 2
make[1]: *** [pre_install] Error 2
make: *** [install] Error 2


*Make Build Failed #17:
OS: CENTOS76-64
Target: x86_64-native-linuxapp-clang
                    ^ ~~~~~~~~~~~~~~~~~~~~~~~~~~~~~~~~~~~~~~~~~~~
/tmp/CENTOS76-64_K3.10.0_Clang3.4.2/x86_64-native-linuxapp-clang/ef64b8ea0d6a4027819f6af01be37668/dpdk/drivers/net/failsafe/failsafe_ops.c:731:8: error: assigning to 'int' from incompatible type 'void'
                        ret = rte_eth_allmulticast_enable(PORT_ID(sdev));
                            ^ ~~~~~~~~~~~~~~~~~~~~~~~~~~~~~~~~~~~~~~~~~~
4 errors generated.
make[6]: *** [failsafe_ops.o] Error 1
make[6]: *** Waiting for unfinished jobs....
  CC i40e_diag.o
  CC fm10k_vf.o
/tmp/CENTOS76-64_K3.10.0_Clang3.4.2/x86_64-native-linuxapp-clang/ef64b8ea0d6a4027819f6af01be37668/dpdk/drivers/net/failsafe/failsafe_ether.c:139:8: error: assigning to 'int' from incompatible type 'void'
                        ret = rte_eth_allmulticast_enable(PORT_ID(sdev));
                            ^ ~~~~~~~~~~~~~~~~~~~~~~~~~~~~~~~~~~~~~~~~~~
/tmp/CENTOS76-64_K3.10.0_Clang3.4.2/x86_64-native-linuxapp-clang/ef64b8ea0d6a4027819f6af01be37668/dpdk/drivers/net/failsafe/failsafe_ether.c:141:8: error: assigning to 'int' from incompatible type 'void'
                        ret = rte_eth_allmulticast_disable(PORT_ID(sdev));
                            ^ ~~~~~~~~~~~~~~~~~~~~~~~~~~~~~~~~~~~~~~~~~~~
2 errors generated.
make[6]: *** [failsafe_ether.o] Error 1
make[5]: *** [failsafe] Error 2
make[5]: *** Waiting for unfinished jobs....
  CC hinic_pmd_cmdq.o
  AR librte_pmd_e1000.a
  CC hinic_pmd_eqs.o
  INSTALL-LIB librte_pmd_e1000.a
--
  PMDINFO i40e_ethdev.o.pmd.c
  CC i40e_ethdev.o.pmd.o
  LD i40e_ethdev.o
  AR librte_pmd_i40e.a
  INSTALL-LIB librte_pmd_i40e.a
make[4]: *** [net] Error 2
make[3]: *** [drivers] Error 2
make[2]: *** [all] Error 2
make[1]: *** [pre_install] Error 2
make: *** [install] Error 2


*Make Build Failed #18:
OS: FreeBSD12-64
Target: x86_64-native-bsdapp-gcc+debug
    ret = rte_eth_allmulticast_enable(PORT_ID(sdev));
        ^
/tmp/FreeBSD12-64_K19.02_GCC7.3.0/x86_64-native-bsdapp-gcc+debug/ef64b8ea0d6a4027819f6af01be37668/dpdk/drivers/net/failsafe/failsafe_ops.c: At top level:
cc1: error: unrecognized command line option '-Wno-address-of-packed-member' [-Werror]
cc1: all warnings being treated as errors
gmake[6]: *** [/tmp/FreeBSD12-64_K19.02_GCC7.3.0/x86_64-native-bsdapp-gcc+debug/ef64b8ea0d6a4027819f6af01be37668/dpdk/mk/internal/rte.compile-pre.mk:116: failsafe_ops.o] Error 1
gmake[6]: *** Waiting for unfinished jobs....
  CC e1000_nvm.o
  SYMLINK-FILE include/rte_cryptodev_scheduler.h
gmake[5]: *** [/tmp/FreeBSD12-64_K19.02_GCC7.3.0/x86_64-native-bsdapp-gcc+debug/ef64b8ea0d6a4027819f6af01be37668/dpdk/mk/rte.subdir.mk:35: failsafe] Error 2
gmake[5]: *** Waiting for unfinished jobs....
  CC e1000_osdep.o
  CC scheduler_pmd.o
  CC t4vf_hw.o
  CC enic_flow.o
--
  INSTALL-LIB librte_pmd_enic.a
  AR librte_pmd_e1000.a
  INSTALL-LIB librte_pmd_e1000.a
  AR librte_pmd_fm10k.a
  INSTALL-LIB librte_pmd_fm10k.a
gmake[4]: *** [/tmp/FreeBSD12-64_K19.02_GCC7.3.0/x86_64-native-bsdapp-gcc+debug/ef64b8ea0d6a4027819f6af01be37668/dpdk/mk/rte.subdir.mk:35: net] Error 2
gmake[3]: *** [/tmp/FreeBSD12-64_K19.02_GCC7.3.0/x86_64-native-bsdapp-gcc+debug/ef64b8ea0d6a4027819f6af01be37668/dpdk/mk/rte.sdkbuild.mk:46: drivers] Error 2
gmake[2]: *** [/tmp/FreeBSD12-64_K19.02_GCC7.3.0/x86_64-native-bsdapp-gcc+debug/ef64b8ea0d6a4027819f6af01be37668/dpdk/mk/rte.sdkroot.mk:99: all] Error 2
gmake[1]: *** [/tmp/FreeBSD12-64_K19.02_GCC7.3.0/x86_64-native-bsdapp-gcc+debug/ef64b8ea0d6a4027819f6af01be37668/dpdk/mk/rte.sdkinstall.mk:61: pre_install] Error 2
gmake: *** [/tmp/FreeBSD12-64_K19.02_GCC7.3.0/x86_64-native-bsdapp-gcc+debug/ef64b8ea0d6a4027819f6af01be37668/dpdk/mk/rte.sdkroot.mk:77: install] Error 2


*Make Build Failed #19:
OS: CENTOS76-64
Target: x86_64-native-linuxapp-gcc+shared
        ^
  LD librte_pmd_dpaa2.so.2.1
/tmp/CENTOS76-64_K3.10.0_GCC4.8.5/x86_64-native-linuxapp-gcc+shared/ef64b8ea0d6a4027819f6af01be37668/dpdk/drivers/net/failsafe/failsafe_ops.c: At top level:
cc1: error: unrecognized command line option "-Wno-address-of-packed-member" [-Werror]
cc1: all warnings being treated as errors
make[6]: *** [failsafe_ops.o] Error 1
make[5]: *** [failsafe] Error 2
make[5]: *** Waiting for unfinished jobs....
  CC virtio_cryptodev.o
  CC igb_pf.o
  INSTALL-LIB librte_pmd_dpaa2.so.2.1
  CC igb_flow.o
--
  PMDINFO i40e_ethdev.o.pmd.c
  CC i40e_ethdev.o.pmd.o
  LD i40e_ethdev.o
  LD librte_pmd_i40e.so.2.1
  INSTALL-LIB librte_pmd_i40e.so.2.1
make[4]: *** [net] Error 2
make[3]: *** [drivers] Error 2
make[2]: *** [all] Error 2
make[1]: *** [pre_install] Error 2
make: *** [install] Error 2


*Make Build Failed #20:
OS: FreeBSD12-64
Target: x86_64-native-bsdapp-gcc+shared
        ^
/tmp/FreeBSD12-64_K19.02_GCC7.3.0/x86_64-native-bsdapp-gcc+shared/ef64b8ea0d6a4027819f6af01be37668/dpdk/drivers/net/failsafe/failsafe_ops.c: At top level:
cc1: error: unrecognized command line option '-Wno-address-of-packed-member' [-Werror]
  CC fm10k_rxtx.o
cc1: all warnings being treated as errors
gmake[6]: *** [/tmp/FreeBSD12-64_K19.02_GCC7.3.0/x86_64-native-bsdapp-gcc+shared/ef64b8ea0d6a4027819f6af01be37668/dpdk/mk/internal/rte.compile-pre.mk:114: failsafe_ops.o] Error 1
gmake[5]: *** [/tmp/FreeBSD12-64_K19.02_GCC7.3.0/x86_64-native-bsdapp-gcc+shared/ef64b8ea0d6a4027819f6af01be37668/dpdk/mk/rte.subdir.mk:37: failsafe] Error 2
  CC fm10k_pf.o
gmake[5]: *** Waiting for unfinished jobs....
  CC enic_flow.o
  CC fm10k_tlv.o
  SYMLINK-FILE include/rte_pmd_i40e.h
--
  PMDINFO ice_ethdev.o.pmd.c
  CC ice_ethdev.o.pmd.o
  LD ice_ethdev.o
  LD librte_pmd_ice.so.1.1
  INSTALL-LIB librte_pmd_ice.so.1.1
gmake[4]: *** [/tmp/FreeBSD12-64_K19.02_GCC7.3.0/x86_64-native-bsdapp-gcc+shared/ef64b8ea0d6a4027819f6af01be37668/dpdk/mk/rte.subdir.mk:35: net] Error 2
gmake[3]: *** [/tmp/FreeBSD12-64_K19.02_GCC7.3.0/x86_64-native-bsdapp-gcc+shared/ef64b8ea0d6a4027819f6af01be37668/dpdk/mk/rte.sdkbuild.mk:46: drivers] Error 2
gmake[2]: *** [/tmp/FreeBSD12-64_K19.02_GCC7.3.0/x86_64-native-bsdapp-gcc+shared/ef64b8ea0d6a4027819f6af01be37668/dpdk/mk/rte.sdkroot.mk:99: all] Error 2
gmake[1]: *** [/tmp/FreeBSD12-64_K19.02_GCC7.3.0/x86_64-native-bsdapp-gcc+shared/ef64b8ea0d6a4027819f6af01be37668/dpdk/mk/rte.sdkinstall.mk:61: pre_install] Error 2
gmake: *** [/tmp/FreeBSD12-64_K19.02_GCC7.3.0/x86_64-native-bsdapp-gcc+shared/ef64b8ea0d6a4027819f6af01be37668/dpdk/mk/rte.sdkroot.mk:77: install] Error 2


*Make Build Failed #21:
OS: CENTOS76-64
Target: x86_64-native-linuxapp-icc
/tmp/CENTOS76-64_K3.10.0_ICC19.0.0/x86_64-native-linuxapp-icc/ef64b8ea0d6a4027819f6af01be37668/dpdk/drivers/net/failsafe/failsafe_ops.c(731): error: a value of type "void" cannot be assigned to an entity of type "int"
  			ret = rte_eth_allmulticast_enable(PORT_ID(sdev));
  			    ^

compilation aborted for /tmp/CENTOS76-64_K3.10.0_ICC19.0.0/x86_64-native-linuxapp-icc/ef64b8ea0d6a4027819f6af01be37668/dpdk/drivers/net/failsafe/failsafe_ops.c (code 2)
make[6]: *** [failsafe_ops.o] Error 2
make[5]: *** [failsafe] Error 2
make[5]: *** Waiting for unfinished jobs....
  CC i40e_diag.o
  CC fm10k_tlv.o
  PMDINFO fm10k_ethdev.o.pmd.c
  CC fm10k_ethdev.o.pmd.o
--
  LD i40e_ethdev.o
  AR librte_pmd_i40e.a
  INSTALL-LIB librte_pmd_i40e.a
  AR librte_pmd_e1000.a
  INSTALL-LIB librte_pmd_e1000.a
make[4]: *** [net] Error 2
make[3]: *** [drivers] Error 2
make[2]: *** [all] Error 2
make[1]: *** [pre_install] Error 2
make: *** [install] Error 2


*Make Build Failed #22:
OS: FreeBSD12-64
Target: x86_64-native-bsdapp-clang
                    ^ ~~~~~~~~~~~~~~~~~~~~~~~~~~~~~~~~~~~~~~~~~~~
/tmp/FreeBSD12-64_K19.02_Clang6.0.1/x86_64-native-bsdapp-clang/ef64b8ea0d6a4027819f6af01be37668/dpdk/drivers/net/failsafe/failsafe_ops.c:731:8: error: assigning to 'int' from incompatible type 'void'
                        ret = rte_eth_allmulticast_enable(PORT_ID(sdev));
                            ^ ~~~~~~~~~~~~~~~~~~~~~~~~~~~~~~~~~~~~~~~~~~
4 errors generated.
gmake[6]: *** [/tmp/FreeBSD12-64_K19.02_Clang6.0.1/x86_64-native-bsdapp-clang/ef64b8ea0d6a4027819f6af01be37668/dpdk/mk/internal/rte.compile-pre.mk:116: failsafe_ops.o] Error 1
gmake[5]: *** [/tmp/FreeBSD12-64_K19.02_Clang6.0.1/x86_64-native-bsdapp-clang/ef64b8ea0d6a4027819f6af01be37668/dpdk/mk/rte.subdir.mk:35: failsafe] Error 2
gmake[5]: *** Waiting for unfinished jobs....
  CC ice_sched.o
  CC e1000_logs.o
  CC mps_tcam.o
  CC base/vnic_cq.o
--
  LD i40e_ethdev.o
  AR librte_pmd_i40e.a
  INSTALL-LIB librte_pmd_i40e.a
  AR librte_pmd_ice.a
  INSTALL-LIB librte_pmd_ice.a
gmake[4]: *** [/tmp/FreeBSD12-64_K19.02_Clang6.0.1/x86_64-native-bsdapp-clang/ef64b8ea0d6a4027819f6af01be37668/dpdk/mk/rte.subdir.mk:35: net] Error 2
gmake[3]: *** [/tmp/FreeBSD12-64_K19.02_Clang6.0.1/x86_64-native-bsdapp-clang/ef64b8ea0d6a4027819f6af01be37668/dpdk/mk/rte.sdkbuild.mk:46: drivers] Error 2
gmake[2]: *** [/tmp/FreeBSD12-64_K19.02_Clang6.0.1/x86_64-native-bsdapp-clang/ef64b8ea0d6a4027819f6af01be37668/dpdk/mk/rte.sdkroot.mk:99: all] Error 2
gmake[1]: *** [/tmp/FreeBSD12-64_K19.02_Clang6.0.1/x86_64-native-bsdapp-clang/ef64b8ea0d6a4027819f6af01be37668/dpdk/mk/rte.sdkinstall.mk:61: pre_install] Error 2
gmake: *** [/tmp/FreeBSD12-64_K19.02_Clang6.0.1/x86_64-native-bsdapp-clang/ef64b8ea0d6a4027819f6af01be37668/dpdk/mk/rte.sdkroot.mk:77: install] Error 2

*Meson Build Failed #1:
OS: SUSE15-64
Target:build-gcc-static
FAILED: drivers/a715181@@tmp_rte_pmd_failsafe at sta/net_failsafe_failsafe_ether.c.o 
gcc -Idrivers/a715181@@tmp_rte_pmd_failsafe at sta -Idrivers -I../drivers -Idrivers/net/failsafe -I../drivers/net/failsafe -Ilib/librte_ethdev -I../lib/librte_ethdev -I. -I../ -Iconfig -I../config -Ilib/librte_eal/common/include -I../lib/librte_eal/common/include -I../lib/librte_eal/linux/eal/include -Ilib/librte_eal/common -I../lib/librte_eal/common -Ilib/librte_eal/common/include/arch/x86 -I../lib/librte_eal/common/include/arch/x86 -Ilib/librte_eal -I../lib/librte_eal -Ilib/librte_kvargs -I../lib/librte_kvargs -Ilib/librte_net -I../lib/librte_net -Ilib/librte_mbuf -I../lib/librte_mbuf -Ilib/librte_mempool -I../lib/librte_mempool -Ilib/librte_ring -I../lib/librte_ring -Ilib/librte_meter -I../lib/librte_meter -Idrivers/bus/pci -I../drivers/bus/pci -I../drivers/bus/pci/linux -Ilib/librte_pci -I../lib/librte_pci -Idrivers/bus/vdev -I../drivers/bus/vdev -fdiagnostics-color=always -pipe -D_FILE_OFFSET_BITS=64 -Wall -Winvalid-pch -Werror -O3 -include rte_config.h -Wunused-parameter -Wsign-compare -Wcast-qual -D_GNU_SOURCE -fPIC -march=native -Wno-format-truncation -std=gnu99 -D_DEFAULT_SOURCE -D_XOPEN_SOURCE=700 -pedantic -DLINUX -DALLOW_EXPERIMENTAL_API -MD -MQ 'drivers/a715181@@tmp_rte_pmd_failsafe at sta/net_failsafe_failsafe_ether.c.o' -MF 'drivers/a715181@@tmp_rte_pmd_failsafe at sta/net_failsafe_failsafe_ether.c.o.d' -o 'drivers/a715181@@tmp_rte_pmd_failsafe at sta/net_failsafe_failsafe_ether.c.o' -c ../drivers/net/failsafe/failsafe_ether.c
../drivers/net/failsafe/failsafe_ether.c: In function ‘fs_eth_dev_conf_apply’:
../drivers/net/failsafe/failsafe_ether.c:139:8: error: void value not ignored as it ought to be
    ret = rte_eth_allmulticast_enable(PORT_ID(sdev));
        ^
../drivers/net/failsafe/failsafe_ether.c:141:8: error: void value not ignored as it ought to be
    ret = rte_eth_allmulticast_disable(PORT_ID(sdev));
        ^
[750/1831] Compiling C object 'drivers/a715181@@tmp_rte_pmd_enic at sta/net_enic_enic_rxtx_vec_avx2.c.o'.
[751/1831] Compiling C object 'drivers/net/fm10k/base/cb94eca@@fm10k_base at sta/fm10k_pf.c.o'.
[752/1831] Compiling C object 'drivers/a715181@@tmp_rte_pmd_failsafe at sta/net_failsafe_failsafe.c.o'.
[753/1831] Compiling C object 'drivers/a715181@@tmp_rte_pmd_failsafe at sta/net_failsafe_failsafe_flow.c.o'.
[754/1831] Compiling C object 'drivers/a715181@@tmp_rte_pmd_failsafe at sta/net_failsafe_failsafe_ops.c.o'.
FAILED: drivers/a715181@@tmp_rte_pmd_failsafe at sta/net_failsafe_failsafe_ops.c.o 
gcc -Idrivers/a715181@@tmp_rte_pmd_failsafe at sta -Idrivers -I../drivers -Idrivers/net/failsafe -I../drivers/net/failsafe -Ilib/librte_ethdev -I../lib/librte_ethdev -I. -I../ -Iconfig -I../config -Ilib/librte_eal/common/include -I../lib/librte_eal/common/include -I../lib/librte_eal/linux/eal/include -Ilib/librte_eal/common -I../lib/librte_eal/common -Ilib/librte_eal/common/include/arch/x86 -I../lib/librte_eal/common/include/arch/x86 -Ilib/librte_eal -I../lib/librte_eal -Ilib/librte_kvargs -I../lib/librte_kvargs -Ilib/librte_net -I../lib/librte_net -Ilib/librte_mbuf -I../lib/librte_mbuf -Ilib/librte_mempool -I../lib/librte_mempool -Ilib/librte_ring -I../lib/librte_ring -Ilib/librte_meter -I../lib/librte_meter -Idrivers/bus/pci -I../drivers/bus/pci -I../drivers/bus/pci/linux -Ilib/librte_pci -I../lib/librte_pci -Idrivers/bus/vdev -I../drivers/bus/vdev -fdiagnostics-color=always -pipe -D_FILE_OFFSET_BITS=64 -Wall -Winvalid-pch -Werror -O3 -include rte_config.h -Wunused-parameter -Wsign-compare -Wcast-qual -D_GNU_SOURCE -fPIC -march=native -Wno-format-truncation -std=gnu99 -D_DEFAULT_SOURCE -D_XOPEN_SOURCE=700 -pedantic -DLINUX -DALLOW_EXPERIMENTAL_API -MD -MQ 'drivers/a715181@@tmp_rte_pmd_failsafe at sta/net_failsafe_failsafe_ops.c.o' -MF 'drivers/a715181@@tmp_rte_pmd_failsafe at sta/net_failsafe_failsafe_ops.c.o.d' -o 'drivers/a715181@@tmp_rte_pmd_failsafe at sta/net_failsafe_failsafe_ops.c.o' -c ../drivers/net/failsafe/failsafe_ops.c
../drivers/net/failsafe/failsafe_ops.c: In function ‘fs_allmulticast_enable’:
../drivers/net/failsafe/failsafe_ops.c:690:7: error: void value not ignored as it ought to be
   ret = rte_eth_allmulticast_enable(PORT_ID(sdev));
       ^
../drivers/net/failsafe/failsafe_ops.c:701:8: error: void value not ignored as it ought to be
    ret = rte_eth_allmulticast_disable(PORT_ID(sdev));
        ^
../drivers/net/failsafe/failsafe_ops.c: In function ‘fs_allmulticast_disable’:
../drivers/net/failsafe/failsafe_ops.c:720:7: error: void value not ignored as it ought to be
   ret = rte_eth_allmulticast_disable(PORT_ID(sdev));
       ^
../drivers/net/failsafe/failsafe_ops.c:731:8: error: void value not ignored as it ought to be
    ret = rte_eth_allmulticast_enable(PORT_ID(sdev));
        ^
[755/1831] Compiling C object 'drivers/a715181@@tmp_rte_pmd_enic at sta/net_enic_enic_main.c.o'.
[756/1831] Compiling C object 'drivers/a715181@@tmp_rte_pmd_failsafe at sta/net_failsafe_failsafe_intr.c.o'.
ninja: build stopped: subcommand failed




*Meson Build Failed #2:
OS: FC30-64
Target:build-gcc-static
FAILED: drivers/a715181@@tmp_rte_pmd_failsafe at sta/net_failsafe_failsafe_ether.c.o 
gcc -Idrivers/a715181@@tmp_rte_pmd_failsafe at sta -Idrivers -I../drivers -Idrivers/net/failsafe -I../drivers/net/failsafe -Ilib/librte_ethdev -I../lib/librte_ethdev -I. -I../ -Iconfig -I../config -Ilib/librte_eal/common/include -I../lib/librte_eal/common/include -I../lib/librte_eal/linux/eal/include -Ilib/librte_eal/common -I../lib/librte_eal/common -Ilib/librte_eal/common/include/arch/x86 -I../lib/librte_eal/common/include/arch/x86 -Ilib/librte_eal -I../lib/librte_eal -Ilib/librte_kvargs -I../lib/librte_kvargs -Ilib/librte_net -I../lib/librte_net -Ilib/librte_mbuf -I../lib/librte_mbuf -Ilib/librte_mempool -I../lib/librte_mempool -Ilib/librte_ring -I../lib/librte_ring -Ilib/librte_meter -I../lib/librte_meter -Idrivers/bus/pci -I../drivers/bus/pci -I../drivers/bus/pci/linux -Ilib/librte_pci -I../lib/librte_pci -Idrivers/bus/vdev -I../drivers/bus/vdev -fdiagnostics-color=always -pipe -D_FILE_OFFSET_BITS=64 -Wall -Winvalid-pch -Werror -O3 -include rte_config.h -Wunused-parameter -Wsign-compare -Wcast-qual -Wno-address-of-packed-member -D_GNU_SOURCE -fPIC -march=native -mno-avx512f -Wno-format-truncation -std=gnu99 -D_DEFAULT_SOURCE -D_XOPEN_SOURCE=700 -pedantic -DLINUX -DALLOW_EXPERIMENTAL_API -MD -MQ 'drivers/a715181@@tmp_rte_pmd_failsafe at sta/net_failsafe_failsafe_ether.c.o' -MF 'drivers/a715181@@tmp_rte_pmd_failsafe at sta/net_failsafe_failsafe_ether.c.o.d' -o 'drivers/a715181@@tmp_rte_pmd_failsafe at sta/net_failsafe_failsafe_ether.c.o' -c ../drivers/net/failsafe/failsafe_ether.c
../drivers/net/failsafe/failsafe_ether.c: In function ‘fs_eth_dev_conf_apply’:
../drivers/net/failsafe/failsafe_ether.c:139:8: error: void value not ignored as it ought to be
  139 |    ret = rte_eth_allmulticast_enable(PORT_ID(sdev));
      |        ^
../drivers/net/failsafe/failsafe_ether.c:141:8: error: void value not ignored as it ought to be
  141 |    ret = rte_eth_allmulticast_disable(PORT_ID(sdev));
      |        ^
[738/1784] Compiling C object 'drivers/a715181@@tmp_rte_pmd_enic at sta/net_enic_enic_rxtx_vec_avx2.c.o'.
[739/1784] Compiling C object 'drivers/a715181@@tmp_rte_pmd_failsafe at sta/net_failsafe_failsafe.c.o'.
[740/1784] Compiling C object 'drivers/a715181@@tmp_rte_pmd_failsafe at sta/net_failsafe_failsafe_eal.c.o'.
[741/1784] Compiling C object 'drivers/net/fm10k/base/cb94eca@@fm10k_base at sta/fm10k_pf.c.o'.
[742/1784] Compiling C object 'drivers/a715181@@tmp_rte_pmd_failsafe at sta/net_failsafe_failsafe_args.c.o'.
[743/1784] Compiling C object 'drivers/a715181@@tmp_rte_pmd_failsafe at sta/net_failsafe_failsafe_flow.c.o'.
[744/1784] Compiling C object 'drivers/a715181@@tmp_rte_pmd_enic at sta/net_enic_enic_main.c.o'.
ninja: build stopped: subcommand failed




*Meson Build Failed #3:
OS: UB1604-32
Target:build-gcc-static
FAILED: drivers/a715181@@tmp_rte_pmd_failsafe at sta/net_failsafe_failsafe_ether.c.o 
gcc -Idrivers/a715181@@tmp_rte_pmd_failsafe at sta -Idrivers -I../drivers -Idrivers/net/failsafe -I../drivers/net/failsafe -Ilib/librte_ethdev -I../lib/librte_ethdev -I. -I../ -Iconfig -I../config -Ilib/librte_eal/common/include -I../lib/librte_eal/common/include -I../lib/librte_eal/linux/eal/include -Ilib/librte_eal/common -I../lib/librte_eal/common -Ilib/librte_eal/common/include/arch/x86 -I../lib/librte_eal/common/include/arch/x86 -Ilib/librte_eal -I../lib/librte_eal -Ilib/librte_kvargs -I../lib/librte_kvargs -Ilib/librte_net -I../lib/librte_net -Ilib/librte_mbuf -I../lib/librte_mbuf -Ilib/librte_mempool -I../lib/librte_mempool -Ilib/librte_ring -I../lib/librte_ring -Ilib/librte_meter -I../lib/librte_meter -Idrivers/bus/pci -I../drivers/bus/pci -I../drivers/bus/pci/linux -Ilib/librte_pci -I../lib/librte_pci -Idrivers/bus/vdev -I../drivers/bus/vdev -fdiagnostics-color=always -pipe -D_FILE_OFFSET_BITS=64 -Wall -Winvalid-pch -Werror -O3 -include rte_config.h -Wunused-parameter -Wsign-compare -Wcast-qual -Wno-pointer-to-int-cast -D_GNU_SOURCE -fPIC -march=native -std=gnu99 -D_DEFAULT_SOURCE -D_XOPEN_SOURCE=700 -pedantic -DLINUX -DALLOW_EXPERIMENTAL_API -MD -MQ 'drivers/a715181@@tmp_rte_pmd_failsafe at sta/net_failsafe_failsafe_ether.c.o' -MF 'drivers/a715181@@tmp_rte_pmd_failsafe at sta/net_failsafe_failsafe_ether.c.o.d' -o 'drivers/a715181@@tmp_rte_pmd_failsafe at sta/net_failsafe_failsafe_ether.c.o' -c ../drivers/net/failsafe/failsafe_ether.c
../drivers/net/failsafe/failsafe_ether.c: In function ‘fs_eth_dev_conf_apply’:
../drivers/net/failsafe/failsafe_ether.c:139:8: error: void value not ignored as it ought to be
    ret = rte_eth_allmulticast_enable(PORT_ID(sdev));
        ^
../drivers/net/failsafe/failsafe_ether.c:141:8: error: void value not ignored as it ought to be
    ret = rte_eth_allmulticast_disable(PORT_ID(sdev));
        ^
[731/1656] Compiling C object 'drivers/a715181@@tmp_rte_pmd_failsafe at sta/net_failsafe_failsafe.c.o'.
[732/1656] Compiling C object 'drivers/a715181@@tmp_rte_pmd_enic at sta/net_enic_enic_main.c.o'.
[733/1656] Compiling C object 'drivers/a715181@@tmp_rte_pmd_failsafe at sta/net_failsafe_failsafe_eal.c.o'.
[734/1656] Compiling C object 'drivers/a715181@@tmp_rte_pmd_enic at sta/net_enic_enic_rxtx.c.o'.
[735/1656] Compiling C object 'drivers/a715181@@tmp_rte_pmd_octeontx2_event at sta/event_octeontx2_otx2_worker.c.o'.
ninja: build stopped: subcommand failed




*Meson Build Failed #4:
OS: UB1804-64
Target:build-gcc-static
FAILED: drivers/a715181@@tmp_rte_pmd_failsafe at sta/net_failsafe_failsafe_ether.c.o 
gcc -Idrivers/a715181@@tmp_rte_pmd_failsafe at sta -Idrivers -I../drivers -Idrivers/net/failsafe -I../drivers/net/failsafe -Ilib/librte_ethdev -I../lib/librte_ethdev -I. -I../ -Iconfig -I../config -Ilib/librte_eal/common/include -I../lib/librte_eal/common/include -I../lib/librte_eal/linux/eal/include -Ilib/librte_eal/common -I../lib/librte_eal/common -Ilib/librte_eal/common/include/arch/x86 -I../lib/librte_eal/common/include/arch/x86 -Ilib/librte_eal -I../lib/librte_eal -Ilib/librte_kvargs -I../lib/librte_kvargs -Ilib/librte_net -I../lib/librte_net -Ilib/librte_mbuf -I../lib/librte_mbuf -Ilib/librte_mempool -I../lib/librte_mempool -Ilib/librte_ring -I../lib/librte_ring -Ilib/librte_meter -I../lib/librte_meter -Idrivers/bus/pci -I../drivers/bus/pci -I../drivers/bus/pci/linux -Ilib/librte_pci -I../lib/librte_pci -Idrivers/bus/vdev -I../drivers/bus/vdev -fdiagnostics-color=always -pipe -D_FILE_OFFSET_BITS=64 -Wall -Winvalid-pch -Werror -O3 -include rte_config.h -Wunused-parameter -Wsign-compare -Wcast-qual -D_GNU_SOURCE -fPIC -march=native -mno-avx512f -Wno-format-truncation -std=gnu99 -D_DEFAULT_SOURCE -D_XOPEN_SOURCE=700 -pedantic -DLINUX -DALLOW_EXPERIMENTAL_API -MD -MQ 'drivers/a715181@@tmp_rte_pmd_failsafe at sta/net_failsafe_failsafe_ether.c.o' -MF 'drivers/a715181@@tmp_rte_pmd_failsafe at sta/net_failsafe_failsafe_ether.c.o.d' -o 'drivers/a715181@@tmp_rte_pmd_failsafe at sta/net_failsafe_failsafe_ether.c.o' -c ../drivers/net/failsafe/failsafe_ether.c
../drivers/net/failsafe/failsafe_ether.c: In function ‘fs_eth_dev_conf_apply’:
../drivers/net/failsafe/failsafe_ether.c:139:8: error: void value not ignored as it ought to be
    ret = rte_eth_allmulticast_enable(PORT_ID(sdev));
        ^
../drivers/net/failsafe/failsafe_ether.c:141:8: error: void value not ignored as it ought to be
    ret = rte_eth_allmulticast_disable(PORT_ID(sdev));
        ^
[754/1791] Generating rte_pmd_enic.pmd.c with a custom command.
[755/1791] Compiling C object 'drivers/a715181@@tmp_rte_pmd_failsafe at sta/net_failsafe_failsafe_flow.c.o'.
[756/1791] Compiling C object 'drivers/net/fm10k/base/cb94eca@@fm10k_base at sta/fm10k_pf.c.o'.
[757/1791] Compiling C object 'drivers/a715181@@tmp_rte_pmd_failsafe at sta/net_failsafe_failsafe_ops.c.o'.
FAILED: drivers/a715181@@tmp_rte_pmd_failsafe at sta/net_failsafe_failsafe_ops.c.o 
gcc -Idrivers/a715181@@tmp_rte_pmd_failsafe at sta -Idrivers -I../drivers -Idrivers/net/failsafe -I../drivers/net/failsafe -Ilib/librte_ethdev -I../lib/librte_ethdev -I. -I../ -Iconfig -I../config -Ilib/librte_eal/common/include -I../lib/librte_eal/common/include -I../lib/librte_eal/linux/eal/include -Ilib/librte_eal/common -I../lib/librte_eal/common -Ilib/librte_eal/common/include/arch/x86 -I../lib/librte_eal/common/include/arch/x86 -Ilib/librte_eal -I../lib/librte_eal -Ilib/librte_kvargs -I../lib/librte_kvargs -Ilib/librte_net -I../lib/librte_net -Ilib/librte_mbuf -I../lib/librte_mbuf -Ilib/librte_mempool -I../lib/librte_mempool -Ilib/librte_ring -I../lib/librte_ring -Ilib/librte_meter -I../lib/librte_meter -Idrivers/bus/pci -I../drivers/bus/pci -I../drivers/bus/pci/linux -Ilib/librte_pci -I../lib/librte_pci -Idrivers/bus/vdev -I../drivers/bus/vdev -fdiagnostics-color=always -pipe -D_FILE_OFFSET_BITS=64 -Wall -Winvalid-pch -Werror -O3 -include rte_config.h -Wunused-parameter -Wsign-compare -Wcast-qual -D_GNU_SOURCE -fPIC -march=native -mno-avx512f -Wno-format-truncation -std=gnu99 -D_DEFAULT_SOURCE -D_XOPEN_SOURCE=700 -pedantic -DLINUX -DALLOW_EXPERIMENTAL_API -MD -MQ 'drivers/a715181@@tmp_rte_pmd_failsafe at sta/net_failsafe_failsafe_ops.c.o' -MF 'drivers/a715181@@tmp_rte_pmd_failsafe at sta/net_failsafe_failsafe_ops.c.o.d' -o 'drivers/a715181@@tmp_rte_pmd_failsafe at sta/net_failsafe_failsafe_ops.c.o' -c ../drivers/net/failsafe/failsafe_ops.c
../drivers/net/failsafe/failsafe_ops.c: In function ‘fs_allmulticast_enable’:
../drivers/net/failsafe/failsafe_ops.c:690:7: error: void value not ignored as it ought to be
   ret = rte_eth_allmulticast_enable(PORT_ID(sdev));
       ^
../drivers/net/failsafe/failsafe_ops.c:701:8: error: void value not ignored as it ought to be
    ret = rte_eth_allmulticast_disable(PORT_ID(sdev));
        ^
../drivers/net/failsafe/failsafe_ops.c: In function ‘fs_allmulticast_disable’:
../drivers/net/failsafe/failsafe_ops.c:720:7: error: void value not ignored as it ought to be
   ret = rte_eth_allmulticast_disable(PORT_ID(sdev));
       ^
../drivers/net/failsafe/failsafe_ops.c:731:8: error: void value not ignored as it ought to be
    ret = rte_eth_allmulticast_enable(PORT_ID(sdev));
        ^
[758/1791] Compiling C object 'drivers/a715181@@tmp_rte_pmd_failsafe at sta/net_failsafe_failsafe_intr.c.o'.
ninja: build stopped: subcommand failed




*Meson Build Failed #5:
OS: FreeBSD12-64
Target:build-gcc-static
FAILED: drivers/a715181@@tmp_rte_pmd_failsafe at sta/net_failsafe_failsafe_ether.c.o 
ccache gcc -Idrivers/a715181@@tmp_rte_pmd_failsafe at sta -Idrivers -I../drivers -Idrivers/net/failsafe -I../drivers/net/failsafe -Ilib/librte_ethdev -I../lib/librte_ethdev -I. -I../ -Iconfig -I../config -Ilib/librte_eal/common/include -I../lib/librte_eal/common/include -I../lib/librte_eal/freebsd/eal/include -Ilib/librte_eal/common -I../lib/librte_eal/common -Ilib/librte_eal/common/include/arch/x86 -I../lib/librte_eal/common/include/arch/x86 -Ilib/librte_eal -I../lib/librte_eal -Ilib/librte_kvargs -I../lib/librte_kvargs -Ilib/librte_net -I../lib/librte_net -Ilib/librte_mbuf -I../lib/librte_mbuf -Ilib/librte_mempool -I../lib/librte_mempool -Ilib/librte_ring -I../lib/librte_ring -Ilib/librte_meter -I../lib/librte_meter -Idrivers/bus/pci -I../drivers/bus/pci -I../drivers/bus/pci/bsd -Ilib/librte_pci -I../lib/librte_pci -Idrivers/bus/vdev -I../drivers/bus/vdev -fdiagnostics-color=always -pipe -D_FILE_OFFSET_BITS=64 -Wall -Winvalid-pch -Werror -O3 -include rte_config.h -Wunused-parameter -Wsign-compare -Wcast-qual -D_GNU_SOURCE -D__BSD_VISIBLE -fPIC -march=native -Wno-format-truncation -std=gnu99 -D_DEFAULT_SOURCE -D_XOPEN_SOURCE=700 -pedantic -DBSD -DALLOW_EXPERIMENTAL_API -MD -MQ 'drivers/a715181@@tmp_rte_pmd_failsafe at sta/net_failsafe_failsafe_ether.c.o' -MF 'drivers/a715181@@tmp_rte_pmd_failsafe at sta/net_failsafe_failsafe_ether.c.o.d' -o 'drivers/a715181@@tmp_rte_pmd_failsafe at sta/net_failsafe_failsafe_ether.c.o' -c ../drivers/net/failsafe/failsafe_ether.c
../drivers/net/failsafe/failsafe_ether.c: In function 'fs_eth_dev_conf_apply':
../drivers/net/failsafe/failsafe_ether.c:139:8: error: void value not ignored as it ought to be
    ret = rte_eth_allmulticast_enable(PORT_ID(sdev));
        ^
../drivers/net/failsafe/failsafe_ether.c:141:8: error: void value not ignored as it ought to be
    ret = rte_eth_allmulticast_disable(PORT_ID(sdev));
        ^
[755/1413] Linking static target drivers/libtmp_rte_pmd_hinic.a.
[756/1413] Compiling C object 'drivers/a715181@@tmp_rte_pmd_failsafe at sta/net_failsafe_failsafe_ops.c.o'.
FAILED: drivers/a715181@@tmp_rte_pmd_failsafe at sta/net_failsafe_failsafe_ops.c.o 
ccache gcc -Idrivers/a715181@@tmp_rte_pmd_failsafe at sta -Idrivers -I../drivers -Idrivers/net/failsafe -I../drivers/net/failsafe -Ilib/librte_ethdev -I../lib/librte_ethdev -I. -I../ -Iconfig -I../config -Ilib/librte_eal/common/include -I../lib/librte_eal/common/include -I../lib/librte_eal/freebsd/eal/include -Ilib/librte_eal/common -I../lib/librte_eal/common -Ilib/librte_eal/common/include/arch/x86 -I../lib/librte_eal/common/include/arch/x86 -Ilib/librte_eal -I../lib/librte_eal -Ilib/librte_kvargs -I../lib/librte_kvargs -Ilib/librte_net -I../lib/librte_net -Ilib/librte_mbuf -I../lib/librte_mbuf -Ilib/librte_mempool -I../lib/librte_mempool -Ilib/librte_ring -I../lib/librte_ring -Ilib/librte_meter -I../lib/librte_meter -Idrivers/bus/pci -I../drivers/bus/pci -I../drivers/bus/pci/bsd -Ilib/librte_pci -I../lib/librte_pci -Idrivers/bus/vdev -I../drivers/bus/vdev -fdiagnostics-color=always -pipe -D_FILE_OFFSET_BITS=64 -Wall -Winvalid-pch -Werror -O3 -include rte_config.h -Wunused-parameter -Wsign-compare -Wcast-qual -D_GNU_SOURCE -D__BSD_VISIBLE -fPIC -march=native -Wno-format-truncation -std=gnu99 -D_DEFAULT_SOURCE -D_XOPEN_SOURCE=700 -pedantic -DBSD -DALLOW_EXPERIMENTAL_API -MD -MQ 'drivers/a715181@@tmp_rte_pmd_failsafe at sta/net_failsafe_failsafe_ops.c.o' -MF 'drivers/a715181@@tmp_rte_pmd_failsafe at sta/net_failsafe_failsafe_ops.c.o.d' -o 'drivers/a715181@@tmp_rte_pmd_failsafe at sta/net_failsafe_failsafe_ops.c.o' -c ../drivers/net/failsafe/failsafe_ops.c
../drivers/net/failsafe/failsafe_ops.c: In function 'fs_allmulticast_enable':
../drivers/net/failsafe/failsafe_ops.c:690:7: error: void value not ignored as it ought to be
   ret = rte_eth_allmulticast_enable(PORT_ID(sdev));
       ^
../drivers/net/failsafe/failsafe_ops.c:701:8: error: void value not ignored as it ought to be
    ret = rte_eth_allmulticast_disable(PORT_ID(sdev));
        ^
../drivers/net/failsafe/failsafe_ops.c: In function 'fs_allmulticast_disable':
../drivers/net/failsafe/failsafe_ops.c:720:7: error: void value not ignored as it ought to be
   ret = rte_eth_allmulticast_disable(PORT_ID(sdev));
       ^
../drivers/net/failsafe/failsafe_ops.c:731:8: error: void value not ignored as it ought to be
    ret = rte_eth_allmulticast_enable(PORT_ID(sdev));
        ^
[757/1413] Compiling C object 'drivers/net/iavf/base/8bd2c99@@iavf_base at sta/iavf_adminq.c.o'.
[758/1413] Compiling C object 'drivers/net/iavf/base/8bd2c99@@iavf_base at sta/iavf_common.c.o'.
[759/1413] Generating rte_pmd_i40e.pmd.c with a custom command.
ninja: build stopped: subcommand failed



DPDK STV team


More information about the test-report mailing list