[dpdk-test-report] |FAILURE| pw59065[02/18] ethdev: change link status get functions return value to int

sys_stv at intel.com sys_stv at intel.com
Tue Sep 10 11:24:08 CEST 2019


Test-Label: Intel-compilation
Test-Status: FAILURE
http://dpdk.org/patch/59065

_Compilation issues_

Submitter: Andrew Rybchenko <arybchenko at solarflare.com>
Date: 2019-09-10 08:25:42
Reply_mail: 1568103959-25572-3-git-send-email-arybchenko at solarflare.com
DPDK git baseline: Repo:dpdk, CommitID: d03d8622db48918d14bfe805641b1766ecc40088

Makefile build Summary: 22 Builds Done, 0 Successful, 22 Failures

Meson build Summary: 7 Builds Done, 2 Successful, 5 Failures

               +==============================================+===========+==========+
               |                   Makefile                   |   Meson   | Document |
+--------------+------+-------+------+------------+-----------+-----------+----------+
| os           | gcc  | clang | icc  | gcc+shared | gcc+debug | gcc/clang | pdf/html |
+--------------+------+-------+------+------------+-----------+-----------+----------+
| RHEL76-64    | FAIL |       |      |            |           |           |          |
| CENTOS76-64  | FAIL | FAIL  | FAIL | FAIL       | FAIL      |           |          |
| UB1804-64    | FAIL | FAIL  | FAIL |            |           | FAIL      | pass     |
| UB1604-32    | FAIL |       |      |            |           | FAIL      |          |
| UB1904-64    | FAIL |       |      |            |           |           |          |
| UB1604-64    | FAIL | FAIL  |      |            |           |           |          |
| FC30-64      | FAIL | FAIL  |      |            |           | FAIL      |          |
| WIN10-64     |      |       |      |            |           | pass      |          |
| FreeBSD12-64 | FAIL | FAIL  |      | FAIL       | FAIL      | FAIL      |          |
| RHEL80-64    | FAIL |       |      |            |           |           |          |
| SUSE15-64    | FAIL | FAIL  |      |            |           | FAIL      |          |
+--------------+------+-------+------+------------+-----------+-----------+----------+

Test environment and configuration as below:

** Makefile build **


OS: RHEL76-64
	Kernel Version: 3.10.0-957.el7.x86_64
	CPU info: Intel(R) Xeon(R) CPU E5-2699 v4 @ 2.20GHz
	GCC Version: gcc (GCC) 4.8.5 20150623 (Red Hat 4.8.5-36)
	Clang Version: NA
	x86_64-native-linuxapp-gcc


OS: CENTOS76-64
	Kernel Version: 3.10.0-957.10.1.el7.x86_64
	CPU info: Intel(R) Xeon(R) CPU E5-2699 v4 @ 2.20GHz
	GCC Version: gcc (GCC) 4.8.5 20150623 (Red Hat 4.8.5-36)
	Clang Version: 3.4.2 (tags/RELEASE_34/dot2-final)
	x86_64-native-linuxapp-gcc+debug
	x86_64-native-linuxapp-gcc
	x86_64-native-linuxapp-clang
	x86_64-native-linuxapp-icc
	x86_64-native-linuxapp-gcc+shared


OS: UB1804-64
	Kernel Version: 4.15.0-20-generic
	CPU info: Intel(R) Xeon(R) CPU E5-2699 v3 @ 2.30GHz
	GCC Version: gcc (Ubuntu 7.3.0-27ubuntu1~18.04) 7.3.0
	Clang Version: 6.0.0-1ubuntu2 (tags/RELEASE_600/final)
	x86_64-native-linuxapp-icc
	x86_64-native-linuxapp-clang
	x86_64-native-linuxapp-gcc


OS: UB1904-64
	Kernel Version: 5.0.0-13-generic
	CPU info: Intel(R) Xeon(R) CPU E5-2699 v3 @ 2.30GHz
	GCC Version: gcc (Ubuntu 8.3.0-6ubuntu1) 8.3.0
	Clang Version: 8.0.0-3 (tags/RELEASE_800/final)
	x86_64-native-linuxapp-gcc


OS: UB1604-32
	Kernel Version: 4.4.0-131-generic
	CPU info: Intel(R) Xeon(R) CPU E5-2699 v3 @ 2.30GHz
	GCC Version: gcc (Ubuntu 5.4.0-6ubuntu1~16.04.11) 5.4.0 20160609
	Clang Version: 3.8.0-2ubuntu4 (tags/RELEASE_380/final)
	i686-native-linuxapp-gcc


OS: UB1604-64
	Kernel Version: 4.4.0-47-generic
	CPU info: Intel(R) Xeon(R) CPU E5-2699 v3 @ 2.30GHz
	GCC Version: gcc (Ubuntu 5.4.0-6ubuntu1~16.04.10) 5.4.0 20160609
	Clang Version: 3.8.0-2ubuntu4 (tags/RELEASE_380/final)
	x86_64-native-linuxapp-clang
	x86_64-native-linuxapp-gcc


OS: FC30-64
	Kernel Version: 5.1.7-300.fc30.x86_64
	CPU info: Intel(R) Xeon(R) CPU E5-2699 v4 @ 2.20GHz
	GCC Version: gcc (GCC) 9.1.1 20190503 (Red Hat 9.1.1-1)
	Clang Version: 8.0.0 (Fedora 8.0.0-1.fc30)
	x86_64-native-linuxapp-gcc
	x86_64-native-linuxapp-clang


OS: FreeBSD12-64
	Kernel Version: 12.0-RC3
	CPU info: Intel(R) Xeon(R) CPU E5-2699 v4 @ 2.20GHz (2194.97-MHz K8-class CPU)
	GCC Version: gcc (FreeBSD Ports Collection) 7.3.0
	Clang Version: 6.0.1 (tags/RELEASE_601/final 335540) (based on LLVM 6.0.1)
	x86_64-native-bsdapp-gcc+shared
	x86_64-native-bsdapp-gcc+debug
	x86_64-native-bsdapp-gcc
	x86_64-native-bsdapp-clang


OS: RHEL80-64
	Kernel Version: 4.18.0-80.el8.x86_64
	CPU info: Intel(R) Xeon(R) CPU E5-2699 v4 @ 2.20GHz
	GCC Version: gcc (GCC) 8.2.1 20180905 (Red Hat 8.2.1-3)
	Clang Version: 6.0.1 (tags/RELEASE_601/final)
	x86_64-native-linuxapp-gcc


OS: SUSE15-64
	Kernel Version: 4.12.14-lp150.11-default
	CPU info: Intel(R) Xeon(R) CPU E5-2699 v4 @ 2.20GHz
	GCC Version: gcc (SUSE Linux) 7.3.1 20180323 [gcc-7-branch revision 258812]
	Clang Version: 5.0.1 (tags/RELEASE_501/final 312548)
	x86_64-native-linuxapp-gcc
	x86_64-native-linuxapp-clang


** Meson build **


OS: UB1804-64
	Kernel Version: 4.15.0-20-generic
	CPU info: Intel(R) Xeon(R) CPU E5-2699 v4 @ 2.20GHz
	GCC Version: gcc (Ubuntu 7.3.0-27ubuntu1~18.04) 7.3.0
	Clang Version: 6.0.0-1ubuntu2 (tags/RELEASE_600/final)
	x86_64-native-linuxapp-doc
	build-gcc-static
	build-gcc-shared
	build-clang-static
	build-clang-shared
	build-x86-default


OS: UB1604-32
	Kernel Version: 4.4.0-131-generic
	CPU info: Intel(R) Xeon(R) CPU E5-2699 v4 @ 2.20GHz
	GCC Version: gcc (Ubuntu 5.4.0-6ubuntu1~16.04.11) 5.4.0 20160609
	Clang Version: 3.8.0-2ubuntu4 (tags/RELEASE_380/final)
	build-gcc-static
	build-gcc-shared
	build-clang-static
	build-clang-shared
	build-x86-default


OS: FC30-64
	Kernel Version: 5.0.9-301.fc30.x86_64
	CPU info: Intel(R) Xeon(R) CPU E5-2699 v4 @ 2.20GHz
	GCC Version: gcc (GCC) 9.1.1 20190503 (Red Hat 9.1.1-1)
	Clang Version: 8.0.0 (Fedora 8.0.0-1.fc30)
	build-gcc-static
	build-gcc-shared
	build-clang-static
	build-clang-shared
	build-x86-default


OS: WIN10-64
	Kernel Version: N/A
	CPU info: N/A
	GCC Version: N/A
	Clang Version: Clang 8.0.0
	x86_64-windows-clang


OS: FreeBSD12-64
	Kernel Version: 12.0-RC3
	CPU info: Intel(R) Xeon(R) CPU E5-2699 v4 @ 2.20GHz (2194.99-MHz K8-class CPU)
	GCC Version: gcc (FreeBSD Ports Collection) 7.3.0
	Clang Version: 6.0.1 (tags/RELEASE_601/final 335540) (based on LLVM 6.0.1)
	build-gcc-static
	build-gcc-shared
	build-clang-static
	build-clang-shared
	build-x86-default


OS: SUSE15-64
	Kernel Version: 4.12.14-lp150.11-default
	CPU info: Intel(R) Xeon(R) CPU E5-2699 v4 @ 2.20GHz
	GCC Version: gcc (SUSE Linux) 7.3.1 20180323 [gcc-7-branch revision 258812]
	Clang Version: 5.0.1 (tags/RELEASE_501/final 312548)
	build-gcc-static
	build-gcc-shared
	build-clang-static
	build-clang-shared
	build-x86-default


*Make Build Failed #1:
OS: UB1604-64
Target: x86_64-native-linuxapp-clang
                    ^
/tmp/UB1604-64_K4.4.0_Clang3.8.0/x86_64-native-linuxapp-clang/2acd0aee01f44ce7b4412069883abdfb/dpdk/drivers/net/bonding/rte_eth_bond_api.c:572:34: error: use of undeclared identifier 'ret'
                                slave_port_id, rte_strerror(-ret));
                                                             ^
3 errors generated.
/tmp/UB1604-64_K4.4.0_Clang3.8.0/x86_64-native-linuxapp-clang/2acd0aee01f44ce7b4412069883abdfb/dpdk/mk/internal/rte.compile-pre.mk:114: recipe for target 'rte_eth_bond_api.o' failed
make[6]: *** [rte_eth_bond_api.o] Error 1
/tmp/UB1604-64_K4.4.0_Clang3.8.0/x86_64-native-linuxapp-clang/2acd0aee01f44ce7b4412069883abdfb/dpdk/mk/rte.subdir.mk:35: recipe for target 'bonding' failed
make[5]: *** [bonding] Error 2
make[5]: *** Waiting for unfinished jobs....
  CC dpaa_rxtx.o
  PMDINFO cxgbevf_ethdev.o.pmd.c
  CC cxgbevf_ethdev.o.pmd.o
  PMDINFO axgbe_ethdev.o.pmd.c
--
  PMDINFO bnx2x_ethdev.o.pmd.c
  CC bnx2x_ethdev.o.pmd.o
  LD bnx2x_ethdev.o
  AR librte_pmd_bnx2x.a
  INSTALL-LIB librte_pmd_bnx2x.a
/tmp/UB1604-64_K4.4.0_Clang3.8.0/x86_64-native-linuxapp-clang/2acd0aee01f44ce7b4412069883abdfb/dpdk/mk/rte.subdir.mk:35: recipe for target 'net' failed
make[4]: *** [net] Error 2
/tmp/UB1604-64_K4.4.0_Clang3.8.0/x86_64-native-linuxapp-clang/2acd0aee01f44ce7b4412069883abdfb/dpdk/mk/rte.sdkbuild.mk:46: recipe for target 'drivers' failed
make[3]: *** [drivers] Error 2
/tmp/UB1604-64_K4.4.0_Clang3.8.0/x86_64-native-linuxapp-clang/2acd0aee01f44ce7b4412069883abdfb/dpdk/mk/rte.sdkroot.mk:98: recipe for target 'all' failed
make[2]: *** [all] Error 2
/tmp/UB1604-64_K4.4.0_Clang3.8.0/x86_64-native-linuxapp-clang/2acd0aee01f44ce7b4412069883abdfb/dpdk/mk/rte.sdkinstall.mk:60: recipe for target 'pre_install' failed
make[1]: *** [pre_install] Error 2
/tmp/UB1604-64_K4.4.0_Clang3.8.0/x86_64-native-linuxapp-clang/2acd0aee01f44ce7b4412069883abdfb/dpdk/mk/rte.sdkroot.mk:77: recipe for target 'install' failed
make: *** [install] Error 2


*Make Build Failed #2:
OS: UB1604-32
Target: i686-native-linuxapp-gcc
/tmp/UB1604-32_K4.4.0_GCC5.4.0/i686-native-linuxapp-gcc/2acd0aee01f44ce7b4412069883abdfb/dpdk/drivers/net/bonding/rte_eth_bond_api.c:563:3: note: each undeclared identifier is reported only once for each function it appears in
  INSTALL-LIB librte_pmd_ark.a
/tmp/UB1604-32_K4.4.0_GCC5.4.0/i686-native-linuxapp-gcc/2acd0aee01f44ce7b4412069883abdfb/dpdk/drivers/net/bonding/rte_eth_bond_api.c: At top level:
cc1: error: unrecognized command line option ‘-Wno-address-of-packed-member’ [-Werror]
cc1: all warnings being treated as errors
/tmp/UB1604-32_K4.4.0_GCC5.4.0/i686-native-linuxapp-gcc/2acd0aee01f44ce7b4412069883abdfb/dpdk/mk/internal/rte.compile-pre.mk:114: recipe for target 'rte_eth_bond_api.o' failed
make[6]: *** [rte_eth_bond_api.o] Error 1
make[6]: *** Waiting for unfinished jobs....
  CC axgbe_rxtx.o
  CC axgbe_i2c.o
== Build drivers/net/cxgbe
  CC axgbe_rxtx_vec_sse.o
--
  CC dpaa_rxtx.o
  PMDINFO rte_eth_bond_pmd.o.pmd.c
  CC rte_eth_bond_pmd.o.pmd.o
  LD rte_eth_bond_pmd.o
  CC e1000_82540.o
/tmp/UB1604-32_K4.4.0_GCC5.4.0/i686-native-linuxapp-gcc/2acd0aee01f44ce7b4412069883abdfb/dpdk/mk/rte.subdir.mk:35: recipe for target 'bonding' failed
make[5]: *** [bonding] Error 2
make[5]: *** Waiting for unfinished jobs....
  CC e1000_82541.o
  PMDINFO cxgbevf_ethdev.o.pmd.c
  CC cxgbevf_ethdev.o.pmd.o
  CC dpaa2_rxtx.o
--
  PMDINFO igb_ethdev.o.pmd.c
  CC igb_ethdev.o.pmd.o
  LD igb_ethdev.o
  AR librte_pmd_e1000.a
  INSTALL-LIB librte_pmd_e1000.a
/tmp/UB1604-32_K4.4.0_GCC5.4.0/i686-native-linuxapp-gcc/2acd0aee01f44ce7b4412069883abdfb/dpdk/mk/rte.subdir.mk:35: recipe for target 'net' failed
make[4]: *** [net] Error 2
/tmp/UB1604-32_K4.4.0_GCC5.4.0/i686-native-linuxapp-gcc/2acd0aee01f44ce7b4412069883abdfb/dpdk/mk/rte.sdkbuild.mk:46: recipe for target 'drivers' failed
make[3]: *** [drivers] Error 2
/tmp/UB1604-32_K4.4.0_GCC5.4.0/i686-native-linuxapp-gcc/2acd0aee01f44ce7b4412069883abdfb/dpdk/mk/rte.sdkroot.mk:98: recipe for target 'all' failed
make[2]: *** [all] Error 2
/tmp/UB1604-32_K4.4.0_GCC5.4.0/i686-native-linuxapp-gcc/2acd0aee01f44ce7b4412069883abdfb/dpdk/mk/rte.sdkinstall.mk:60: recipe for target 'pre_install' failed
make[1]: *** [pre_install] Error 2
/tmp/UB1604-32_K4.4.0_GCC5.4.0/i686-native-linuxapp-gcc/2acd0aee01f44ce7b4412069883abdfb/dpdk/mk/rte.sdkroot.mk:77: recipe for target 'install' failed
make: *** [install] Error 2


*Make Build Failed #3:
OS: UB1904-64
Target: x86_64-native-linuxapp-gcc
   recv
/tmp/UB1904-64_K4.18.0_GCC8.3.0/x86_64-native-linuxapp-gcc/2acd0aee01f44ce7b4412069883abdfb/dpdk/drivers/net/bonding/rte_eth_bond_api.c:563:3: note: each undeclared identifier is reported only once for each function it appears in
/tmp/UB1904-64_K4.18.0_GCC8.3.0/x86_64-native-linuxapp-gcc/2acd0aee01f44ce7b4412069883abdfb/dpdk/drivers/net/bonding/rte_eth_bond_api.c: At top level:
cc1: error: unrecognized command line option ‘-Wno-address-of-packed-member’ [-Werror]
cc1: all warnings being treated as errors
make[6]: *** [/tmp/UB1904-64_K4.18.0_GCC8.3.0/x86_64-native-linuxapp-gcc/2acd0aee01f44ce7b4412069883abdfb/dpdk/mk/internal/rte.compile-pre.mk:116: rte_eth_bond_api.o] Error 1
make[5]: *** [/tmp/UB1904-64_K4.18.0_GCC8.3.0/x86_64-native-linuxapp-gcc/2acd0aee01f44ce7b4412069883abdfb/dpdk/mk/rte.subdir.mk:37: bonding] Error 2
make[5]: *** Waiting for unfinished jobs....
  CC cxgbe_main.o
  CC enic_ethdev.o
  CC e1000_82540.o
  CC dpaa2_rxtx.o
--
  LD igb_ethdev.o
  AR librte_pmd_e1000.a
  INSTALL-LIB librte_pmd_e1000.a
  AR librte_pmd_bnx2x.a
  INSTALL-LIB librte_pmd_bnx2x.a
make[4]: *** [/tmp/UB1904-64_K4.18.0_GCC8.3.0/x86_64-native-linuxapp-gcc/2acd0aee01f44ce7b4412069883abdfb/dpdk/mk/rte.subdir.mk:35: net] Error 2
make[3]: *** [/tmp/UB1904-64_K4.18.0_GCC8.3.0/x86_64-native-linuxapp-gcc/2acd0aee01f44ce7b4412069883abdfb/dpdk/mk/rte.sdkbuild.mk:46: drivers] Error 2
make[2]: *** [/tmp/UB1904-64_K4.18.0_GCC8.3.0/x86_64-native-linuxapp-gcc/2acd0aee01f44ce7b4412069883abdfb/dpdk/mk/rte.sdkroot.mk:99: all] Error 2
make[1]: *** [/tmp/UB1904-64_K4.18.0_GCC8.3.0/x86_64-native-linuxapp-gcc/2acd0aee01f44ce7b4412069883abdfb/dpdk/mk/rte.sdkinstall.mk:61: pre_install] Error 2
make: *** [/tmp/UB1904-64_K4.18.0_GCC8.3.0/x86_64-native-linuxapp-gcc/2acd0aee01f44ce7b4412069883abdfb/dpdk/mk/rte.sdkroot.mk:77: install] Error 2


*Make Build Failed #4:
OS: UB1804-64
Target: x86_64-native-linuxapp-icc
/tmp/UB1804-64_K4.15.0_ICC19.0.0/x86_64-native-linuxapp-icc/2acd0aee01f44ce7b4412069883abdfb/dpdk/drivers/net/bonding/rte_eth_bond_api.c(563): error: identifier "ret" is undefined
  		ret = rte_eth_link_get_nowait(slave_port_id, &link_props);
  		^

compilation aborted for /tmp/UB1804-64_K4.15.0_ICC19.0.0/x86_64-native-linuxapp-icc/2acd0aee01f44ce7b4412069883abdfb/dpdk/drivers/net/bonding/rte_eth_bond_api.c (code 2)
/tmp/UB1804-64_K4.15.0_ICC19.0.0/x86_64-native-linuxapp-icc/2acd0aee01f44ce7b4412069883abdfb/dpdk/mk/internal/rte.compile-pre.mk:114: recipe for target 'rte_eth_bond_api.o' failed
make[6]: *** [rte_eth_bond_api.o] Error 2
make[6]: *** Waiting for unfinished jobs....
== Build drivers/net/dpaa2
  CC otx_cryptodev_ops.o
  CC rte_openssl_pmd.o
  CC zlib_pmd.o
--
  CC zlib_pmd_ops.o
  CC scheduler_pmd_ops.o
  LD cxgbe_ethdev.o
  LD rte_eth_bond_pmd.o
  CC cxgbevf_ethdev.o
/tmp/UB1804-64_K4.15.0_ICC19.0.0/x86_64-native-linuxapp-icc/2acd0aee01f44ce7b4412069883abdfb/dpdk/mk/rte.subdir.mk:35: recipe for target 'bonding' failed
make[5]: *** [bonding] Error 2
make[5]: *** Waiting for unfinished jobs....
  CC cxgbe_main.o
  SYMLINK-FILE include/rte_pmd_dpaa.h
  CC dpaa_ethdev.o
  SYMLINK-FILE include/rte_pmd_dpaa2.h
--
  CC virtio_pci.o
  CC caam_jr_capabilities.o
  CC caam_jr.o
  AR librte_pmd_cxgbe.a
  INSTALL-LIB librte_pmd_cxgbe.a
/tmp/UB1804-64_K4.15.0_ICC19.0.0/x86_64-native-linuxapp-icc/2acd0aee01f44ce7b4412069883abdfb/dpdk/mk/rte.subdir.mk:35: recipe for target 'net' failed
make[4]: *** [net] Error 2
make[4]: *** Waiting for unfinished jobs....
  CC caam_jr_hw.o
  PMDINFO virtio_cryptodev.o.pmd.c
  CC virtio_cryptodev.o.pmd.o
  CC caam_jr_uio.o
--
  LD dpaa_sec.o
  AR librte_pmd_dpaa_sec.a
  INSTALL-LIB librte_pmd_dpaa_sec.a
  AR librte_pmd_octeontx_crypto.a
  INSTALL-LIB librte_pmd_octeontx_crypto.a
/tmp/UB1804-64_K4.15.0_ICC19.0.0/x86_64-native-linuxapp-icc/2acd0aee01f44ce7b4412069883abdfb/dpdk/mk/rte.sdkbuild.mk:46: recipe for target 'drivers' failed
make[3]: *** [drivers] Error 2
/tmp/UB1804-64_K4.15.0_ICC19.0.0/x86_64-native-linuxapp-icc/2acd0aee01f44ce7b4412069883abdfb/dpdk/mk/rte.sdkroot.mk:98: recipe for target 'all' failed
make[2]: *** [all] Error 2
/tmp/UB1804-64_K4.15.0_ICC19.0.0/x86_64-native-linuxapp-icc/2acd0aee01f44ce7b4412069883abdfb/dpdk/mk/rte.sdkinstall.mk:60: recipe for target 'pre_install' failed
make[1]: *** [pre_install] Error 2
/tmp/UB1804-64_K4.15.0_ICC19.0.0/x86_64-native-linuxapp-icc/2acd0aee01f44ce7b4412069883abdfb/dpdk/mk/rte.sdkroot.mk:77: recipe for target 'install' failed
make: *** [install] Error 2


*Make Build Failed #5:
OS: UB1804-64
Target: x86_64-native-linuxapp-clang
                    ^
/tmp/UB1804-64_K4.15.0_Clang6.0.0/x86_64-native-linuxapp-clang/2acd0aee01f44ce7b4412069883abdfb/dpdk/drivers/net/bonding/rte_eth_bond_api.c:572:34: error: use of undeclared identifier 'ret'
                                slave_port_id, rte_strerror(-ret));
                                                             ^
3 errors generated.
/tmp/UB1804-64_K4.15.0_Clang6.0.0/x86_64-native-linuxapp-clang/2acd0aee01f44ce7b4412069883abdfb/dpdk/mk/internal/rte.compile-pre.mk:114: recipe for target 'rte_eth_bond_api.o' failed
make[6]: *** [rte_eth_bond_api.o] Error 1
/tmp/UB1804-64_K4.15.0_Clang6.0.0/x86_64-native-linuxapp-clang/2acd0aee01f44ce7b4412069883abdfb/dpdk/mk/rte.subdir.mk:35: recipe for target 'bonding' failed
make[5]: *** [bonding] Error 2
make[5]: *** Waiting for unfinished jobs....
  CC scheduler_pmd_ops.o
  INSTALL-LIB librte_pmd_axgbe.a
  CC scheduler_pmd.o
  CC rte_pmd_atlantic.o
--
  INSTALL-LIB librte_pmd_caam_jr.a
  PMDINFO dpaa2_sec_dpseci.o.pmd.c
  CC dpaa2_sec_dpseci.o.pmd.o
  AR librte_pmd_bnx2x.a
  INSTALL-LIB librte_pmd_bnx2x.a
/tmp/UB1804-64_K4.15.0_Clang6.0.0/x86_64-native-linuxapp-clang/2acd0aee01f44ce7b4412069883abdfb/dpdk/mk/rte.subdir.mk:35: recipe for target 'net' failed
make[4]: *** [net] Error 2
make[4]: *** Waiting for unfinished jobs....
  LD dpaa2_sec_dpseci.o
  AR librte_pmd_dpaa2_sec.a
  INSTALL-LIB librte_pmd_dpaa2_sec.a
  PMDINFO dpaa_sec.o.pmd.c
  CC dpaa_sec.o.pmd.o
  LD dpaa_sec.o
  AR librte_pmd_dpaa_sec.a
  INSTALL-LIB librte_pmd_dpaa_sec.a
/tmp/UB1804-64_K4.15.0_Clang6.0.0/x86_64-native-linuxapp-clang/2acd0aee01f44ce7b4412069883abdfb/dpdk/mk/rte.sdkbuild.mk:46: recipe for target 'drivers' failed
make[3]: *** [drivers] Error 2
/tmp/UB1804-64_K4.15.0_Clang6.0.0/x86_64-native-linuxapp-clang/2acd0aee01f44ce7b4412069883abdfb/dpdk/mk/rte.sdkroot.mk:98: recipe for target 'all' failed
make[2]: *** [all] Error 2
/tmp/UB1804-64_K4.15.0_Clang6.0.0/x86_64-native-linuxapp-clang/2acd0aee01f44ce7b4412069883abdfb/dpdk/mk/rte.sdkinstall.mk:60: recipe for target 'pre_install' failed
make[1]: *** [pre_install] Error 2
/tmp/UB1804-64_K4.15.0_Clang6.0.0/x86_64-native-linuxapp-clang/2acd0aee01f44ce7b4412069883abdfb/dpdk/mk/rte.sdkroot.mk:77: recipe for target 'install' failed
make: *** [install] Error 2


*Make Build Failed #6:
OS: FC30-64
Target: x86_64-native-linuxapp-gcc
/tmp/FC30-64_K4.20_GCC9.1.1/x86_64-native-linuxapp-gcc/2acd0aee01f44ce7b4412069883abdfb/dpdk/drivers/net/bonding/rte_eth_bond_api.c: In function ‘__eth_bond_slave_add_lock_free’:
/tmp/FC30-64_K4.20_GCC9.1.1/x86_64-native-linuxapp-gcc/2acd0aee01f44ce7b4412069883abdfb/dpdk/drivers/net/bonding/rte_eth_bond_api.c:563:3: error: ‘ret’ undeclared (first use in this function)
  563 |   ret = rte_eth_link_get_nowait(slave_port_id, &link_props);
      |   ^~~
/tmp/FC30-64_K4.20_GCC9.1.1/x86_64-native-linuxapp-gcc/2acd0aee01f44ce7b4412069883abdfb/dpdk/drivers/net/bonding/rte_eth_bond_api.c:563:3: note: each undeclared identifier is reported only once for each function it appears in
make[6]: *** [/tmp/FC30-64_K4.20_GCC9.1.1/x86_64-native-linuxapp-gcc/2acd0aee01f44ce7b4412069883abdfb/dpdk/mk/internal/rte.compile-pre.mk:116: rte_eth_bond_api.o] Error 1
make[5]: *** [/tmp/FC30-64_K4.20_GCC9.1.1/x86_64-native-linuxapp-gcc/2acd0aee01f44ce7b4412069883abdfb/dpdk/mk/rte.subdir.mk:37: bonding] Error 2
make[5]: *** Waiting for unfinished jobs....
  CC axgbe_mdio.o
  CC otx_cryptodev_hw_access.o
  CC atl_ethdev.o
  PMDINFO avp_ethdev.o.pmd.c
--
  LD caam_jr.o
  AR librte_pmd_caam_jr.a
  INSTALL-LIB librte_pmd_caam_jr.a
  AR librte_pmd_bnx2x.a
  INSTALL-LIB librte_pmd_bnx2x.a
make[4]: *** [/tmp/FC30-64_K4.20_GCC9.1.1/x86_64-native-linuxapp-gcc/2acd0aee01f44ce7b4412069883abdfb/dpdk/mk/rte.subdir.mk:35: net] Error 2
make[4]: *** Waiting for unfinished jobs....
  PMDINFO virtio_cryptodev.o.pmd.c
  CC virtio_cryptodev.o.pmd.o
  PMDINFO dpaa2_sec_dpseci.o.pmd.c
  CC dpaa2_sec_dpseci.o.pmd.o
--
  PMDINFO dpaa_sec.o.pmd.c
  CC dpaa_sec.o.pmd.o
  LD dpaa_sec.o
  AR librte_pmd_dpaa_sec.a
  INSTALL-LIB librte_pmd_dpaa_sec.a
make[3]: *** [/tmp/FC30-64_K4.20_GCC9.1.1/x86_64-native-linuxapp-gcc/2acd0aee01f44ce7b4412069883abdfb/dpdk/mk/rte.sdkbuild.mk:46: drivers] Error 2
make[2]: *** [/tmp/FC30-64_K4.20_GCC9.1.1/x86_64-native-linuxapp-gcc/2acd0aee01f44ce7b4412069883abdfb/dpdk/mk/rte.sdkroot.mk:99: all] Error 2
make[1]: *** [/tmp/FC30-64_K4.20_GCC9.1.1/x86_64-native-linuxapp-gcc/2acd0aee01f44ce7b4412069883abdfb/dpdk/mk/rte.sdkinstall.mk:61: pre_install] Error 2
make: *** [/tmp/FC30-64_K4.20_GCC9.1.1/x86_64-native-linuxapp-gcc/2acd0aee01f44ce7b4412069883abdfb/dpdk/mk/rte.sdkroot.mk:77: install] Error 2


*Make Build Failed #7:
OS: SUSE15-64
Target: x86_64-native-linuxapp-gcc
   recv
/tmp/SUSE15-64_K4.12.14_GCC7.3.1/x86_64-native-linuxapp-gcc/2acd0aee01f44ce7b4412069883abdfb/dpdk/drivers/net/bonding/rte_eth_bond_api.c:563:3: note: each undeclared identifier is reported only once for each function it appears in
/tmp/SUSE15-64_K4.12.14_GCC7.3.1/x86_64-native-linuxapp-gcc/2acd0aee01f44ce7b4412069883abdfb/dpdk/drivers/net/bonding/rte_eth_bond_api.c: At top level:
cc1: error: unrecognized command line option ‘-Wno-address-of-packed-member’ [-Werror]
cc1: all warnings being treated as errors
make[6]: *** [/tmp/SUSE15-64_K4.12.14_GCC7.3.1/x86_64-native-linuxapp-gcc/2acd0aee01f44ce7b4412069883abdfb/dpdk/mk/internal/rte.compile-pre.mk:116: rte_eth_bond_api.o] Error 1
make[6]: *** Waiting for unfinished jobs....
  CC bnx2x_ethdev.o
  CC ecore_sp.o
== Build drivers/net/cxgbe
  PMDINFO dpaa2_sec_dpseci.o.pmd.c
--
  CC cxgbe_ethdev.o.pmd.o
  CC dpaa_ethdev.o.pmd.o
  LD rte_eth_bond_pmd.o
  LD cxgbe_ethdev.o
  LD dpaa_ethdev.o
make[5]: *** [/tmp/SUSE15-64_K4.12.14_GCC7.3.1/x86_64-native-linuxapp-gcc/2acd0aee01f44ce7b4412069883abdfb/dpdk/mk/rte.subdir.mk:37: bonding] Error 2
make[5]: *** Waiting for unfinished jobs....
  CC dpaa_rxtx.o
  CC axgbe_phy_impl.o
  CC cxgbevf_ethdev.o
  CC elink.o
--
  INSTALL-LIB librte_pmd_dpaa.a
  AR librte_pmd_cxgbe.a
  INSTALL-LIB librte_pmd_cxgbe.a
  AR librte_pmd_bnx2x.a
  INSTALL-LIB librte_pmd_bnx2x.a
make[4]: *** [/tmp/SUSE15-64_K4.12.14_GCC7.3.1/x86_64-native-linuxapp-gcc/2acd0aee01f44ce7b4412069883abdfb/dpdk/mk/rte.subdir.mk:35: net] Error 2
make[3]: *** [/tmp/SUSE15-64_K4.12.14_GCC7.3.1/x86_64-native-linuxapp-gcc/2acd0aee01f44ce7b4412069883abdfb/dpdk/mk/rte.sdkbuild.mk:46: drivers] Error 2
make[2]: *** [/tmp/SUSE15-64_K4.12.14_GCC7.3.1/x86_64-native-linuxapp-gcc/2acd0aee01f44ce7b4412069883abdfb/dpdk/mk/rte.sdkroot.mk:99: all] Error 2
make[1]: *** [/tmp/SUSE15-64_K4.12.14_GCC7.3.1/x86_64-native-linuxapp-gcc/2acd0aee01f44ce7b4412069883abdfb/dpdk/mk/rte.sdkinstall.mk:61: pre_install] Error 2
make: *** [/tmp/SUSE15-64_K4.12.14_GCC7.3.1/x86_64-native-linuxapp-gcc/2acd0aee01f44ce7b4412069883abdfb/dpdk/mk/rte.sdkroot.mk:77: install] Error 2


*Make Build Failed #8:
OS: FC30-64
Target: x86_64-native-linuxapp-clang
/tmp/FC30-64_K4.20_Clang8.0.0/x86_64-native-linuxapp-clang/2acd0aee01f44ce7b4412069883abdfb/dpdk/drivers/net/bonding/rte_eth_bond_api.c:572:34: error: use of undeclared identifier 'ret'
                                slave_port_id, rte_strerror(-ret));
                                                             ^
3 errors generated.
  LD zlib_pmd.o
make[6]: *** [/tmp/FC30-64_K4.20_Clang8.0.0/x86_64-native-linuxapp-clang/2acd0aee01f44ce7b4412069883abdfb/dpdk/mk/internal/rte.compile-pre.mk:116: rte_eth_bond_api.o] Error 1
make[6]: *** Waiting for unfinished jobs....
  CC rte_eth_bond_pmd.o
  AR librte_pmd_zlib.a
== Build drivers/net/dpaa
  INSTALL-LIB librte_pmd_zlib.a
--
  CC ark_udm.o
  CC axgbe_i2c.o
  LD cxgbevf_ethdev.o
  CC cxgbe_main.o
  LD rte_eth_bond_pmd.o
make[5]: *** [/tmp/FC30-64_K4.20_Clang8.0.0/x86_64-native-linuxapp-clang/2acd0aee01f44ce7b4412069883abdfb/dpdk/mk/rte.subdir.mk:37: bonding] Error 2
make[5]: *** Waiting for unfinished jobs....
  CC axgbe_rxtx.o
  AR librte_pmd_ark.a
  INSTALL-LIB librte_pmd_ark.a
  CC axgbe_rxtx_vec_sse.o
--
  INSTALL-LIB librte_pmd_dpaa2_sec.a
  AR librte_pmd_cxgbe.a
  INSTALL-LIB librte_pmd_cxgbe.a
  AR librte_pmd_bnx2x.a
  INSTALL-LIB librte_pmd_bnx2x.a
make[4]: *** [/tmp/FC30-64_K4.20_Clang8.0.0/x86_64-native-linuxapp-clang/2acd0aee01f44ce7b4412069883abdfb/dpdk/mk/rte.subdir.mk:35: net] Error 2
make[3]: *** [/tmp/FC30-64_K4.20_Clang8.0.0/x86_64-native-linuxapp-clang/2acd0aee01f44ce7b4412069883abdfb/dpdk/mk/rte.sdkbuild.mk:46: drivers] Error 2
make[2]: *** [/tmp/FC30-64_K4.20_Clang8.0.0/x86_64-native-linuxapp-clang/2acd0aee01f44ce7b4412069883abdfb/dpdk/mk/rte.sdkroot.mk:99: all] Error 2
make[1]: *** [/tmp/FC30-64_K4.20_Clang8.0.0/x86_64-native-linuxapp-clang/2acd0aee01f44ce7b4412069883abdfb/dpdk/mk/rte.sdkinstall.mk:61: pre_install] Error 2
make: *** [/tmp/FC30-64_K4.20_Clang8.0.0/x86_64-native-linuxapp-clang/2acd0aee01f44ce7b4412069883abdfb/dpdk/mk/rte.sdkroot.mk:77: install] Error 2


*Make Build Failed #9:
OS: RHEL76-64
Target: x86_64-native-linuxapp-gcc
   ^
/tmp/RHEL76-64_K3.10.0_GCC4.8.5/x86_64-native-linuxapp-gcc/2acd0aee01f44ce7b4412069883abdfb/dpdk/drivers/net/bonding/rte_eth_bond_api.c:563:3: note: each undeclared identifier is reported only once for each function it appears in
/tmp/RHEL76-64_K3.10.0_GCC4.8.5/x86_64-native-linuxapp-gcc/2acd0aee01f44ce7b4412069883abdfb/dpdk/drivers/net/bonding/rte_eth_bond_api.c: At top level:
cc1: error: unrecognized command line option "-Wno-address-of-packed-member" [-Werror]
cc1: all warnings being treated as errors
make[6]: *** [rte_eth_bond_api.o] Error 1
make[6]: *** Waiting for unfinished jobs....
  CC virtio_pci.o
  CC rte_eth_bond_pmd.o
  CC bnx2x_rxtx.o
  PMDINFO dpaa_sec.o.pmd.c
--
  CC caam_jr_uio.o
  CC bnx2x_ethdev.o
  LD rte_eth_bond_pmd.o
  CC rte_pmd_atlantic.o
  CC ecore_sp.o
make[5]: *** [bonding] Error 2
make[5]: *** Waiting for unfinished jobs....
  CC elink.o
  CC cxgbevf_main.o
  AR librte_pmd_caam_jr.a
  INSTALL-LIB librte_pmd_caam_jr.a
--
  INSTALL-LIB librte_pmd_cxgbe.a
  AR librte_pmd_dpaa.a
  INSTALL-LIB librte_pmd_dpaa.a
  AR librte_pmd_bnx2x.a
  INSTALL-LIB librte_pmd_bnx2x.a
make[4]: *** [net] Error 2
make[3]: *** [drivers] Error 2
make[2]: *** [all] Error 2
make[1]: *** [pre_install] Error 2
make: *** [install] Error 2


*Make Build Failed #10:
OS: SUSE15-64
Target: x86_64-native-linuxapp-clang
/tmp/SUSE15-64_K4.12.14_Clang5.0.1/x86_64-native-linuxapp-clang/2acd0aee01f44ce7b4412069883abdfb/dpdk/drivers/net/bonding/rte_eth_bond_api.c:572:34: error: use of undeclared identifier 'ret'
                                slave_port_id, rte_strerror(-ret));
                                                             ^
3 errors generated.
  CC axgbe_dev.o
make[6]: *** [/tmp/SUSE15-64_K4.12.14_Clang5.0.1/x86_64-native-linuxapp-clang/2acd0aee01f44ce7b4412069883abdfb/dpdk/mk/internal/rte.compile-pre.mk:116: rte_eth_bond_api.o] Error 1
make[5]: *** [/tmp/SUSE15-64_K4.12.14_Clang5.0.1/x86_64-native-linuxapp-clang/2acd0aee01f44ce7b4412069883abdfb/dpdk/mk/rte.subdir.mk:35: bonding] Error 2
make[5]: *** Waiting for unfinished jobs....
  CC axgbe_mdio.o
== Build drivers/crypto/scheduler
  CC ark_pktgen.o
  PMDINFO otx_cryptodev.o.pmd.c
--
  LD dpaa2_sec_dpseci.o
  AR librte_pmd_dpaa2_sec.a
  INSTALL-LIB librte_pmd_dpaa2_sec.a
  AR librte_pmd_bnx2x.a
  INSTALL-LIB librte_pmd_bnx2x.a
make[4]: *** [/tmp/SUSE15-64_K4.12.14_Clang5.0.1/x86_64-native-linuxapp-clang/2acd0aee01f44ce7b4412069883abdfb/dpdk/mk/rte.subdir.mk:35: net] Error 2
make[3]: *** [/tmp/SUSE15-64_K4.12.14_Clang5.0.1/x86_64-native-linuxapp-clang/2acd0aee01f44ce7b4412069883abdfb/dpdk/mk/rte.sdkbuild.mk:46: drivers] Error 2
make[2]: *** [/tmp/SUSE15-64_K4.12.14_Clang5.0.1/x86_64-native-linuxapp-clang/2acd0aee01f44ce7b4412069883abdfb/dpdk/mk/rte.sdkroot.mk:99: all] Error 2
make[1]: *** [/tmp/SUSE15-64_K4.12.14_Clang5.0.1/x86_64-native-linuxapp-clang/2acd0aee01f44ce7b4412069883abdfb/dpdk/mk/rte.sdkinstall.mk:61: pre_install] Error 2
make: *** [/tmp/SUSE15-64_K4.12.14_Clang5.0.1/x86_64-native-linuxapp-clang/2acd0aee01f44ce7b4412069883abdfb/dpdk/mk/rte.sdkroot.mk:77: install] Error 2


*Make Build Failed #11:
OS: RHEL80-64
Target: x86_64-native-linuxapp-gcc
  CC bnx2x_vfpf.o
  PMDINFO dpaa_sec.o.pmd.c
  CC dpaa_sec.o.pmd.o
  LD dpaa_sec.o
  CC dpaa_rxtx.o
make[6]: *** [/tmp/RHEL80-64_K3.10.0_GCC8.2.1/x86_64-native-linuxapp-gcc/2acd0aee01f44ce7b4412069883abdfb/dpdk/mk/internal/rte.compile-pre.mk:114: rte_eth_bond_api.o] Error 1
make[6]: *** Waiting for unfinished jobs....
  CC rte_eth_bond_pmd.o
  CC axgbe_rxtx.o
  CC axgbe_rxtx_vec_sse.o
  AR librte_pmd_dpaa_sec.a
--
  CC rte_eth_bond_pmd.o.pmd.o
  LD virtio_cryptodev.o
  LD rte_eth_bond_pmd.o
  CC e1000_82541.o
  AR librte_pmd_virtio_crypto.a
make[5]: *** [/tmp/RHEL80-64_K3.10.0_GCC8.2.1/x86_64-native-linuxapp-gcc/2acd0aee01f44ce7b4412069883abdfb/dpdk/mk/rte.subdir.mk:35: bonding] Error 2
make[5]: *** Waiting for unfinished jobs....
  INSTALL-LIB librte_pmd_virtio_crypto.a
  CC ena_com.o
  CC clip_tbl.o
  CC mps_tcam.o
--
  LD igb_ethdev.o
  AR librte_pmd_e1000.a
  INSTALL-LIB librte_pmd_e1000.a
  AR librte_pmd_enic.a
  INSTALL-LIB librte_pmd_enic.a
make[4]: *** [/tmp/RHEL80-64_K3.10.0_GCC8.2.1/x86_64-native-linuxapp-gcc/2acd0aee01f44ce7b4412069883abdfb/dpdk/mk/rte.subdir.mk:35: net] Error 2
make[3]: *** [/tmp/RHEL80-64_K3.10.0_GCC8.2.1/x86_64-native-linuxapp-gcc/2acd0aee01f44ce7b4412069883abdfb/dpdk/mk/rte.sdkbuild.mk:46: drivers] Error 2
make[2]: *** [/tmp/RHEL80-64_K3.10.0_GCC8.2.1/x86_64-native-linuxapp-gcc/2acd0aee01f44ce7b4412069883abdfb/dpdk/mk/rte.sdkroot.mk:99: all] Error 2
make[1]: *** [/tmp/RHEL80-64_K3.10.0_GCC8.2.1/x86_64-native-linuxapp-gcc/2acd0aee01f44ce7b4412069883abdfb/dpdk/mk/rte.sdkinstall.mk:61: pre_install] Error 2
make: *** [/tmp/RHEL80-64_K3.10.0_GCC8.2.1/x86_64-native-linuxapp-gcc/2acd0aee01f44ce7b4412069883abdfb/dpdk/mk/rte.sdkroot.mk:77: install] Error 2


*Make Build Failed #12:
OS: UB1604-64
Target: x86_64-native-linuxapp-gcc
   ^
/tmp/UB1604-64_K4.4.0_GCC5.4.0/x86_64-native-linuxapp-gcc/2acd0aee01f44ce7b4412069883abdfb/dpdk/drivers/net/bonding/rte_eth_bond_api.c:563:3: note: each undeclared identifier is reported only once for each function it appears in
/tmp/UB1604-64_K4.4.0_GCC5.4.0/x86_64-native-linuxapp-gcc/2acd0aee01f44ce7b4412069883abdfb/dpdk/drivers/net/bonding/rte_eth_bond_api.c: At top level:
cc1: error: unrecognized command line option ‘-Wno-address-of-packed-member’ [-Werror]
cc1: all warnings being treated as errors
/tmp/UB1604-64_K4.4.0_GCC5.4.0/x86_64-native-linuxapp-gcc/2acd0aee01f44ce7b4412069883abdfb/dpdk/mk/internal/rte.compile-pre.mk:114: recipe for target 'rte_eth_bond_api.o' failed
make[6]: *** [rte_eth_bond_api.o] Error 1
/tmp/UB1604-64_K4.4.0_GCC5.4.0/x86_64-native-linuxapp-gcc/2acd0aee01f44ce7b4412069883abdfb/dpdk/mk/rte.subdir.mk:35: recipe for target 'bonding' failed
make[5]: *** [bonding] Error 2
make[5]: *** Waiting for unfinished jobs....
  CC qat_logs.o
  AR librte_pmd_zlib.a
  INSTALL-LIB librte_pmd_zlib.a
  CC qat_qp.o
--
  PMDINFO dpaa2_sec_dpseci.o.pmd.c
  CC dpaa2_sec_dpseci.o.pmd.o
  AR librte_pmd_bnx2x.a
  LD dpaa2_sec_dpseci.o
  INSTALL-LIB librte_pmd_bnx2x.a
/tmp/UB1604-64_K4.4.0_GCC5.4.0/x86_64-native-linuxapp-gcc/2acd0aee01f44ce7b4412069883abdfb/dpdk/mk/rte.subdir.mk:35: recipe for target 'net' failed
make[4]: *** [net] Error 2
make[4]: *** Waiting for unfinished jobs....
  AR librte_pmd_dpaa2_sec.a
  INSTALL-LIB librte_pmd_dpaa2_sec.a
/tmp/UB1604-64_K4.4.0_GCC5.4.0/x86_64-native-linuxapp-gcc/2acd0aee01f44ce7b4412069883abdfb/dpdk/mk/rte.sdkbuild.mk:46: recipe for target 'drivers' failed
make[3]: *** [drivers] Error 2
/tmp/UB1604-64_K4.4.0_GCC5.4.0/x86_64-native-linuxapp-gcc/2acd0aee01f44ce7b4412069883abdfb/dpdk/mk/rte.sdkroot.mk:98: recipe for target 'all' failed
make[2]: *** [all] Error 2
/tmp/UB1604-64_K4.4.0_GCC5.4.0/x86_64-native-linuxapp-gcc/2acd0aee01f44ce7b4412069883abdfb/dpdk/mk/rte.sdkinstall.mk:60: recipe for target 'pre_install' failed
make[1]: *** [pre_install] Error 2
/tmp/UB1604-64_K4.4.0_GCC5.4.0/x86_64-native-linuxapp-gcc/2acd0aee01f44ce7b4412069883abdfb/dpdk/mk/rte.sdkroot.mk:77: recipe for target 'install' failed
make: *** [install] Error 2


*Make Build Failed #13:
OS: UB1804-64
Target: x86_64-native-linuxapp-gcc
  PMDINFO axgbe_ethdev.o.pmd.c
  CC axgbe_ethdev.o.pmd.o
/tmp/UB1804-64_K4.15.0_GCC7.3.0/x86_64-native-linuxapp-gcc/2acd0aee01f44ce7b4412069883abdfb/dpdk/drivers/net/bonding/rte_eth_bond_api.c: At top level:
cc1: error: unrecognized command line option ‘-Wno-address-of-packed-member’ [-Werror]
cc1: all warnings being treated as errors
/tmp/UB1804-64_K4.15.0_GCC7.3.0/x86_64-native-linuxapp-gcc/2acd0aee01f44ce7b4412069883abdfb/dpdk/mk/internal/rte.compile-pre.mk:114: recipe for target 'rte_eth_bond_api.o' failed
make[6]: *** [rte_eth_bond_api.o] Error 1
make[6]: *** Waiting for unfinished jobs....
== Build drivers/crypto/dpaa_sec
  LD axgbe_ethdev.o
== Build drivers/crypto/caam_jr
  PMDINFO atl_ethdev.o.pmd.c
--
  CC hw_atl_utils_fw2x.o
  CC virtio_cryptodev.o
  PMDINFO rte_eth_bond_pmd.o.pmd.c
  CC rte_eth_bond_pmd.o.pmd.o
  LD rte_eth_bond_pmd.o
/tmp/UB1804-64_K4.15.0_GCC7.3.0/x86_64-native-linuxapp-gcc/2acd0aee01f44ce7b4412069883abdfb/dpdk/mk/rte.subdir.mk:35: recipe for target 'bonding' failed
make[5]: *** [bonding] Error 2
make[5]: *** Waiting for unfinished jobs....
  CC hw_atl_b0.o
  CC axgbe_i2c.o
  PMDINFO cxgbevf_ethdev.o.pmd.c
  CC cxgbevf_ethdev.o.pmd.o
--
  CC t4vf_hw.o
  AR librte_pmd_cxgbe.a
  INSTALL-LIB librte_pmd_cxgbe.a
  AR librte_pmd_bnx2x.a
  INSTALL-LIB librte_pmd_bnx2x.a
/tmp/UB1804-64_K4.15.0_GCC7.3.0/x86_64-native-linuxapp-gcc/2acd0aee01f44ce7b4412069883abdfb/dpdk/mk/rte.subdir.mk:35: recipe for target 'net' failed
make[4]: *** [net] Error 2
/tmp/UB1804-64_K4.15.0_GCC7.3.0/x86_64-native-linuxapp-gcc/2acd0aee01f44ce7b4412069883abdfb/dpdk/mk/rte.sdkbuild.mk:46: recipe for target 'drivers' failed
make[3]: *** [drivers] Error 2
/tmp/UB1804-64_K4.15.0_GCC7.3.0/x86_64-native-linuxapp-gcc/2acd0aee01f44ce7b4412069883abdfb/dpdk/mk/rte.sdkroot.mk:98: recipe for target 'all' failed
make[2]: *** [all] Error 2
/tmp/UB1804-64_K4.15.0_GCC7.3.0/x86_64-native-linuxapp-gcc/2acd0aee01f44ce7b4412069883abdfb/dpdk/mk/rte.sdkinstall.mk:60: recipe for target 'pre_install' failed
make[1]: *** [pre_install] Error 2
/tmp/UB1804-64_K4.15.0_GCC7.3.0/x86_64-native-linuxapp-gcc/2acd0aee01f44ce7b4412069883abdfb/dpdk/mk/rte.sdkroot.mk:77: recipe for target 'install' failed
make: *** [install] Error 2


*Make Build Failed #14:
OS: FreeBSD12-64
Target: x86_64-native-bsdapp-gcc+shared
  CC cxgbe_ethdev.o.pmd.o
  LD cxgbe_ethdev.o
  CC virtio_cryptodev.o
  CC cxgbevf_ethdev.o
  CC scheduler_roundrobin.o
gmake[6]: *** [/tmp/FreeBSD12-64_K19.02_GCC7.3.0/x86_64-native-bsdapp-gcc+shared/2acd0aee01f44ce7b4412069883abdfb/dpdk/mk/internal/rte.compile-pre.mk:116: rte_eth_bond_api.o] Error 1
gmake[6]: *** Waiting for unfinished jobs....
  PMDINFO atl_ethdev.o.pmd.c
  CC atl_ethdev.o.pmd.o
  PMDINFO cxgbevf_ethdev.o.pmd.c
  CC scheduler_pkt_size_distr.o
--
  PMDINFO rte_eth_bond_pmd.o.pmd.c
  CC rte_eth_bond_pmd.o.pmd.o
  LD rte_eth_bond_pmd.o
  LD librte_pmd_axgbe.so.1.1
  CC e1000_82541.o
gmake[5]: *** [/tmp/FreeBSD12-64_K19.02_GCC7.3.0/x86_64-native-bsdapp-gcc+shared/2acd0aee01f44ce7b4412069883abdfb/dpdk/mk/rte.subdir.mk:37: bonding] Error 2
gmake[5]: *** Waiting for unfinished jobs....
  CC hw_atl_utils.o
  LD librte_pmd_crypto_scheduler.so.1.1
  CC e1000_82542.o
  INSTALL-LIB librte_pmd_axgbe.so.1.1
--
  PMDINFO igb_ethdev.o.pmd.c
  CC igb_ethdev.o.pmd.o
  LD igb_ethdev.o
  LD librte_pmd_e1000.so.1.1
  INSTALL-LIB librte_pmd_e1000.so.1.1
gmake[4]: *** [/tmp/FreeBSD12-64_K19.02_GCC7.3.0/x86_64-native-bsdapp-gcc+shared/2acd0aee01f44ce7b4412069883abdfb/dpdk/mk/rte.subdir.mk:35: net] Error 2
gmake[3]: *** [/tmp/FreeBSD12-64_K19.02_GCC7.3.0/x86_64-native-bsdapp-gcc+shared/2acd0aee01f44ce7b4412069883abdfb/dpdk/mk/rte.sdkbuild.mk:46: drivers] Error 2
gmake[2]: *** [/tmp/FreeBSD12-64_K19.02_GCC7.3.0/x86_64-native-bsdapp-gcc+shared/2acd0aee01f44ce7b4412069883abdfb/dpdk/mk/rte.sdkroot.mk:99: all] Error 2
gmake[1]: *** [/tmp/FreeBSD12-64_K19.02_GCC7.3.0/x86_64-native-bsdapp-gcc+shared/2acd0aee01f44ce7b4412069883abdfb/dpdk/mk/rte.sdkinstall.mk:61: pre_install] Error 2
gmake: *** [/tmp/FreeBSD12-64_K19.02_GCC7.3.0/x86_64-native-bsdapp-gcc+shared/2acd0aee01f44ce7b4412069883abdfb/dpdk/mk/rte.sdkroot.mk:77: install] Error 2


*Make Build Failed #15:
OS: CENTOS76-64
Target: x86_64-native-linuxapp-gcc+debug
   ^
/tmp/CENTOS76-64_K3.10.0_GCC4.8.5/x86_64-native-linuxapp-gcc+debug/2acd0aee01f44ce7b4412069883abdfb/dpdk/drivers/net/bonding/rte_eth_bond_api.c:563:3: note: each undeclared identifier is reported only once for each function it appears in
/tmp/CENTOS76-64_K3.10.0_GCC4.8.5/x86_64-native-linuxapp-gcc+debug/2acd0aee01f44ce7b4412069883abdfb/dpdk/drivers/net/bonding/rte_eth_bond_api.c: At top level:
cc1: error: unrecognized command line option "-Wno-address-of-packed-member" [-Werror]
cc1: all warnings being treated as errors
make[6]: *** [rte_eth_bond_api.o] Error 1
make[5]: *** [bonding] Error 2
make[5]: *** Waiting for unfinished jobs....
  CC caam_jr_capabilities.o
  CC cxgbe_ethdev.o
  PMDINFO avp_ethdev.o.pmd.c
  CC avp_ethdev.o.pmd.o
--
  INSTALL-LIB librte_pmd_dpaa2_sec.a
  AR librte_pmd_cxgbe.a
  INSTALL-LIB librte_pmd_cxgbe.a
  AR librte_pmd_bnx2x.a
  INSTALL-LIB librte_pmd_bnx2x.a
make[4]: *** [net] Error 2
make[3]: *** [drivers] Error 2
make[2]: *** [all] Error 2
make[1]: *** [pre_install] Error 2
make: *** [install] Error 2


*Make Build Failed #16:
OS: CENTOS76-64
Target: x86_64-native-linuxapp-gcc
/tmp/CENTOS76-64_K3.10.0_GCC4.8.5/x86_64-native-linuxapp-gcc/2acd0aee01f44ce7b4412069883abdfb/dpdk/drivers/net/bonding/rte_eth_bond_api.c:563:3: note: each undeclared identifier is reported only once for each function it appears in
  LD zlib_pmd.o
/tmp/CENTOS76-64_K3.10.0_GCC4.8.5/x86_64-native-linuxapp-gcc/2acd0aee01f44ce7b4412069883abdfb/dpdk/drivers/net/bonding/rte_eth_bond_api.c: At top level:
cc1: error: unrecognized command line option "-Wno-address-of-packed-member" [-Werror]
cc1: all warnings being treated as errors
make[6]: *** [rte_eth_bond_api.o] Error 1
make[5]: *** [bonding] Error 2
make[5]: *** Waiting for unfinished jobs....
  LD axgbe_ethdev.o
  CC ark_mpu.o
  CC zlib_pmd_ops.o
  CC axgbe_dev.o
--
  LD dpaa_sec.o
  AR librte_pmd_dpaa_sec.a
  INSTALL-LIB librte_pmd_dpaa_sec.a
  AR librte_pmd_bnx2x.a
  INSTALL-LIB librte_pmd_bnx2x.a
make[4]: *** [net] Error 2
make[3]: *** [drivers] Error 2
make[2]: *** [all] Error 2
make[1]: *** [pre_install] Error 2
make: *** [install] Error 2


*Make Build Failed #17:
OS: CENTOS76-64
Target: x86_64-native-linuxapp-clang
                                                             ^
/tmp/CENTOS76-64_K3.10.0_Clang3.4.2/x86_64-native-linuxapp-clang/2acd0aee01f44ce7b4412069883abdfb/dpdk/drivers/net/bonding/rte_eth_bond_private.h:40:47: note: expanded from macro 'RTE_BOND_LOG'
                "%s(%d) - " msg "\n", __func__, __LINE__, ##__VA_ARGS__)
                                                            ^
3 errors generated.
make[6]: *** [rte_eth_bond_api.o] Error 1
make[5]: *** [bonding] Error 2
make[5]: *** Waiting for unfinished jobs....
== Build drivers/net/cxgbe
  CC ark_udm.o
  CC bnx2x_rxtx.o
  PMDINFO zlib_pmd.o.pmd.c
--
  LD virtio_cryptodev.o
  AR librte_pmd_virtio_crypto.a
  INSTALL-LIB librte_pmd_virtio_crypto.a
  AR librte_pmd_bnx2x.a
  INSTALL-LIB librte_pmd_bnx2x.a
make[4]: *** [net] Error 2
make[4]: *** Waiting for unfinished jobs....
  PMDINFO caam_jr.o.pmd.c
  CC caam_jr.o.pmd.o
  LD caam_jr.o
  AR librte_pmd_caam_jr.a
--
  PMDINFO dpaa2_sec_dpseci.o.pmd.c
  CC dpaa2_sec_dpseci.o.pmd.o
  LD dpaa2_sec_dpseci.o
  AR librte_pmd_dpaa2_sec.a
  INSTALL-LIB librte_pmd_dpaa2_sec.a
make[3]: *** [drivers] Error 2
make[2]: *** [all] Error 2
make[1]: *** [pre_install] Error 2
make: *** [install] Error 2


*Make Build Failed #18:
OS: CENTOS76-64
Target: x86_64-native-linuxapp-icc
/tmp/CENTOS76-64_K3.10.0_ICC19.0.0/x86_64-native-linuxapp-icc/2acd0aee01f44ce7b4412069883abdfb/dpdk/drivers/net/bonding/rte_eth_bond_api.c(563): error: identifier "ret" is undefined
  		ret = rte_eth_link_get_nowait(slave_port_id, &link_props);
  		^

compilation aborted for /tmp/CENTOS76-64_K3.10.0_ICC19.0.0/x86_64-native-linuxapp-icc/2acd0aee01f44ce7b4412069883abdfb/dpdk/drivers/net/bonding/rte_eth_bond_api.c (code 2)
make[6]: *** [rte_eth_bond_api.o] Error 2
make[5]: *** [bonding] Error 2
make[5]: *** Waiting for unfinished jobs....
  CC dpaa_rxtx.o
  AR librte_pmd_null_crypto.a
  SYMLINK-FILE include/rte_pmd_dpaa2.h
  INSTALL-LIB librte_pmd_null_crypto.a
--
  CC igb_ethdev.o.pmd.o
  LD em_ethdev.o
  LD igb_ethdev.o
  AR librte_pmd_e1000.a
  INSTALL-LIB librte_pmd_e1000.a
make[4]: *** [net] Error 2
make[3]: *** [drivers] Error 2
make[2]: *** [all] Error 2
make[1]: *** [pre_install] Error 2
make: *** [install] Error 2


*Make Build Failed #19:
OS: CENTOS76-64
Target: x86_64-native-linuxapp-gcc+shared
   ^
/tmp/CENTOS76-64_K3.10.0_GCC4.8.5/x86_64-native-linuxapp-gcc+shared/2acd0aee01f44ce7b4412069883abdfb/dpdk/drivers/net/bonding/rte_eth_bond_api.c:563:3: note: each undeclared identifier is reported only once for each function it appears in
/tmp/CENTOS76-64_K3.10.0_GCC4.8.5/x86_64-native-linuxapp-gcc+shared/2acd0aee01f44ce7b4412069883abdfb/dpdk/drivers/net/bonding/rte_eth_bond_api.c: At top level:
cc1: error: unrecognized command line option "-Wno-address-of-packed-member" [-Werror]
cc1: all warnings being treated as errors
make[6]: *** [rte_eth_bond_api.o] Error 1
make[5]: *** [bonding] Error 2
make[5]: *** Waiting for unfinished jobs....
  CC axgbe_mdio.o
  CC dpaa_ethdev.o
  CC base/dpaa2_hw_dpni.o
  PMDINFO cxgbe_ethdev.o.pmd.c
--
  LD igb_ethdev.o
  LD librte_pmd_e1000.so.1.1
  INSTALL-LIB librte_pmd_e1000.so.1.1
  LD librte_pmd_bnx2x.so.1.1
  INSTALL-LIB librte_pmd_bnx2x.so.1.1
make[4]: *** [net] Error 2
make[3]: *** [drivers] Error 2
make[2]: *** [all] Error 2
make[1]: *** [pre_install] Error 2
make: *** [install] Error 2


*Make Build Failed #20:
OS: FreeBSD12-64
Target: x86_64-native-bsdapp-gcc+debug
   getw
/tmp/FreeBSD12-64_K19.02_GCC7.3.0/x86_64-native-bsdapp-gcc+debug/2acd0aee01f44ce7b4412069883abdfb/dpdk/drivers/net/bonding/rte_eth_bond_api.c:563:3: note: each undeclared identifier is reported only once for each function it appears in
/tmp/FreeBSD12-64_K19.02_GCC7.3.0/x86_64-native-bsdapp-gcc+debug/2acd0aee01f44ce7b4412069883abdfb/dpdk/drivers/net/bonding/rte_eth_bond_api.c: At top level:
cc1: error: unrecognized command line option '-Wno-address-of-packed-member' [-Werror]
cc1: all warnings being treated as errors
gmake[6]: *** [/tmp/FreeBSD12-64_K19.02_GCC7.3.0/x86_64-native-bsdapp-gcc+debug/2acd0aee01f44ce7b4412069883abdfb/dpdk/mk/internal/rte.compile-pre.mk:116: rte_eth_bond_api.o] Error 1
gmake[5]: *** [/tmp/FreeBSD12-64_K19.02_GCC7.3.0/x86_64-native-bsdapp-gcc+debug/2acd0aee01f44ce7b4412069883abdfb/dpdk/mk/rte.subdir.mk:37: bonding] Error 2
gmake[5]: *** Waiting for unfinished jobs....
  CC rte_pmd_atlantic.o
  PMDINFO cxgbe_ethdev.o.pmd.c
  CC cxgbe_ethdev.o.pmd.o
  LD cxgbe_ethdev.o
--
  PMDINFO igb_ethdev.o.pmd.c
  CC igb_ethdev.o.pmd.o
  LD igb_ethdev.o
  AR librte_pmd_e1000.a
  INSTALL-LIB librte_pmd_e1000.a
gmake[4]: *** [/tmp/FreeBSD12-64_K19.02_GCC7.3.0/x86_64-native-bsdapp-gcc+debug/2acd0aee01f44ce7b4412069883abdfb/dpdk/mk/rte.subdir.mk:35: net] Error 2
gmake[3]: *** [/tmp/FreeBSD12-64_K19.02_GCC7.3.0/x86_64-native-bsdapp-gcc+debug/2acd0aee01f44ce7b4412069883abdfb/dpdk/mk/rte.sdkbuild.mk:46: drivers] Error 2
gmake[2]: *** [/tmp/FreeBSD12-64_K19.02_GCC7.3.0/x86_64-native-bsdapp-gcc+debug/2acd0aee01f44ce7b4412069883abdfb/dpdk/mk/rte.sdkroot.mk:99: all] Error 2
gmake[1]: *** [/tmp/FreeBSD12-64_K19.02_GCC7.3.0/x86_64-native-bsdapp-gcc+debug/2acd0aee01f44ce7b4412069883abdfb/dpdk/mk/rte.sdkinstall.mk:61: pre_install] Error 2
gmake: *** [/tmp/FreeBSD12-64_K19.02_GCC7.3.0/x86_64-native-bsdapp-gcc+debug/2acd0aee01f44ce7b4412069883abdfb/dpdk/mk/rte.sdkroot.mk:77: install] Error 2


*Make Build Failed #21:
OS: FreeBSD12-64
Target: x86_64-native-bsdapp-gcc
   getw
/tmp/FreeBSD12-64_K19.02_GCC7.3.0/x86_64-native-bsdapp-gcc/2acd0aee01f44ce7b4412069883abdfb/dpdk/drivers/net/bonding/rte_eth_bond_api.c:563:3: note: each undeclared identifier is reported only once for each function it appears in
/tmp/FreeBSD12-64_K19.02_GCC7.3.0/x86_64-native-bsdapp-gcc/2acd0aee01f44ce7b4412069883abdfb/dpdk/drivers/net/bonding/rte_eth_bond_api.c: At top level:
cc1: error: unrecognized command line option '-Wno-address-of-packed-member' [-Werror]
cc1: all warnings being treated as errors
gmake[6]: *** [/tmp/FreeBSD12-64_K19.02_GCC7.3.0/x86_64-native-bsdapp-gcc/2acd0aee01f44ce7b4412069883abdfb/dpdk/mk/internal/rte.compile-pre.mk:116: rte_eth_bond_api.o] Error 1
gmake[5]: *** [/tmp/FreeBSD12-64_K19.02_GCC7.3.0/x86_64-native-bsdapp-gcc/2acd0aee01f44ce7b4412069883abdfb/dpdk/mk/rte.subdir.mk:37: bonding] Error 2
gmake[5]: *** Waiting for unfinished jobs....
== Build drivers/crypto/null
  CC ark_udm.o
  AR librte_pmd_octeontx_zip.a
  AR librte_pmd_fpga_lte_fec.a
--
  LD virtio_cryptodev.o
  AR librte_pmd_virtio_crypto.a
  INSTALL-LIB librte_pmd_virtio_crypto.a
  AR librte_pmd_bnx2x.a
  INSTALL-LIB librte_pmd_bnx2x.a
gmake[4]: *** [/tmp/FreeBSD12-64_K19.02_GCC7.3.0/x86_64-native-bsdapp-gcc/2acd0aee01f44ce7b4412069883abdfb/dpdk/mk/rte.subdir.mk:35: net] Error 2
gmake[3]: *** [/tmp/FreeBSD12-64_K19.02_GCC7.3.0/x86_64-native-bsdapp-gcc/2acd0aee01f44ce7b4412069883abdfb/dpdk/mk/rte.sdkbuild.mk:46: drivers] Error 2
gmake[2]: *** [/tmp/FreeBSD12-64_K19.02_GCC7.3.0/x86_64-native-bsdapp-gcc/2acd0aee01f44ce7b4412069883abdfb/dpdk/mk/rte.sdkroot.mk:99: all] Error 2
gmake[1]: *** [/tmp/FreeBSD12-64_K19.02_GCC7.3.0/x86_64-native-bsdapp-gcc/2acd0aee01f44ce7b4412069883abdfb/dpdk/mk/rte.sdkinstall.mk:61: pre_install] Error 2
gmake: *** [/tmp/FreeBSD12-64_K19.02_GCC7.3.0/x86_64-native-bsdapp-gcc/2acd0aee01f44ce7b4412069883abdfb/dpdk/mk/rte.sdkroot.mk:77: install] Error 2


*Make Build Failed #22:
OS: FreeBSD12-64
Target: x86_64-native-bsdapp-clang
                    ^
/tmp/FreeBSD12-64_K19.02_Clang6.0.1/x86_64-native-bsdapp-clang/2acd0aee01f44ce7b4412069883abdfb/dpdk/drivers/net/bonding/rte_eth_bond_api.c:572:34: error: use of undeclared identifier 'ret'
                                slave_port_id, rte_strerror(-ret));
                                                             ^
3 errors generated.
gmake[6]: *** [/tmp/FreeBSD12-64_K19.02_Clang6.0.1/x86_64-native-bsdapp-clang/2acd0aee01f44ce7b4412069883abdfb/dpdk/mk/internal/rte.compile-pre.mk:116: rte_eth_bond_api.o] Error 1
gmake[5]: *** [/tmp/FreeBSD12-64_K19.02_Clang6.0.1/x86_64-native-bsdapp-clang/2acd0aee01f44ce7b4412069883abdfb/dpdk/mk/rte.subdir.mk:37: bonding] Error 2
gmake[5]: *** Waiting for unfinished jobs....
  CC hw_atl_utils.o
  CC qat_device.o
  AR librte_pmd_fpga_lte_fec.a
  INSTALL-LIB librte_pmd_fpga_lte_fec.a
--
  INSTALL-LIB librte_pmd_octeontx_crypto.a
  AR librte_pmd_crypto_scheduler.a
  INSTALL-LIB librte_pmd_crypto_scheduler.a
  AR librte_pmd_bnx2x.a
  INSTALL-LIB librte_pmd_bnx2x.a
gmake[4]: *** [/tmp/FreeBSD12-64_K19.02_Clang6.0.1/x86_64-native-bsdapp-clang/2acd0aee01f44ce7b4412069883abdfb/dpdk/mk/rte.subdir.mk:35: net] Error 2
gmake[3]: *** [/tmp/FreeBSD12-64_K19.02_Clang6.0.1/x86_64-native-bsdapp-clang/2acd0aee01f44ce7b4412069883abdfb/dpdk/mk/rte.sdkbuild.mk:46: drivers] Error 2
gmake[2]: *** [/tmp/FreeBSD12-64_K19.02_Clang6.0.1/x86_64-native-bsdapp-clang/2acd0aee01f44ce7b4412069883abdfb/dpdk/mk/rte.sdkroot.mk:99: all] Error 2
gmake[1]: *** [/tmp/FreeBSD12-64_K19.02_Clang6.0.1/x86_64-native-bsdapp-clang/2acd0aee01f44ce7b4412069883abdfb/dpdk/mk/rte.sdkinstall.mk:61: pre_install] Error 2
gmake: *** [/tmp/FreeBSD12-64_K19.02_Clang6.0.1/x86_64-native-bsdapp-clang/2acd0aee01f44ce7b4412069883abdfb/dpdk/mk/rte.sdkroot.mk:77: install] Error 2

*Meson Build Failed #1:
OS: SUSE15-64
Target:build-gcc-static
FAILED: drivers/a715181@@tmp_rte_pmd_bond at sta/net_bonding_rte_eth_bond_api.c.o 
gcc -Idrivers/a715181@@tmp_rte_pmd_bond at sta -Idrivers -I../drivers -Idrivers/net/bonding -I../drivers/net/bonding -Ilib/librte_ethdev -I../lib/librte_ethdev -I. -I../ -Iconfig -I../config -Ilib/librte_eal/common/include -I../lib/librte_eal/common/include -I../lib/librte_eal/linux/eal/include -Ilib/librte_eal/common -I../lib/librte_eal/common -Ilib/librte_eal/common/include/arch/x86 -I../lib/librte_eal/common/include/arch/x86 -Ilib/librte_eal -I../lib/librte_eal -Ilib/librte_kvargs -I../lib/librte_kvargs -Ilib/librte_net -I../lib/librte_net -Ilib/librte_mbuf -I../lib/librte_mbuf -Ilib/librte_mempool -I../lib/librte_mempool -Ilib/librte_ring -I../lib/librte_ring -Ilib/librte_meter -I../lib/librte_meter -Idrivers/bus/pci -I../drivers/bus/pci -I../drivers/bus/pci/linux -Ilib/librte_pci -I../lib/librte_pci -Idrivers/bus/vdev -I../drivers/bus/vdev -Ilib/librte_sched -I../lib/librte_sched -Ilib/librte_ip_frag -I../lib/librte_ip_frag -Ilib/librte_hash -I../lib/librte_hash -fdiagnostics-color=always -pipe -D_FILE_OFFSET_BITS=64 -Wall -Winvalid-pch -Werror -O3 -include rte_config.h -Wunused-parameter -Wsign-compare -Wcast-qual -D_GNU_SOURCE -fPIC -march=native -Wno-format-truncation -DALLOW_EXPERIMENTAL_API -MD -MQ 'drivers/a715181@@tmp_rte_pmd_bond at sta/net_bonding_rte_eth_bond_api.c.o' -MF 'drivers/a715181@@tmp_rte_pmd_bond at sta/net_bonding_rte_eth_bond_api.c.o.d' -o 'drivers/a715181@@tmp_rte_pmd_bond at sta/net_bonding_rte_eth_bond_api.c.o' -c ../drivers/net/bonding/rte_eth_bond_api.c
../drivers/net/bonding/rte_eth_bond_api.c: In function ‘__eth_bond_slave_add_lock_free’:
../drivers/net/bonding/rte_eth_bond_api.c:563:3: error: ‘ret’ undeclared (first use in this function); did you mean ‘recv’?
   ret = rte_eth_link_get_nowait(slave_port_id, &link_props);
   ^~~
   recv
../drivers/net/bonding/rte_eth_bond_api.c:563:3: note: each undeclared identifier is reported only once for each function it appears in
[585/1831] Generating rte_pmd_avp.pmd.c with a custom command.
[586/1831] Compiling C object 'lib/76b5a35@@rte_pipeline at sta/librte_pipeline_rte_table_action.c.o'.
[587/1831] Compiling C object 'drivers/a715181@@tmp_rte_pmd_axgbe at sta/net_axgbe_axgbe_rxtx.c.o'.
[588/1831] Compiling C object 'drivers/a715181@@tmp_rte_pmd_bond at sta/net_bonding_rte_eth_bond_args.c.o'.
[589/1831] Compiling C object 'drivers/a715181@@tmp_rte_pmd_bond at sta/net_bonding_rte_eth_bond_flow.c.o'.
[590/1831] Compiling C object 'drivers/a715181@@tmp_rte_pmd_bond at sta/net_bonding_rte_eth_bond_8023ad.c.o'.
[591/1831] Compiling C object 'drivers/a715181@@tmp_rte_pmd_bond at sta/net_bonding_rte_eth_bond_pmd.c.o'.
ninja: build stopped: subcommand failed




*Meson Build Failed #2:
OS: UB1604-32
Target:build-gcc-static
FAILED: drivers/a715181@@tmp_rte_pmd_bond at sta/net_bonding_rte_eth_bond_api.c.o 
gcc -Idrivers/a715181@@tmp_rte_pmd_bond at sta -Idrivers -I../drivers -Idrivers/net/bonding -I../drivers/net/bonding -Ilib/librte_ethdev -I../lib/librte_ethdev -I. -I../ -Iconfig -I../config -Ilib/librte_eal/common/include -I../lib/librte_eal/common/include -I../lib/librte_eal/linux/eal/include -Ilib/librte_eal/common -I../lib/librte_eal/common -Ilib/librte_eal/common/include/arch/x86 -I../lib/librte_eal/common/include/arch/x86 -Ilib/librte_eal -I../lib/librte_eal -Ilib/librte_kvargs -I../lib/librte_kvargs -Ilib/librte_net -I../lib/librte_net -Ilib/librte_mbuf -I../lib/librte_mbuf -Ilib/librte_mempool -I../lib/librte_mempool -Ilib/librte_ring -I../lib/librte_ring -Ilib/librte_meter -I../lib/librte_meter -Idrivers/bus/pci -I../drivers/bus/pci -I../drivers/bus/pci/linux -Ilib/librte_pci -I../lib/librte_pci -Idrivers/bus/vdev -I../drivers/bus/vdev -Ilib/librte_sched -I../lib/librte_sched -Ilib/librte_ip_frag -I../lib/librte_ip_frag -Ilib/librte_hash -I../lib/librte_hash -fdiagnostics-color=always -pipe -D_FILE_OFFSET_BITS=64 -Wall -Winvalid-pch -Werror -O3 -include rte_config.h -Wunused-parameter -Wsign-compare -Wcast-qual -Wno-pointer-to-int-cast -D_GNU_SOURCE -fPIC -march=native -DALLOW_EXPERIMENTAL_API -MD -MQ 'drivers/a715181@@tmp_rte_pmd_bond at sta/net_bonding_rte_eth_bond_api.c.o' -MF 'drivers/a715181@@tmp_rte_pmd_bond at sta/net_bonding_rte_eth_bond_api.c.o.d' -o 'drivers/a715181@@tmp_rte_pmd_bond at sta/net_bonding_rte_eth_bond_api.c.o' -c ../drivers/net/bonding/rte_eth_bond_api.c
../drivers/net/bonding/rte_eth_bond_api.c: In function ‘__eth_bond_slave_add_lock_free’:
../drivers/net/bonding/rte_eth_bond_api.c:563:3: error: ‘ret’ undeclared (first use in this function)
   ret = rte_eth_link_get_nowait(slave_port_id, &link_props);
   ^
../drivers/net/bonding/rte_eth_bond_api.c:563:3: note: each undeclared identifier is reported only once for each function it appears in
[583/1656] Compiling C object 'drivers/a715181@@tmp_rte_pmd_axgbe at sta/net_axgbe_axgbe_rxtx_vec_sse.c.o'.
[584/1656] Compiling C object 'drivers/a715181@@tmp_rte_pmd_avp at sta/net_avp_avp_ethdev.c.o'.
[585/1656] Compiling C object 'drivers/a715181@@tmp_rte_pmd_bond at sta/net_bonding_rte_eth_bond_flow.c.o'.
[586/1656] Compiling C object 'drivers/a715181@@tmp_rte_pmd_bond at sta/net_bonding_rte_eth_bond_args.c.o'.
[587/1656] Compiling C object 'drivers/a715181@@tmp_rte_pmd_axgbe at sta/net_axgbe_axgbe_rxtx.c.o'.
ninja: build stopped: subcommand failed




*Meson Build Failed #3:
OS: FC30-64
Target:build-gcc-static
FAILED: drivers/a715181@@tmp_rte_pmd_bond at sta/net_bonding_rte_eth_bond_api.c.o 
gcc -Idrivers/a715181@@tmp_rte_pmd_bond at sta -Idrivers -I../drivers -Idrivers/net/bonding -I../drivers/net/bonding -Ilib/librte_ethdev -I../lib/librte_ethdev -I. -I../ -Iconfig -I../config -Ilib/librte_eal/common/include -I../lib/librte_eal/common/include -I../lib/librte_eal/linux/eal/include -Ilib/librte_eal/common -I../lib/librte_eal/common -Ilib/librte_eal/common/include/arch/x86 -I../lib/librte_eal/common/include/arch/x86 -Ilib/librte_eal -I../lib/librte_eal -Ilib/librte_kvargs -I../lib/librte_kvargs -Ilib/librte_net -I../lib/librte_net -Ilib/librte_mbuf -I../lib/librte_mbuf -Ilib/librte_mempool -I../lib/librte_mempool -Ilib/librte_ring -I../lib/librte_ring -Ilib/librte_meter -I../lib/librte_meter -Idrivers/bus/pci -I../drivers/bus/pci -I../drivers/bus/pci/linux -Ilib/librte_pci -I../lib/librte_pci -Idrivers/bus/vdev -I../drivers/bus/vdev -Ilib/librte_sched -I../lib/librte_sched -Ilib/librte_ip_frag -I../lib/librte_ip_frag -Ilib/librte_hash -I../lib/librte_hash -fdiagnostics-color=always -pipe -D_FILE_OFFSET_BITS=64 -Wall -Winvalid-pch -Werror -O3 -include rte_config.h -Wunused-parameter -Wsign-compare -Wcast-qual -Wno-address-of-packed-member -D_GNU_SOURCE -fPIC -march=native -mno-avx512f -Wno-format-truncation -DALLOW_EXPERIMENTAL_API -MD -MQ 'drivers/a715181@@tmp_rte_pmd_bond at sta/net_bonding_rte_eth_bond_api.c.o' -MF 'drivers/a715181@@tmp_rte_pmd_bond at sta/net_bonding_rte_eth_bond_api.c.o.d' -o 'drivers/a715181@@tmp_rte_pmd_bond at sta/net_bonding_rte_eth_bond_api.c.o' -c ../drivers/net/bonding/rte_eth_bond_api.c
../drivers/net/bonding/rte_eth_bond_api.c: In function ‘__eth_bond_slave_add_lock_free’:
../drivers/net/bonding/rte_eth_bond_api.c:563:3: error: ‘ret’ undeclared (first use in this function)
  563 |   ret = rte_eth_link_get_nowait(slave_port_id, &link_props);
      |   ^~~
../drivers/net/bonding/rte_eth_bond_api.c:563:3: note: each undeclared identifier is reported only once for each function it appears in
[587/1784] Compiling C object 'drivers/a715181@@rte_pmd_avp at sta/meson-generated_.._rte_pmd_avp.pmd.c.o'.
[588/1784] Compiling C object 'drivers/a715181@@tmp_rte_pmd_axgbe at sta/net_axgbe_axgbe_dev.c.o'.
[589/1784] Compiling C object 'drivers/a715181@@tmp_rte_pmd_axgbe at sta/net_axgbe_axgbe_rxtx.c.o'.
[590/1784] Compiling C object 'drivers/a715181@@tmp_rte_pmd_axgbe at sta/net_axgbe_axgbe_rxtx_vec_sse.c.o'.
[591/1784] Compiling C object 'drivers/a715181@@tmp_rte_pmd_bond at sta/net_bonding_rte_eth_bond_flow.c.o'.
[592/1784] Compiling C object 'drivers/a715181@@tmp_rte_pmd_bond at sta/net_bonding_rte_eth_bond_pmd.c.o'.
[593/1784] Compiling C object 'lib/76b5a35@@rte_pipeline at sta/librte_pipeline_rte_table_action.c.o'.
ninja: build stopped: subcommand failed




*Meson Build Failed #4:
OS: UB1804-64
Target:build-gcc-static
FAILED: drivers/a715181@@tmp_rte_pmd_bond at sta/net_bonding_rte_eth_bond_api.c.o 
gcc -Idrivers/a715181@@tmp_rte_pmd_bond at sta -Idrivers -I../drivers -Idrivers/net/bonding -I../drivers/net/bonding -Ilib/librte_ethdev -I../lib/librte_ethdev -I. -I../ -Iconfig -I../config -Ilib/librte_eal/common/include -I../lib/librte_eal/common/include -I../lib/librte_eal/linux/eal/include -Ilib/librte_eal/common -I../lib/librte_eal/common -Ilib/librte_eal/common/include/arch/x86 -I../lib/librte_eal/common/include/arch/x86 -Ilib/librte_eal -I../lib/librte_eal -Ilib/librte_kvargs -I../lib/librte_kvargs -Ilib/librte_net -I../lib/librte_net -Ilib/librte_mbuf -I../lib/librte_mbuf -Ilib/librte_mempool -I../lib/librte_mempool -Ilib/librte_ring -I../lib/librte_ring -Ilib/librte_meter -I../lib/librte_meter -Idrivers/bus/pci -I../drivers/bus/pci -I../drivers/bus/pci/linux -Ilib/librte_pci -I../lib/librte_pci -Idrivers/bus/vdev -I../drivers/bus/vdev -Ilib/librte_sched -I../lib/librte_sched -Ilib/librte_ip_frag -I../lib/librte_ip_frag -Ilib/librte_hash -I../lib/librte_hash -fdiagnostics-color=always -pipe -D_FILE_OFFSET_BITS=64 -Wall -Winvalid-pch -Werror -O3 -include rte_config.h -Wunused-parameter -Wsign-compare -Wcast-qual -D_GNU_SOURCE -fPIC -march=native -mno-avx512f -Wno-format-truncation -DALLOW_EXPERIMENTAL_API -MD -MQ 'drivers/a715181@@tmp_rte_pmd_bond at sta/net_bonding_rte_eth_bond_api.c.o' -MF 'drivers/a715181@@tmp_rte_pmd_bond at sta/net_bonding_rte_eth_bond_api.c.o.d' -o 'drivers/a715181@@tmp_rte_pmd_bond at sta/net_bonding_rte_eth_bond_api.c.o' -c ../drivers/net/bonding/rte_eth_bond_api.c
../drivers/net/bonding/rte_eth_bond_api.c: In function ‘__eth_bond_slave_add_lock_free’:
../drivers/net/bonding/rte_eth_bond_api.c:563:3: error: ‘ret’ undeclared (first use in this function); did you mean ‘recv’?
   ret = rte_eth_link_get_nowait(slave_port_id, &link_props);
   ^~~
   recv
../drivers/net/bonding/rte_eth_bond_api.c:563:3: note: each undeclared identifier is reported only once for each function it appears in
[586/1791] Compiling C object 'drivers/a715181@@tmp_rte_pmd_avp at sta/net_avp_avp_ethdev.c.o'.
[587/1791] Compiling C object 'drivers/a715181@@tmp_rte_pmd_axgbe at sta/net_axgbe_axgbe_phy_impl.c.o'.
[588/1791] Compiling C object 'drivers/a715181@@tmp_rte_pmd_axgbe at sta/net_axgbe_axgbe_rxtx_vec_sse.c.o'.
[589/1791] Compiling C object 'drivers/a715181@@tmp_rte_pmd_axgbe at sta/net_axgbe_axgbe_rxtx.c.o'.
[590/1791] Compiling C object 'drivers/a715181@@tmp_rte_pmd_bond at sta/net_bonding_rte_eth_bond_pmd.c.o'.
ninja: build stopped: subcommand failed




*Meson Build Failed #5:
OS: FreeBSD12-64
Target:build-gcc-static
FAILED: drivers/a715181@@tmp_rte_pmd_bond at sta/net_bonding_rte_eth_bond_api.c.o 
ccache gcc -Idrivers/a715181@@tmp_rte_pmd_bond at sta -Idrivers -I../drivers -Idrivers/net/bonding -I../drivers/net/bonding -Ilib/librte_ethdev -I../lib/librte_ethdev -I. -I../ -Iconfig -I../config -Ilib/librte_eal/common/include -I../lib/librte_eal/common/include -I../lib/librte_eal/freebsd/eal/include -Ilib/librte_eal/common -I../lib/librte_eal/common -Ilib/librte_eal/common/include/arch/x86 -I../lib/librte_eal/common/include/arch/x86 -Ilib/librte_eal -I../lib/librte_eal -Ilib/librte_kvargs -I../lib/librte_kvargs -Ilib/librte_net -I../lib/librte_net -Ilib/librte_mbuf -I../lib/librte_mbuf -Ilib/librte_mempool -I../lib/librte_mempool -Ilib/librte_ring -I../lib/librte_ring -Ilib/librte_meter -I../lib/librte_meter -Idrivers/bus/pci -I../drivers/bus/pci -I../drivers/bus/pci/bsd -Ilib/librte_pci -I../lib/librte_pci -Idrivers/bus/vdev -I../drivers/bus/vdev -Ilib/librte_sched -I../lib/librte_sched -Ilib/librte_ip_frag -I../lib/librte_ip_frag -Ilib/librte_hash -I../lib/librte_hash -fdiagnostics-color=always -pipe -D_FILE_OFFSET_BITS=64 -Wall -Winvalid-pch -Werror -O3 -include rte_config.h -Wunused-parameter -Wsign-compare -Wcast-qual -D_GNU_SOURCE -D__BSD_VISIBLE -fPIC -march=native -Wno-format-truncation -DALLOW_EXPERIMENTAL_API -MD -MQ 'drivers/a715181@@tmp_rte_pmd_bond at sta/net_bonding_rte_eth_bond_api.c.o' -MF 'drivers/a715181@@tmp_rte_pmd_bond at sta/net_bonding_rte_eth_bond_api.c.o.d' -o 'drivers/a715181@@tmp_rte_pmd_bond at sta/net_bonding_rte_eth_bond_api.c.o' -c ../drivers/net/bonding/rte_eth_bond_api.c
../drivers/net/bonding/rte_eth_bond_api.c: In function '__eth_bond_slave_add_lock_free':
../drivers/net/bonding/rte_eth_bond_api.c:563:3: error: 'ret' undeclared (first use in this function); did you mean 'getw'?
   ret = rte_eth_link_get_nowait(slave_port_id, &link_props);
   ^~~
   getw
../drivers/net/bonding/rte_eth_bond_api.c:563:3: note: each undeclared identifier is reported only once for each function it appears in
[146/1413] Generating rte_pmd_atlantic.pmd.c with a custom command.
[147/1413] Compiling C object 'drivers/a715181@@tmp_rte_pmd_bond at sta/net_bonding_rte_eth_bond_flow.c.o'.
[148/1413] Compiling C object 'drivers/a715181@@tmp_rte_pmd_bond at sta/net_bonding_rte_eth_bond_args.c.o'.
[149/1413] Compiling C object 'drivers/a715181@@tmp_rte_pmd_bond at sta/net_bonding_rte_eth_bond_8023ad.c.o'.
[150/1413] Compiling C object 'drivers/a715181@@tmp_rte_pmd_bond at sta/net_bonding_rte_eth_bond_pmd.c.o'.
ninja: build stopped: subcommand failed



DPDK STV team


More information about the test-report mailing list