[dpdk-test-report] |FAILURE| pw59234[v2, 4/6] examples/ioat: add two threads configuration

sys_stv at intel.com sys_stv at intel.com
Fri Sep 13 17:34:11 CEST 2019


Test-Label: Intel-compilation
Test-Status: FAILURE
http://dpdk.org/patch/59234

_Compilation issues_

Submitter: Marcin Baran <marcinx.baran at intel.com>
Date: 2019-09-13 14:39:11
Reply_mail: 20190913143914.2332-5-marcinx.baran at intel.com
DPDK git baseline: Repo:dpdk, CommitID: 73afc9df00d8ba4ff58d4a7a86691ca10520d462

Makefile build Summary: 22 Builds Done, 22 Successful, 0 Failures

Meson build Summary: 7 Builds Done, 2 Successful, 5 Failures

               +==============================================+===========+==========+
               |                   Makefile                   |   Meson   | Document |
+--------------+------+-------+------+------------+-----------+-----------+----------+
| os           | gcc  | clang | icc  | gcc+shared | gcc+debug | gcc/clang | pdf/html |
+--------------+------+-------+------+------------+-----------+-----------+----------+
| RHEL76-64    | pass |       |      |            |           |           |          |
| CENTOS76-64  | pass | pass  | pass | pass       | pass      |           |          |
| UB1804-64    | pass | pass  | pass |            |           | FAIL      | pass     |
| UB1604-32    | pass |       |      |            |           | FAIL      |          |
| UB1904-64    | pass |       |      |            |           |           |          |
| UB1604-64    | pass | pass  |      |            |           |           |          |
| FC30-64      | pass | pass  |      |            |           | FAIL      |          |
| WIN10-64     |      |       |      |            |           | pass      |          |
| FreeBSD12-64 | pass | pass  |      | pass       | pass      | FAIL      |          |
| RHEL80-64    | pass |       |      |            |           |           |          |
| SUSE15-64    | pass | pass  |      |            |           | FAIL      |          |
+--------------+------+-------+------+------------+-----------+-----------+----------+

Test environment and configuration as below:

** Makefile build **


OS: RHEL76-64
	Kernel Version: 3.10.0-957.el7.x86_64
	CPU info: Intel(R) Xeon(R) CPU E5-2699 v4 @ 2.20GHz
	GCC Version: gcc (GCC) 4.8.5 20150623 (Red Hat 4.8.5-36)
	Clang Version: NA
	x86_64-native-linuxapp-gcc


OS: CENTOS76-64
	Kernel Version: 3.10.0-957.10.1.el7.x86_64
	CPU info: Intel(R) Xeon(R) CPU E5-2699 v4 @ 2.20GHz
	GCC Version: gcc (GCC) 4.8.5 20150623 (Red Hat 4.8.5-36)
	Clang Version: 3.4.2 (tags/RELEASE_34/dot2-final)
	x86_64-native-linuxapp-gcc+debug
	x86_64-native-linuxapp-gcc
	x86_64-native-linuxapp-clang
	x86_64-native-linuxapp-gcc+shared
	x86_64-native-linuxapp-icc


OS: UB1804-64
	Kernel Version: 4.15.0-20-generic
	CPU info: Intel(R) Xeon(R) CPU E5-2699 v3 @ 2.30GHz
	GCC Version: gcc (Ubuntu 7.3.0-27ubuntu1~18.04) 7.3.0
	Clang Version: 6.0.0-1ubuntu2 (tags/RELEASE_600/final)
	x86_64-native-linuxapp-icc
	x86_64-native-linuxapp-clang
	x86_64-native-linuxapp-gcc


OS: UB1904-64
	Kernel Version: 5.0.0-13-generic
	CPU info: Intel(R) Xeon(R) CPU E5-2699 v3 @ 2.30GHz
	GCC Version: gcc (Ubuntu 8.3.0-6ubuntu1) 8.3.0
	Clang Version: 8.0.0-3 (tags/RELEASE_800/final)
	x86_64-native-linuxapp-gcc


OS: UB1604-32
	Kernel Version: 4.4.0-131-generic
	CPU info: Intel(R) Xeon(R) CPU E5-2699 v3 @ 2.30GHz
	GCC Version: gcc (Ubuntu 5.4.0-6ubuntu1~16.04.11) 5.4.0 20160609
	Clang Version: 3.8.0-2ubuntu4 (tags/RELEASE_380/final)
	i686-native-linuxapp-gcc


OS: UB1604-64
	Kernel Version: 4.4.0-47-generic
	CPU info: Intel(R) Xeon(R) CPU E5-2699 v3 @ 2.30GHz
	GCC Version: gcc (Ubuntu 5.4.0-6ubuntu1~16.04.10) 5.4.0 20160609
	Clang Version: 3.8.0-2ubuntu4 (tags/RELEASE_380/final)
	x86_64-native-linuxapp-clang
	x86_64-native-linuxapp-gcc


OS: FC30-64
	Kernel Version: 5.1.7-300.fc30.x86_64
	CPU info: Intel(R) Xeon(R) CPU E5-2699 v4 @ 2.20GHz
	GCC Version: gcc (GCC) 9.1.1 20190503 (Red Hat 9.1.1-1)
	Clang Version: 8.0.0 (Fedora 8.0.0-1.fc30)
	x86_64-native-linuxapp-gcc
	x86_64-native-linuxapp-clang


OS: FreeBSD12-64
	Kernel Version: 12.0-RC3
	CPU info: Intel(R) Xeon(R) CPU E5-2699 v4 @ 2.20GHz (2194.97-MHz K8-class CPU)
	GCC Version: gcc (FreeBSD Ports Collection) 7.3.0
	Clang Version: 6.0.1 (tags/RELEASE_601/final 335540) (based on LLVM 6.0.1)
	x86_64-native-bsdapp-clang
	x86_64-native-bsdapp-gcc+shared
	x86_64-native-bsdapp-gcc
	x86_64-native-bsdapp-gcc+debug


OS: RHEL80-64
	Kernel Version: 4.18.0-80.el8.x86_64
	CPU info: Intel(R) Xeon(R) CPU E5-2699 v4 @ 2.20GHz
	GCC Version: gcc (GCC) 8.2.1 20180905 (Red Hat 8.2.1-3)
	Clang Version: 6.0.1 (tags/RELEASE_601/final)
	x86_64-native-linuxapp-gcc


OS: SUSE15-64
	Kernel Version: 4.12.14-lp150.11-default
	CPU info: Intel(R) Xeon(R) CPU E5-2699 v4 @ 2.20GHz
	GCC Version: gcc (SUSE Linux) 7.3.1 20180323 [gcc-7-branch revision 258812]
	Clang Version: 5.0.1 (tags/RELEASE_501/final 312548)
	x86_64-native-linuxapp-gcc
	x86_64-native-linuxapp-clang


** Meson build **


OS: UB1804-64
	Kernel Version: 4.15.0-20-generic
	CPU info: Intel(R) Xeon(R) CPU E5-2699 v4 @ 2.20GHz
	GCC Version: gcc (Ubuntu 7.3.0-27ubuntu1~18.04) 7.3.0
	Clang Version: 6.0.0-1ubuntu2 (tags/RELEASE_600/final)
	build-gcc-static
	build-gcc-shared
	build-clang-static
	build-clang-shared
	build-x86-default
	x86_64-native-linuxapp-doc


OS: UB1604-32
	Kernel Version: 4.4.0-131-generic
	CPU info: Intel(R) Xeon(R) CPU E5-2699 v4 @ 2.20GHz
	GCC Version: gcc (Ubuntu 5.4.0-6ubuntu1~16.04.11) 5.4.0 20160609
	Clang Version: 3.8.0-2ubuntu4 (tags/RELEASE_380/final)
	build-gcc-static
	build-gcc-shared
	build-clang-static
	build-clang-shared
	build-x86-default


OS: FC30-64
	Kernel Version: 5.0.9-301.fc30.x86_64
	CPU info: Intel(R) Xeon(R) CPU E5-2699 v4 @ 2.20GHz
	GCC Version: gcc (GCC) 9.1.1 20190503 (Red Hat 9.1.1-1)
	Clang Version: 8.0.0 (Fedora 8.0.0-1.fc30)
	build-gcc-static
	build-gcc-shared
	build-clang-static
	build-clang-shared
	build-x86-default


OS: WIN10-64
	Kernel Version: N/A
	CPU info: N/A
	GCC Version: N/A
	Clang Version: Clang 8.0.0
	x86_64-windows-clang


OS: FreeBSD12-64
	Kernel Version: 12.0-RC3
	CPU info: Intel(R) Xeon(R) CPU E5-2699 v4 @ 2.20GHz (2194.99-MHz K8-class CPU)
	GCC Version: gcc (FreeBSD Ports Collection) 7.3.0
	Clang Version: 6.0.1 (tags/RELEASE_601/final 335540) (based on LLVM 6.0.1)
	build-gcc-static
	build-gcc-shared
	build-clang-static
	build-clang-shared
	build-x86-default


OS: SUSE15-64
	Kernel Version: 4.12.14-lp150.11-default
	CPU info: Intel(R) Xeon(R) CPU E5-2699 v4 @ 2.20GHz
	GCC Version: gcc (SUSE Linux) 7.3.1 20180323 [gcc-7-branch revision 258812]
	Clang Version: 5.0.1 (tags/RELEASE_501/final 312548)
	build-gcc-static
	build-gcc-shared
	build-clang-static
	build-clang-shared
	build-x86-default


*Meson Build Failed #1:
OS: SUSE15-64
Target:build-gcc-static
Library execinfo found: NO
Compiler for C supports arguments -Wno-format-truncation -Wformat-truncation: YES
Message: Skipping example "bpf"
Message: Skipping example "ethtool"

examples/meson.build:89:4: ERROR: Problem encountered: Missing dependency "pmd_ioat" for example "ioat"

A full log can be found at /tmp/SUSE15-64_K4.12.14_GCC7.3.1/x86_64-native-linuxapp-gcc/50baa6c00a15425e8dc9fbfb0b81b37e/dpdk/build-gcc-static/meson-logs/meson-log.txt
ninja -C build-gcc-static
ninja: Entering directory `build-gcc-static'
ninja: error: loading 'build.ninja': No such file or directory
--
Library execinfo found: NO
Compiler for C supports arguments -Wno-format-truncation -Wformat-truncation: YES
Message: Skipping example "bpf"
Message: Skipping example "ethtool"

examples/meson.build:89:4: ERROR: Problem encountered: Missing dependency "pmd_ioat" for example "ioat"

A full log can be found at /tmp/SUSE15-64_K4.12.14_GCC7.3.1/x86_64-native-linuxapp-gcc/50baa6c00a15425e8dc9fbfb0b81b37e/dpdk/build-gcc-shared/meson-logs/meson-log.txt
ninja -C build-gcc-shared
ninja: Entering directory `build-gcc-shared'
ninja: error: loading 'build.ninja': No such file or directory
--
Library execinfo found: NO
Compiler for C supports arguments -Wno-format-truncation: NO
Message: Skipping example "bpf"
Message: Skipping example "ethtool"

examples/meson.build:89:4: ERROR: Problem encountered: Missing dependency "pmd_ioat" for example "ioat"

A full log can be found at /tmp/SUSE15-64_K4.12.14_GCC7.3.1/x86_64-native-linuxapp-gcc/50baa6c00a15425e8dc9fbfb0b81b37e/dpdk/build-clang-static/meson-logs/meson-log.txt
ninja -C build-clang-static
ninja: Entering directory `build-clang-static'
ninja: error: loading 'build.ninja': No such file or directory
--
Library execinfo found: NO
Compiler for C supports arguments -Wno-format-truncation: NO
Message: Skipping example "bpf"
Message: Skipping example "ethtool"

examples/meson.build:89:4: ERROR: Problem encountered: Missing dependency "pmd_ioat" for example "ioat"

A full log can be found at /tmp/SUSE15-64_K4.12.14_GCC7.3.1/x86_64-native-linuxapp-gcc/50baa6c00a15425e8dc9fbfb0b81b37e/dpdk/build-clang-shared/meson-logs/meson-log.txt
ninja -C build-clang-shared
ninja: Entering directory `build-clang-shared'
ninja: error: loading 'build.ninja': No such file or directory
--
Library execinfo found: NO
Compiler for C supports arguments -Wno-format-truncation -Wformat-truncation: YES
Message: Skipping example "bpf"
Message: Skipping example "ethtool"

examples/meson.build:89:4: ERROR: Problem encountered: Missing dependency "pmd_ioat" for example "ioat"

A full log can be found at /tmp/SUSE15-64_K4.12.14_GCC7.3.1/x86_64-native-linuxapp-gcc/50baa6c00a15425e8dc9fbfb0b81b37e/dpdk/build-x86-default/meson-logs/meson-log.txt
ninja -C build-x86-default
ninja: Entering directory `build-x86-default'
ninja: error: loading 'build.ninja': No such file or directory
--
ninja: error: loading 'build.ninja': No such file or directory
find: ‘/tmp/SUSE15-64_K4.12.14_GCC7.3.1/x86_64-native-linuxapp-gcc/50baa6c00a15425e8dc9fbfb0b81b37e/dpdk/build-x86-default/install-root’: No such file or directory
dirname: missing operand
Try 'dirname --help' for more information.
## Building cmdline
gmake: *** /tmp/SUSE15-64_K4.12.14_GCC7.3.1/x86_64-native-linuxapp-gcc/50baa6c00a15425e8dc9fbfb0b81b37e/dpdk/build-x86-default/install-root/usr/local/share/dpdk/examples/cmdline: No such file or directory.  Stop.
## Building helloworld
gmake: *** /tmp/SUSE15-64_K4.12.14_GCC7.3.1/x86_64-native-linuxapp-gcc/50baa6c00a15425e8dc9fbfb0b81b37e/dpdk/build-x86-default/install-root/usr/local/share/dpdk/examples/helloworld: No such file or directory.  Stop.
## Building l2fwd
gmake: *** /tmp/SUSE15-64_K4.12.14_GCC7.3.1/x86_64-native-linuxapp-gcc/50baa6c00a15425e8dc9fbfb0b81b37e/dpdk/build-x86-default/install-root/usr/local/share/dpdk/examples/l2fwd: No such file or directory.  Stop.
## Building l3fwd
gmake: *** /tmp/SUSE15-64_K4.12.14_GCC7.3.1/x86_64-native-linuxapp-gcc/50baa6c00a15425e8dc9fbfb0b81b37e/dpdk/build-x86-default/install-root/usr/local/share/dpdk/examples/l3fwd: No such file or directory.  Stop.
## Building skeleton
gmake: *** /tmp/SUSE15-64_K4.12.14_GCC7.3.1/x86_64-native-linuxapp-gcc/50baa6c00a15425e8dc9fbfb0b81b37e/dpdk/build-x86-default/install-root/usr/local/share/dpdk/examples/skeleton: No such file or directory.  Stop.
## Building timer
gmake: *** /tmp/SUSE15-64_K4.12.14_GCC7.3.1/x86_64-native-linuxapp-gcc/50baa6c00a15425e8dc9fbfb0b81b37e/dpdk/build-x86-default/install-root/usr/local/share/dpdk/examples/timer: No such file or directory.  Stop.


*Meson Build Failed #2:
OS: UB1604-32
Target:build-gcc-static
Library execinfo found: NO
Compiler for C supports arguments -Wno-format-truncation -Wformat-truncation: NO
Message: Skipping example "bpf"
Message: Skipping example "ethtool"

examples/meson.build:89:4: ERROR: Problem encountered: Missing dependency "pmd_ioat" for example "ioat"

A full log can be found at /tmp/UB1604-32_K4.4.0_GCC5.4.0/i686-native-linuxapp-gcc/50baa6c00a15425e8dc9fbfb0b81b37e/dpdk/build-gcc-static/meson-logs/meson-log.txt
ninja -C build-gcc-static
ninja: Entering directory `build-gcc-static'
ninja: error: loading 'build.ninja': No such file or directory
--
Library execinfo found: NO
Compiler for C supports arguments -Wno-format-truncation -Wformat-truncation: NO
Message: Skipping example "bpf"
Message: Skipping example "ethtool"

examples/meson.build:89:4: ERROR: Problem encountered: Missing dependency "pmd_ioat" for example "ioat"

A full log can be found at /tmp/UB1604-32_K4.4.0_GCC5.4.0/i686-native-linuxapp-gcc/50baa6c00a15425e8dc9fbfb0b81b37e/dpdk/build-gcc-shared/meson-logs/meson-log.txt
ninja -C build-gcc-shared
ninja: Entering directory `build-gcc-shared'
ninja: error: loading 'build.ninja': No such file or directory
--
Library execinfo found: NO
Compiler for C supports arguments -Wno-format-truncation: NO
Message: Skipping example "bpf"
Message: Skipping example "ethtool"

examples/meson.build:89:4: ERROR: Problem encountered: Missing dependency "pmd_ioat" for example "ioat"

A full log can be found at /tmp/UB1604-32_K4.4.0_GCC5.4.0/i686-native-linuxapp-gcc/50baa6c00a15425e8dc9fbfb0b81b37e/dpdk/build-clang-static/meson-logs/meson-log.txt
ninja -C build-clang-static
ninja: Entering directory `build-clang-static'
ninja: error: loading 'build.ninja': No such file or directory
--
Library execinfo found: NO
Compiler for C supports arguments -Wno-format-truncation: NO
Message: Skipping example "bpf"
Message: Skipping example "ethtool"

examples/meson.build:89:4: ERROR: Problem encountered: Missing dependency "pmd_ioat" for example "ioat"

A full log can be found at /tmp/UB1604-32_K4.4.0_GCC5.4.0/i686-native-linuxapp-gcc/50baa6c00a15425e8dc9fbfb0b81b37e/dpdk/build-clang-shared/meson-logs/meson-log.txt
ninja -C build-clang-shared
ninja: Entering directory `build-clang-shared'
ninja: error: loading 'build.ninja': No such file or directory
--
Library execinfo found: NO
Compiler for C supports arguments -Wno-format-truncation -Wformat-truncation: NO
Message: Skipping example "bpf"
Message: Skipping example "ethtool"

examples/meson.build:89:4: ERROR: Problem encountered: Missing dependency "pmd_ioat" for example "ioat"

A full log can be found at /tmp/UB1604-32_K4.4.0_GCC5.4.0/i686-native-linuxapp-gcc/50baa6c00a15425e8dc9fbfb0b81b37e/dpdk/build-x86-default/meson-logs/meson-log.txt
ninja -C build-x86-default
ninja: Entering directory `build-x86-default'
ninja: error: loading 'build.ninja': No such file or directory
--
ninja: error: loading 'build.ninja': No such file or directory
find: ‘/tmp/UB1604-32_K4.4.0_GCC5.4.0/i686-native-linuxapp-gcc/50baa6c00a15425e8dc9fbfb0b81b37e/dpdk/build-x86-default/install-root’: No such file or directory
dirname: missing operand
Try 'dirname --help' for more information.
## Building cmdline
make: *** /tmp/UB1604-32_K4.4.0_GCC5.4.0/i686-native-linuxapp-gcc/50baa6c00a15425e8dc9fbfb0b81b37e/dpdk/build-x86-default/install-root/usr/local/share/dpdk/examples/cmdline: No such file or directory.  Stop.
## Building helloworld
make: *** /tmp/UB1604-32_K4.4.0_GCC5.4.0/i686-native-linuxapp-gcc/50baa6c00a15425e8dc9fbfb0b81b37e/dpdk/build-x86-default/install-root/usr/local/share/dpdk/examples/helloworld: No such file or directory.  Stop.
## Building l2fwd
make: *** /tmp/UB1604-32_K4.4.0_GCC5.4.0/i686-native-linuxapp-gcc/50baa6c00a15425e8dc9fbfb0b81b37e/dpdk/build-x86-default/install-root/usr/local/share/dpdk/examples/l2fwd: No such file or directory.  Stop.
## Building l3fwd
make: *** /tmp/UB1604-32_K4.4.0_GCC5.4.0/i686-native-linuxapp-gcc/50baa6c00a15425e8dc9fbfb0b81b37e/dpdk/build-x86-default/install-root/usr/local/share/dpdk/examples/l3fwd: No such file or directory.  Stop.
## Building skeleton
make: *** /tmp/UB1604-32_K4.4.0_GCC5.4.0/i686-native-linuxapp-gcc/50baa6c00a15425e8dc9fbfb0b81b37e/dpdk/build-x86-default/install-root/usr/local/share/dpdk/examples/skeleton: No such file or directory.  Stop.
## Building timer
make: *** /tmp/UB1604-32_K4.4.0_GCC5.4.0/i686-native-linuxapp-gcc/50baa6c00a15425e8dc9fbfb0b81b37e/dpdk/build-x86-default/install-root/usr/local/share/dpdk/examples/timer: No such file or directory.  Stop.


*Meson Build Failed #3:
OS: FC30-64
Target:build-gcc-static
Library execinfo found: NO
Compiler for C supports arguments -Wno-format-truncation -Wformat-truncation: YES
Message: Skipping example "bpf"
Message: Skipping example "ethtool"

examples/meson.build:89:4: ERROR: Problem encountered: Missing dependency "pmd_ioat" for example "ioat"

A full log can be found at /tmp/FC30-64_K4.20_GCC9.1.1/x86_64-native-linuxapp-gcc/50baa6c00a15425e8dc9fbfb0b81b37e/dpdk/build-gcc-static/meson-logs/meson-log.txt
ninja -C build-gcc-static
ninja: Entering directory `build-gcc-static'
ninja: error: loading 'build.ninja': No such file or directory
--
Library execinfo found: NO
Compiler for C supports arguments -Wno-format-truncation -Wformat-truncation: YES
Message: Skipping example "bpf"
Message: Skipping example "ethtool"

examples/meson.build:89:4: ERROR: Problem encountered: Missing dependency "pmd_ioat" for example "ioat"

A full log can be found at /tmp/FC30-64_K4.20_GCC9.1.1/x86_64-native-linuxapp-gcc/50baa6c00a15425e8dc9fbfb0b81b37e/dpdk/build-gcc-shared/meson-logs/meson-log.txt
ninja -C build-gcc-shared
ninja: Entering directory `build-gcc-shared'
ninja: error: loading 'build.ninja': No such file or directory
--
Library execinfo found: NO
Compiler for C supports arguments -Wno-format-truncation: NO
Message: Skipping example "bpf"
Message: Skipping example "ethtool"

examples/meson.build:89:4: ERROR: Problem encountered: Missing dependency "pmd_ioat" for example "ioat"

A full log can be found at /tmp/FC30-64_K4.20_GCC9.1.1/x86_64-native-linuxapp-gcc/50baa6c00a15425e8dc9fbfb0b81b37e/dpdk/build-clang-static/meson-logs/meson-log.txt
ninja -C build-clang-static
ninja: Entering directory `build-clang-static'
ninja: error: loading 'build.ninja': No such file or directory
--
Library execinfo found: NO
Compiler for C supports arguments -Wno-format-truncation: NO
Message: Skipping example "bpf"
Message: Skipping example "ethtool"

examples/meson.build:89:4: ERROR: Problem encountered: Missing dependency "pmd_ioat" for example "ioat"

A full log can be found at /tmp/FC30-64_K4.20_GCC9.1.1/x86_64-native-linuxapp-gcc/50baa6c00a15425e8dc9fbfb0b81b37e/dpdk/build-clang-shared/meson-logs/meson-log.txt
ninja -C build-clang-shared
ninja: Entering directory `build-clang-shared'
ninja: error: loading 'build.ninja': No such file or directory
--
Library execinfo found: NO
Compiler for C supports arguments -Wno-format-truncation -Wformat-truncation: YES
Message: Skipping example "bpf"
Message: Skipping example "ethtool"

examples/meson.build:89:4: ERROR: Problem encountered: Missing dependency "pmd_ioat" for example "ioat"

A full log can be found at /tmp/FC30-64_K4.20_GCC9.1.1/x86_64-native-linuxapp-gcc/50baa6c00a15425e8dc9fbfb0b81b37e/dpdk/build-x86-default/meson-logs/meson-log.txt
ninja -C build-x86-default
ninja: Entering directory `build-x86-default'
ninja: error: loading 'build.ninja': No such file or directory
--
ninja: error: loading 'build.ninja': No such file or directory
find: ‘/tmp/FC30-64_K4.20_GCC9.1.1/x86_64-native-linuxapp-gcc/50baa6c00a15425e8dc9fbfb0b81b37e/dpdk/build-x86-default/install-root’: No such file or directory
dirname: missing operand
Try 'dirname --help' for more information.
## Building cmdline
gmake: *** /tmp/FC30-64_K4.20_GCC9.1.1/x86_64-native-linuxapp-gcc/50baa6c00a15425e8dc9fbfb0b81b37e/dpdk/build-x86-default/install-root/usr/local/share/dpdk/examples/cmdline: No such file or directory.  Stop.
## Building helloworld
gmake: *** /tmp/FC30-64_K4.20_GCC9.1.1/x86_64-native-linuxapp-gcc/50baa6c00a15425e8dc9fbfb0b81b37e/dpdk/build-x86-default/install-root/usr/local/share/dpdk/examples/helloworld: No such file or directory.  Stop.
## Building l2fwd
gmake: *** /tmp/FC30-64_K4.20_GCC9.1.1/x86_64-native-linuxapp-gcc/50baa6c00a15425e8dc9fbfb0b81b37e/dpdk/build-x86-default/install-root/usr/local/share/dpdk/examples/l2fwd: No such file or directory.  Stop.
## Building l3fwd
gmake: *** /tmp/FC30-64_K4.20_GCC9.1.1/x86_64-native-linuxapp-gcc/50baa6c00a15425e8dc9fbfb0b81b37e/dpdk/build-x86-default/install-root/usr/local/share/dpdk/examples/l3fwd: No such file or directory.  Stop.
## Building skeleton
gmake: *** /tmp/FC30-64_K4.20_GCC9.1.1/x86_64-native-linuxapp-gcc/50baa6c00a15425e8dc9fbfb0b81b37e/dpdk/build-x86-default/install-root/usr/local/share/dpdk/examples/skeleton: No such file or directory.  Stop.
## Building timer
gmake: *** /tmp/FC30-64_K4.20_GCC9.1.1/x86_64-native-linuxapp-gcc/50baa6c00a15425e8dc9fbfb0b81b37e/dpdk/build-x86-default/install-root/usr/local/share/dpdk/examples/timer: No such file or directory.  Stop.


*Meson Build Failed #4:
OS: UB1804-64
Target:build-gcc-static
Library execinfo found: NO
Compiler for C supports arguments -Wno-format-truncation -Wformat-truncation: YES
Message: Skipping example "bpf"
Message: Skipping example "ethtool"

examples/meson.build:89:4: ERROR: Problem encountered: Missing dependency "pmd_ioat" for example "ioat"

A full log can be found at /tmp/UB1804-64_K4.15.0_GCC7.3.0/x86_64-native-linuxapp-gcc/50baa6c00a15425e8dc9fbfb0b81b37e/dpdk/build-gcc-static/meson-logs/meson-log.txt
ninja -C build-gcc-static
ninja: Entering directory `build-gcc-static'
ninja: error: loading 'build.ninja': No such file or directory
--
Library execinfo found: NO
Compiler for C supports arguments -Wno-format-truncation -Wformat-truncation: YES
Message: Skipping example "bpf"
Message: Skipping example "ethtool"

examples/meson.build:89:4: ERROR: Problem encountered: Missing dependency "pmd_ioat" for example "ioat"

A full log can be found at /tmp/UB1804-64_K4.15.0_GCC7.3.0/x86_64-native-linuxapp-gcc/50baa6c00a15425e8dc9fbfb0b81b37e/dpdk/build-gcc-shared/meson-logs/meson-log.txt
ninja -C build-gcc-shared
ninja: Entering directory `build-gcc-shared'
ninja: error: loading 'build.ninja': No such file or directory
--
Library execinfo found: NO
Compiler for C supports arguments -Wno-format-truncation: NO
Message: Skipping example "bpf"
Message: Skipping example "ethtool"

examples/meson.build:89:4: ERROR: Problem encountered: Missing dependency "pmd_ioat" for example "ioat"

A full log can be found at /tmp/UB1804-64_K4.15.0_GCC7.3.0/x86_64-native-linuxapp-gcc/50baa6c00a15425e8dc9fbfb0b81b37e/dpdk/build-clang-static/meson-logs/meson-log.txt
ninja -C build-clang-static
ninja: Entering directory `build-clang-static'
ninja: error: loading 'build.ninja': No such file or directory
--
Library execinfo found: NO
Compiler for C supports arguments -Wno-format-truncation: NO
Message: Skipping example "bpf"
Message: Skipping example "ethtool"

examples/meson.build:89:4: ERROR: Problem encountered: Missing dependency "pmd_ioat" for example "ioat"

A full log can be found at /tmp/UB1804-64_K4.15.0_GCC7.3.0/x86_64-native-linuxapp-gcc/50baa6c00a15425e8dc9fbfb0b81b37e/dpdk/build-clang-shared/meson-logs/meson-log.txt
ninja -C build-clang-shared
ninja: Entering directory `build-clang-shared'
ninja: error: loading 'build.ninja': No such file or directory
--
Library execinfo found: NO
Compiler for C supports arguments -Wno-format-truncation -Wformat-truncation: YES
Message: Skipping example "bpf"
Message: Skipping example "ethtool"

examples/meson.build:89:4: ERROR: Problem encountered: Missing dependency "pmd_ioat" for example "ioat"

A full log can be found at /tmp/UB1804-64_K4.15.0_GCC7.3.0/x86_64-native-linuxapp-gcc/50baa6c00a15425e8dc9fbfb0b81b37e/dpdk/build-x86-default/meson-logs/meson-log.txt
ninja -C build-x86-default
ninja: Entering directory `build-x86-default'
ninja: error: loading 'build.ninja': No such file or directory
--
ninja: error: loading 'build.ninja': No such file or directory
find: ‘/tmp/UB1804-64_K4.15.0_GCC7.3.0/x86_64-native-linuxapp-gcc/50baa6c00a15425e8dc9fbfb0b81b37e/dpdk/build-x86-default/install-root’: No such file or directory
dirname: missing operand
Try 'dirname --help' for more information.
## Building cmdline
make: *** /tmp/UB1804-64_K4.15.0_GCC7.3.0/x86_64-native-linuxapp-gcc/50baa6c00a15425e8dc9fbfb0b81b37e/dpdk/build-x86-default/install-root/usr/local/share/dpdk/examples/cmdline: No such file or directory.  Stop.
## Building helloworld
make: *** /tmp/UB1804-64_K4.15.0_GCC7.3.0/x86_64-native-linuxapp-gcc/50baa6c00a15425e8dc9fbfb0b81b37e/dpdk/build-x86-default/install-root/usr/local/share/dpdk/examples/helloworld: No such file or directory.  Stop.
## Building l2fwd
make: *** /tmp/UB1804-64_K4.15.0_GCC7.3.0/x86_64-native-linuxapp-gcc/50baa6c00a15425e8dc9fbfb0b81b37e/dpdk/build-x86-default/install-root/usr/local/share/dpdk/examples/l2fwd: No such file or directory.  Stop.
## Building l3fwd
make: *** /tmp/UB1804-64_K4.15.0_GCC7.3.0/x86_64-native-linuxapp-gcc/50baa6c00a15425e8dc9fbfb0b81b37e/dpdk/build-x86-default/install-root/usr/local/share/dpdk/examples/l3fwd: No such file or directory.  Stop.
## Building skeleton
make: *** /tmp/UB1804-64_K4.15.0_GCC7.3.0/x86_64-native-linuxapp-gcc/50baa6c00a15425e8dc9fbfb0b81b37e/dpdk/build-x86-default/install-root/usr/local/share/dpdk/examples/skeleton: No such file or directory.  Stop.
## Building timer
make: *** /tmp/UB1804-64_K4.15.0_GCC7.3.0/x86_64-native-linuxapp-gcc/50baa6c00a15425e8dc9fbfb0b81b37e/dpdk/build-x86-default/install-root/usr/local/share/dpdk/examples/timer: No such file or directory.  Stop.


*Meson Build Failed #5:
OS: FreeBSD12-64
Target:build-gcc-static
Compiler for C supports arguments -Wno-format-truncation -Wformat-truncation: YES
Message: Skipping example "bpf"
Message: Skipping example "distributor"
Message: Skipping example "ethtool"

examples/meson.build:89:4: ERROR: Problem encountered: Missing dependency "pmd_ioat" for example "ioat"

A full log can be found at /tmp/FreeBSD12-64_K19.02_GCC7.3.0/x86_64-native-bsdapp-gcc/50baa6c00a15425e8dc9fbfb0b81b37e/dpdk/build-gcc-static/meson-logs/meson-log.txt
ninja -C build-gcc-static
ninja: Entering directory `build-gcc-static'
ninja: error: loading 'build.ninja': No such file or directory
--
Compiler for C supports arguments -Wno-format-truncation -Wformat-truncation: YES
Message: Skipping example "bpf"
Message: Skipping example "distributor"
Message: Skipping example "ethtool"

examples/meson.build:89:4: ERROR: Problem encountered: Missing dependency "pmd_ioat" for example "ioat"

A full log can be found at /tmp/FreeBSD12-64_K19.02_GCC7.3.0/x86_64-native-bsdapp-gcc/50baa6c00a15425e8dc9fbfb0b81b37e/dpdk/build-gcc-shared/meson-logs/meson-log.txt
ninja -C build-gcc-shared
ninja: Entering directory `build-gcc-shared'
ninja: error: loading 'build.ninja': No such file or directory
--
Compiler for C supports arguments -Wno-format-truncation: NO
Message: Skipping example "bpf"
Message: Skipping example "distributor"
Message: Skipping example "ethtool"

examples/meson.build:89:4: ERROR: Problem encountered: Missing dependency "pmd_ioat" for example "ioat"

A full log can be found at /tmp/FreeBSD12-64_K19.02_GCC7.3.0/x86_64-native-bsdapp-gcc/50baa6c00a15425e8dc9fbfb0b81b37e/dpdk/build-clang-static/meson-logs/meson-log.txt
ninja -C build-clang-static
ninja: Entering directory `build-clang-static'
ninja: error: loading 'build.ninja': No such file or directory
--
Compiler for C supports arguments -Wno-format-truncation: NO
Message: Skipping example "bpf"
Message: Skipping example "distributor"
Message: Skipping example "ethtool"

examples/meson.build:89:4: ERROR: Problem encountered: Missing dependency "pmd_ioat" for example "ioat"

A full log can be found at /tmp/FreeBSD12-64_K19.02_GCC7.3.0/x86_64-native-bsdapp-gcc/50baa6c00a15425e8dc9fbfb0b81b37e/dpdk/build-clang-shared/meson-logs/meson-log.txt
ninja -C build-clang-shared
ninja: Entering directory `build-clang-shared'
ninja: error: loading 'build.ninja': No such file or directory
--
Compiler for C supports arguments -Wno-format-truncation: NO
Message: Skipping example "bpf"
Message: Skipping example "distributor"
Message: Skipping example "ethtool"

examples/meson.build:89:4: ERROR: Problem encountered: Missing dependency "pmd_ioat" for example "ioat"

A full log can be found at /tmp/FreeBSD12-64_K19.02_GCC7.3.0/x86_64-native-bsdapp-gcc/50baa6c00a15425e8dc9fbfb0b81b37e/dpdk/build-x86-default/meson-logs/meson-log.txt
ninja -C build-x86-default
ninja: Entering directory `build-x86-default'
ninja: error: loading 'build.ninja': No such file or directory
ninja: Entering directory `build-x86-default'
ninja: error: loading 'build.ninja': No such file or directory
find: /tmp/FreeBSD12-64_K19.02_GCC7.3.0/x86_64-native-bsdapp-gcc/50baa6c00a15425e8dc9fbfb0b81b37e/dpdk/build-x86-default/install-root: No such file or directory
usage: dirname string [...]
## Building cmdline
gmake: *** /tmp/FreeBSD12-64_K19.02_GCC7.3.0/x86_64-native-bsdapp-gcc/50baa6c00a15425e8dc9fbfb0b81b37e/dpdk/build-x86-default/install-root/usr/local/share/dpdk/examples/cmdline: No such file or directory.  Stop.
## Building helloworld
gmake: *** /tmp/FreeBSD12-64_K19.02_GCC7.3.0/x86_64-native-bsdapp-gcc/50baa6c00a15425e8dc9fbfb0b81b37e/dpdk/build-x86-default/install-root/usr/local/share/dpdk/examples/helloworld: No such file or directory.  Stop.
## Building l2fwd
gmake: *** /tmp/FreeBSD12-64_K19.02_GCC7.3.0/x86_64-native-bsdapp-gcc/50baa6c00a15425e8dc9fbfb0b81b37e/dpdk/build-x86-default/install-root/usr/local/share/dpdk/examples/l2fwd: No such file or directory.  Stop.
## Building l3fwd
gmake: *** /tmp/FreeBSD12-64_K19.02_GCC7.3.0/x86_64-native-bsdapp-gcc/50baa6c00a15425e8dc9fbfb0b81b37e/dpdk/build-x86-default/install-root/usr/local/share/dpdk/examples/l3fwd: No such file or directory.  Stop.
## Building skeleton
gmake: *** /tmp/FreeBSD12-64_K19.02_GCC7.3.0/x86_64-native-bsdapp-gcc/50baa6c00a15425e8dc9fbfb0b81b37e/dpdk/build-x86-default/install-root/usr/local/share/dpdk/examples/skeleton: No such file or directory.  Stop.
## Building timer
gmake: *** /tmp/FreeBSD12-64_K19.02_GCC7.3.0/x86_64-native-bsdapp-gcc/50baa6c00a15425e8dc9fbfb0b81b37e/dpdk/build-x86-default/install-root/usr/local/share/dpdk/examples/timer: No such file or directory.  Stop.

DPDK STV team


More information about the test-report mailing list