[dpdk-test-report] |FAILURE| pw59260[v3, 12/13] test/bonding: check code of promiscuous mode switch

sys_stv at intel.com sys_stv at intel.com
Sat Sep 14 14:23:15 CEST 2019


Test-Label: Intel-compilation
Test-Status: FAILURE
http://dpdk.org/patch/59260

_Compilation issues_

Submitter: Andrew Rybchenko <arybchenko at solarflare.com>
Date: 2019-09-14 11:37:32
Reply_mail: 1568461055-16472-13-git-send-email-arybchenko at solarflare.com
DPDK git baseline: Repo:dpdk, CommitID: 73afc9df00d8ba4ff58d4a7a86691ca10520d462

Makefile build Summary: 22 Builds Done, 0 Successful, 22 Failures

Meson build Summary: 7 Builds Done, 2 Successful, 5 Failures

               +==============================================+===========+==========+
               |                   Makefile                   |   Meson   | Document |
+--------------+------+-------+------+------------+-----------+-----------+----------+
| os           | gcc  | clang | icc  | gcc+shared | gcc+debug | gcc/clang | pdf/html |
+--------------+------+-------+------+------------+-----------+-----------+----------+
| RHEL76-64    | FAIL |       |      |            |           |           |          |
| CENTOS76-64  | FAIL | FAIL  | FAIL | FAIL       | FAIL      |           |          |
| UB1804-64    | FAIL | FAIL  | FAIL |            |           | FAIL      | pass     |
| UB1604-32    | FAIL |       |      |            |           | FAIL      |          |
| UB1904-64    | FAIL |       |      |            |           |           |          |
| UB1604-64    | FAIL | FAIL  |      |            |           |           |          |
| FC30-64      | FAIL | FAIL  |      |            |           | FAIL      |          |
| WIN10-64     |      |       |      |            |           | pass      |          |
| FreeBSD12-64 | FAIL | FAIL  |      | FAIL       | FAIL      | FAIL      |          |
| RHEL80-64    | FAIL |       |      |            |           |           |          |
| SUSE15-64    | FAIL | FAIL  |      |            |           | FAIL      |          |
+--------------+------+-------+------+------------+-----------+-----------+----------+

Test environment and configuration as below:

** Makefile build **


OS: RHEL76-64
	Kernel Version: 3.10.0-957.el7.x86_64
	CPU info: Intel(R) Xeon(R) CPU E5-2699 v4 @ 2.20GHz
	GCC Version: gcc (GCC) 4.8.5 20150623 (Red Hat 4.8.5-36)
	Clang Version: NA
	x86_64-native-linuxapp-gcc


OS: CENTOS76-64
	Kernel Version: 3.10.0-957.10.1.el7.x86_64
	CPU info: Intel(R) Xeon(R) CPU E5-2699 v4 @ 2.20GHz
	GCC Version: gcc (GCC) 4.8.5 20150623 (Red Hat 4.8.5-36)
	Clang Version: 3.4.2 (tags/RELEASE_34/dot2-final)
	x86_64-native-linuxapp-clang
	x86_64-native-linuxapp-gcc
	x86_64-native-linuxapp-gcc+debug
	x86_64-native-linuxapp-icc
	x86_64-native-linuxapp-gcc+shared


OS: UB1804-64
	Kernel Version: 4.15.0-20-generic
	CPU info: Intel(R) Xeon(R) CPU E5-2699 v3 @ 2.30GHz
	GCC Version: gcc (Ubuntu 7.3.0-27ubuntu1~18.04) 7.3.0
	Clang Version: 6.0.0-1ubuntu2 (tags/RELEASE_600/final)
	x86_64-native-linuxapp-icc
	x86_64-native-linuxapp-clang
	x86_64-native-linuxapp-gcc


OS: UB1904-64
	Kernel Version: 5.0.0-13-generic
	CPU info: Intel(R) Xeon(R) CPU E5-2699 v3 @ 2.30GHz
	GCC Version: gcc (Ubuntu 8.3.0-6ubuntu1) 8.3.0
	Clang Version: 8.0.0-3 (tags/RELEASE_800/final)
	x86_64-native-linuxapp-gcc


OS: UB1604-32
	Kernel Version: 4.4.0-131-generic
	CPU info: Intel(R) Xeon(R) CPU E5-2699 v3 @ 2.30GHz
	GCC Version: gcc (Ubuntu 5.4.0-6ubuntu1~16.04.11) 5.4.0 20160609
	Clang Version: 3.8.0-2ubuntu4 (tags/RELEASE_380/final)
	i686-native-linuxapp-gcc


OS: UB1604-64
	Kernel Version: 4.4.0-47-generic
	CPU info: Intel(R) Xeon(R) CPU E5-2699 v3 @ 2.30GHz
	GCC Version: gcc (Ubuntu 5.4.0-6ubuntu1~16.04.10) 5.4.0 20160609
	Clang Version: 3.8.0-2ubuntu4 (tags/RELEASE_380/final)
	x86_64-native-linuxapp-clang
	x86_64-native-linuxapp-gcc


OS: FC30-64
	Kernel Version: 5.1.7-300.fc30.x86_64
	CPU info: Intel(R) Xeon(R) CPU E5-2699 v4 @ 2.20GHz
	GCC Version: gcc (GCC) 9.1.1 20190503 (Red Hat 9.1.1-1)
	Clang Version: 8.0.0 (Fedora 8.0.0-1.fc30)
	x86_64-native-linuxapp-gcc
	x86_64-native-linuxapp-clang


OS: FreeBSD12-64
	Kernel Version: 12.0-RC3
	CPU info: Intel(R) Xeon(R) CPU E5-2699 v4 @ 2.20GHz (2194.97-MHz K8-class CPU)
	GCC Version: gcc (FreeBSD Ports Collection) 7.3.0
	Clang Version: 6.0.1 (tags/RELEASE_601/final 335540) (based on LLVM 6.0.1)
	x86_64-native-bsdapp-clang
	x86_64-native-bsdapp-gcc
	x86_64-native-bsdapp-gcc+shared
	x86_64-native-bsdapp-gcc+debug


OS: RHEL80-64
	Kernel Version: 4.18.0-80.el8.x86_64
	CPU info: Intel(R) Xeon(R) CPU E5-2699 v4 @ 2.20GHz
	GCC Version: gcc (GCC) 8.2.1 20180905 (Red Hat 8.2.1-3)
	Clang Version: 6.0.1 (tags/RELEASE_601/final)
	x86_64-native-linuxapp-gcc


OS: SUSE15-64
	Kernel Version: 4.12.14-lp150.11-default
	CPU info: Intel(R) Xeon(R) CPU E5-2699 v4 @ 2.20GHz
	GCC Version: gcc (SUSE Linux) 7.3.1 20180323 [gcc-7-branch revision 258812]
	Clang Version: 5.0.1 (tags/RELEASE_501/final 312548)
	x86_64-native-linuxapp-clang
	x86_64-native-linuxapp-gcc


** Meson build **


OS: UB1804-64
	Kernel Version: 4.15.0-20-generic
	CPU info: Intel(R) Xeon(R) CPU E5-2699 v4 @ 2.20GHz
	GCC Version: gcc (Ubuntu 7.3.0-27ubuntu1~18.04) 7.3.0
	Clang Version: 6.0.0-1ubuntu2 (tags/RELEASE_600/final)
	x86_64-native-linuxapp-doc
	build-gcc-static
	build-gcc-shared
	build-clang-static
	build-clang-shared
	build-x86-default


OS: UB1604-32
	Kernel Version: 4.4.0-131-generic
	CPU info: Intel(R) Xeon(R) CPU E5-2699 v4 @ 2.20GHz
	GCC Version: gcc (Ubuntu 5.4.0-6ubuntu1~16.04.11) 5.4.0 20160609
	Clang Version: 3.8.0-2ubuntu4 (tags/RELEASE_380/final)
	build-gcc-static
	build-gcc-shared
	build-clang-static
	build-clang-shared
	build-x86-default


OS: FC30-64
	Kernel Version: 5.0.9-301.fc30.x86_64
	CPU info: Intel(R) Xeon(R) CPU E5-2699 v4 @ 2.20GHz
	GCC Version: gcc (GCC) 9.1.1 20190503 (Red Hat 9.1.1-1)
	Clang Version: 8.0.0 (Fedora 8.0.0-1.fc30)
	build-gcc-static
	build-gcc-shared
	build-clang-static
	build-clang-shared
	build-x86-default


OS: WIN10-64
	Kernel Version: N/A
	CPU info: N/A
	GCC Version: N/A
	Clang Version: Clang 8.0.0
	x86_64-windows-clang


OS: FreeBSD12-64
	Kernel Version: 12.0-RC3
	CPU info: Intel(R) Xeon(R) CPU E5-2699 v4 @ 2.20GHz (2194.99-MHz K8-class CPU)
	GCC Version: gcc (FreeBSD Ports Collection) 7.3.0
	Clang Version: 6.0.1 (tags/RELEASE_601/final 335540) (based on LLVM 6.0.1)
	build-gcc-static
	build-gcc-shared
	build-clang-static
	build-clang-shared
	build-x86-default


OS: SUSE15-64
	Kernel Version: 4.12.14-lp150.11-default
	CPU info: Intel(R) Xeon(R) CPU E5-2699 v4 @ 2.20GHz
	GCC Version: gcc (SUSE Linux) 7.3.1 20180323 [gcc-7-branch revision 258812]
	Clang Version: 5.0.1 (tags/RELEASE_501/final 312548)
	build-gcc-static
	build-gcc-shared
	build-clang-static
	build-clang-shared
	build-x86-default


*Make Build Failed #1:
OS: UB1604-64
Target: x86_64-native-linuxapp-clang
                       ^
  AR librte_compressdev.a
  INSTALL-LIB librte_compressdev.a
  CC cmdline_parse_ipaddr.o
4 errors generated.
/tmp/UB1604-64_K4.4.0_Clang3.8.0/x86_64-native-linuxapp-clang/0dcb834ba55044aa9bcfff151da6d575/dpdk/mk/internal/rte.compile-pre.mk:114: recipe for target 'rte_ethdev.o' failed
make[5]: *** [rte_ethdev.o] Error 1
make[5]: *** Waiting for unfinished jobs....
  CC rte_red.o
  CC cmdline_parse_num.o
  CC rte_approx.o
  AR librte_bbdev.a
--
  CC cmdline_parse_portlist.o
  AR librte_sched.a
  INSTALL-LIB librte_sched.a
  AR librte_cmdline.a
  INSTALL-LIB librte_cmdline.a
/tmp/UB1604-64_K4.4.0_Clang3.8.0/x86_64-native-linuxapp-clang/0dcb834ba55044aa9bcfff151da6d575/dpdk/mk/rte.subdir.mk:35: recipe for target 'librte_ethdev' failed
make[4]: *** [librte_ethdev] Error 2
/tmp/UB1604-64_K4.4.0_Clang3.8.0/x86_64-native-linuxapp-clang/0dcb834ba55044aa9bcfff151da6d575/dpdk/mk/rte.sdkbuild.mk:46: recipe for target 'lib' failed
make[3]: *** [lib] Error 2
/tmp/UB1604-64_K4.4.0_Clang3.8.0/x86_64-native-linuxapp-clang/0dcb834ba55044aa9bcfff151da6d575/dpdk/mk/rte.sdkroot.mk:98: recipe for target 'all' failed
make[2]: *** [all] Error 2
/tmp/UB1604-64_K4.4.0_Clang3.8.0/x86_64-native-linuxapp-clang/0dcb834ba55044aa9bcfff151da6d575/dpdk/mk/rte.sdkinstall.mk:60: recipe for target 'pre_install' failed
make[1]: *** [pre_install] Error 2
/tmp/UB1604-64_K4.4.0_Clang3.8.0/x86_64-native-linuxapp-clang/0dcb834ba55044aa9bcfff151da6d575/dpdk/mk/rte.sdkroot.mk:77: recipe for target 'install' failed
make: *** [install] Error 2


*Make Build Failed #2:
OS: UB1604-32
Target: i686-native-linuxapp-gcc
/tmp/UB1604-32_K4.4.0_GCC5.4.0/i686-native-linuxapp-gcc/0dcb834ba55044aa9bcfff151da6d575/dpdk/lib/librte_ethdev/rte_ethdev.c:1452:2: note: each undeclared identifier is reported only once for each function it appears in
/tmp/UB1604-32_K4.4.0_GCC5.4.0/i686-native-linuxapp-gcc/0dcb834ba55044aa9bcfff151da6d575/dpdk/lib/librte_ethdev/rte_ethdev.c: At top level:
cc1: error: unrecognized command line option ‘-Wno-address-of-packed-member’ [-Werror]
cc1: all warnings being treated as errors
  AR librte_sched.a
/tmp/UB1604-32_K4.4.0_GCC5.4.0/i686-native-linuxapp-gcc/0dcb834ba55044aa9bcfff151da6d575/dpdk/mk/internal/rte.compile-pre.mk:114: recipe for target 'rte_ethdev.o' failed
make[5]: *** [rte_ethdev.o] Error 1
make[5]: *** Waiting for unfinished jobs....
  INSTALL-LIB librte_sched.a
  AR librte_lpm.a
  INSTALL-LIB librte_lpm.a
  AR librte_member.a
  INSTALL-LIB librte_member.a
/tmp/UB1604-32_K4.4.0_GCC5.4.0/i686-native-linuxapp-gcc/0dcb834ba55044aa9bcfff151da6d575/dpdk/mk/rte.subdir.mk:35: recipe for target 'librte_ethdev' failed
make[4]: *** [librte_ethdev] Error 2
/tmp/UB1604-32_K4.4.0_GCC5.4.0/i686-native-linuxapp-gcc/0dcb834ba55044aa9bcfff151da6d575/dpdk/mk/rte.sdkbuild.mk:46: recipe for target 'lib' failed
make[3]: *** [lib] Error 2
/tmp/UB1604-32_K4.4.0_GCC5.4.0/i686-native-linuxapp-gcc/0dcb834ba55044aa9bcfff151da6d575/dpdk/mk/rte.sdkroot.mk:98: recipe for target 'all' failed
make[2]: *** [all] Error 2
/tmp/UB1604-32_K4.4.0_GCC5.4.0/i686-native-linuxapp-gcc/0dcb834ba55044aa9bcfff151da6d575/dpdk/mk/rte.sdkinstall.mk:60: recipe for target 'pre_install' failed
make[1]: *** [pre_install] Error 2
/tmp/UB1604-32_K4.4.0_GCC5.4.0/i686-native-linuxapp-gcc/0dcb834ba55044aa9bcfff151da6d575/dpdk/mk/rte.sdkroot.mk:77: recipe for target 'install' failed
make: *** [install] Error 2


*Make Build Failed #3:
OS: UB1804-64
Target: x86_64-native-linuxapp-icc
/tmp/UB1804-64_K4.15.0_ICC19.0.0/x86_64-native-linuxapp-icc/0dcb834ba55044aa9bcfff151da6d575/dpdk/lib/librte_ethdev/rte_ethdev.c(1452): error: identifier "ret" is undefined
  	ret = rte_eth_dev_config_restore(dev, &dev_info, port_id);
  	^

compilation aborted for /tmp/UB1804-64_K4.15.0_ICC19.0.0/x86_64-native-linuxapp-icc/0dcb834ba55044aa9bcfff151da6d575/dpdk/lib/librte_ethdev/rte_ethdev.c (code 2)
/tmp/UB1804-64_K4.15.0_ICC19.0.0/x86_64-native-linuxapp-icc/0dcb834ba55044aa9bcfff151da6d575/dpdk/mk/internal/rte.compile-pre.mk:114: recipe for target 'rte_ethdev.o' failed
make[5]: *** [rte_ethdev.o] Error 2
make[5]: *** Waiting for unfinished jobs....
  AR librte_sched.a
  INSTALL-LIB librte_sched.a
/tmp/UB1804-64_K4.15.0_ICC19.0.0/x86_64-native-linuxapp-icc/0dcb834ba55044aa9bcfff151da6d575/dpdk/mk/rte.subdir.mk:35: recipe for target 'librte_ethdev' failed
make[4]: *** [librte_ethdev] Error 2
/tmp/UB1804-64_K4.15.0_ICC19.0.0/x86_64-native-linuxapp-icc/0dcb834ba55044aa9bcfff151da6d575/dpdk/mk/rte.sdkbuild.mk:46: recipe for target 'lib' failed
make[3]: *** [lib] Error 2
/tmp/UB1804-64_K4.15.0_ICC19.0.0/x86_64-native-linuxapp-icc/0dcb834ba55044aa9bcfff151da6d575/dpdk/mk/rte.sdkroot.mk:98: recipe for target 'all' failed
make[2]: *** [all] Error 2
/tmp/UB1804-64_K4.15.0_ICC19.0.0/x86_64-native-linuxapp-icc/0dcb834ba55044aa9bcfff151da6d575/dpdk/mk/rte.sdkinstall.mk:60: recipe for target 'pre_install' failed
make[1]: *** [pre_install] Error 2
/tmp/UB1804-64_K4.15.0_ICC19.0.0/x86_64-native-linuxapp-icc/0dcb834ba55044aa9bcfff151da6d575/dpdk/mk/rte.sdkroot.mk:77: recipe for target 'install' failed
make: *** [install] Error 2


*Make Build Failed #4:
OS: UB1904-64
Target: x86_64-native-linuxapp-gcc
/tmp/UB1904-64_K4.18.0_GCC8.3.0/x86_64-native-linuxapp-gcc/0dcb834ba55044aa9bcfff151da6d575/dpdk/lib/librte_ethdev/rte_ethdev.c:1452:2: note: each undeclared identifier is reported only once for each function it appears in
  CC rte_mtr.o
/tmp/UB1904-64_K4.18.0_GCC8.3.0/x86_64-native-linuxapp-gcc/0dcb834ba55044aa9bcfff151da6d575/dpdk/lib/librte_ethdev/rte_ethdev.c: At top level:
cc1: error: unrecognized command line option ‘-Wno-address-of-packed-member’ [-Werror]
cc1: all warnings being treated as errors
make[5]: *** [/tmp/UB1904-64_K4.18.0_GCC8.3.0/x86_64-native-linuxapp-gcc/0dcb834ba55044aa9bcfff151da6d575/dpdk/mk/internal/rte.compile-pre.mk:116: rte_ethdev.o] Error 1
make[5]: *** Waiting for unfinished jobs....
  CC cmdline_rdline.o
  CC cmdline_vt100.o
  CC cmdline_socket.o
  AR librte_sched.a
  INSTALL-LIB librte_sched.a
  CC cmdline_parse_portlist.o
  AR librte_cmdline.a
  INSTALL-LIB librte_cmdline.a
make[4]: *** [/tmp/UB1904-64_K4.18.0_GCC8.3.0/x86_64-native-linuxapp-gcc/0dcb834ba55044aa9bcfff151da6d575/dpdk/mk/rte.subdir.mk:35: librte_ethdev] Error 2
make[3]: *** [/tmp/UB1904-64_K4.18.0_GCC8.3.0/x86_64-native-linuxapp-gcc/0dcb834ba55044aa9bcfff151da6d575/dpdk/mk/rte.sdkbuild.mk:48: lib] Error 2
make[2]: *** [/tmp/UB1904-64_K4.18.0_GCC8.3.0/x86_64-native-linuxapp-gcc/0dcb834ba55044aa9bcfff151da6d575/dpdk/mk/rte.sdkroot.mk:99: all] Error 2
make[1]: *** [/tmp/UB1904-64_K4.18.0_GCC8.3.0/x86_64-native-linuxapp-gcc/0dcb834ba55044aa9bcfff151da6d575/dpdk/mk/rte.sdkinstall.mk:61: pre_install] Error 2
make: *** [/tmp/UB1904-64_K4.18.0_GCC8.3.0/x86_64-native-linuxapp-gcc/0dcb834ba55044aa9bcfff151da6d575/dpdk/mk/rte.sdkroot.mk:77: install] Error 2


*Make Build Failed #5:
OS: UB1804-64
Target: x86_64-native-linuxapp-clang
                                               ^
/tmp/UB1804-64_K4.15.0_Clang6.0.0/x86_64-native-linuxapp-clang/0dcb834ba55044aa9bcfff151da6d575/dpdk/lib/librte_ethdev/rte_ethdev.c:1458:10: error: use of undeclared identifier 'ret'
                return ret;
                       ^
4 errors generated.
/tmp/UB1804-64_K4.15.0_Clang6.0.0/x86_64-native-linuxapp-clang/0dcb834ba55044aa9bcfff151da6d575/dpdk/mk/internal/rte.compile-pre.mk:114: recipe for target 'rte_ethdev.o' failed
make[5]: *** [rte_ethdev.o] Error 1
make[5]: *** Waiting for unfinished jobs....
  CC cmdline_parse_etheraddr.o
  AR librte_cryptodev.a
  INSTALL-LIB librte_cryptodev.a
  CC cmdline_parse_ipaddr.o
--
  INSTALL-LIB librte_cmdline.a
  AR librte_bbdev.a
  AR librte_compressdev.a
  INSTALL-LIB librte_bbdev.a
  INSTALL-LIB librte_compressdev.a
/tmp/UB1804-64_K4.15.0_Clang6.0.0/x86_64-native-linuxapp-clang/0dcb834ba55044aa9bcfff151da6d575/dpdk/mk/rte.subdir.mk:35: recipe for target 'librte_ethdev' failed
make[4]: *** [librte_ethdev] Error 2
/tmp/UB1804-64_K4.15.0_Clang6.0.0/x86_64-native-linuxapp-clang/0dcb834ba55044aa9bcfff151da6d575/dpdk/mk/rte.sdkbuild.mk:46: recipe for target 'lib' failed
make[3]: *** [lib] Error 2
/tmp/UB1804-64_K4.15.0_Clang6.0.0/x86_64-native-linuxapp-clang/0dcb834ba55044aa9bcfff151da6d575/dpdk/mk/rte.sdkroot.mk:98: recipe for target 'all' failed
make[2]: *** [all] Error 2
/tmp/UB1804-64_K4.15.0_Clang6.0.0/x86_64-native-linuxapp-clang/0dcb834ba55044aa9bcfff151da6d575/dpdk/mk/rte.sdkinstall.mk:60: recipe for target 'pre_install' failed
make[1]: *** [pre_install] Error 2
/tmp/UB1804-64_K4.15.0_Clang6.0.0/x86_64-native-linuxapp-clang/0dcb834ba55044aa9bcfff151da6d575/dpdk/mk/rte.sdkroot.mk:77: recipe for target 'install' failed
make: *** [install] Error 2


*Make Build Failed #6:
OS: FC30-64
Target: x86_64-native-linuxapp-gcc
 1452 |  ret = rte_eth_dev_config_restore(dev, &dev_info, port_id);
      |  ^~~
/tmp/FC30-64_K4.20_GCC9.1.1/x86_64-native-linuxapp-gcc/0dcb834ba55044aa9bcfff151da6d575/dpdk/lib/librte_ethdev/rte_ethdev.c:1452:2: note: each undeclared identifier is reported only once for each function it appears in
  CC cmdline_vt100.o
  CC cmdline_socket.o
make[5]: *** [/tmp/FC30-64_K4.20_GCC9.1.1/x86_64-native-linuxapp-gcc/0dcb834ba55044aa9bcfff151da6d575/dpdk/mk/internal/rte.compile-pre.mk:116: rte_ethdev.o] Error 1
make[5]: *** Waiting for unfinished jobs....
  CC cmdline_parse_portlist.o
  AR librte_sched.a
  INSTALL-LIB librte_sched.a
  AR librte_cmdline.a
  INSTALL-LIB librte_cmdline.a
  AR librte_compressdev.a
  INSTALL-LIB librte_compressdev.a
make[4]: *** [/tmp/FC30-64_K4.20_GCC9.1.1/x86_64-native-linuxapp-gcc/0dcb834ba55044aa9bcfff151da6d575/dpdk/mk/rte.subdir.mk:35: librte_ethdev] Error 2
make[3]: *** [/tmp/FC30-64_K4.20_GCC9.1.1/x86_64-native-linuxapp-gcc/0dcb834ba55044aa9bcfff151da6d575/dpdk/mk/rte.sdkbuild.mk:48: lib] Error 2
make[2]: *** [/tmp/FC30-64_K4.20_GCC9.1.1/x86_64-native-linuxapp-gcc/0dcb834ba55044aa9bcfff151da6d575/dpdk/mk/rte.sdkroot.mk:99: all] Error 2
make[1]: *** [/tmp/FC30-64_K4.20_GCC9.1.1/x86_64-native-linuxapp-gcc/0dcb834ba55044aa9bcfff151da6d575/dpdk/mk/rte.sdkinstall.mk:61: pre_install] Error 2
make: *** [/tmp/FC30-64_K4.20_GCC9.1.1/x86_64-native-linuxapp-gcc/0dcb834ba55044aa9bcfff151da6d575/dpdk/mk/rte.sdkroot.mk:77: install] Error 2


*Make Build Failed #7:
OS: SUSE15-64
Target: x86_64-native-linuxapp-clang
                                               ^
/tmp/SUSE15-64_K4.12.14_Clang5.0.1/x86_64-native-linuxapp-clang/0dcb834ba55044aa9bcfff151da6d575/dpdk/lib/librte_ethdev/rte_ethdev.c:1458:10: error: use of undeclared identifier 'ret'
                return ret;
                       ^
4 errors generated.
make[5]: *** [/tmp/SUSE15-64_K4.12.14_Clang5.0.1/x86_64-native-linuxapp-clang/0dcb834ba55044aa9bcfff151da6d575/dpdk/mk/internal/rte.compile-pre.mk:116: rte_ethdev.o] Error 1
make[5]: *** Waiting for unfinished jobs....
  CC cmdline_parse_string.o
  CC cmdline_rdline.o
  CC cmdline_vt100.o
  CC cmdline_socket.o
  CC cmdline_parse_portlist.o
  AR librte_cmdline.a
  INSTALL-LIB librte_cmdline.a
make[4]: *** [/tmp/SUSE15-64_K4.12.14_Clang5.0.1/x86_64-native-linuxapp-clang/0dcb834ba55044aa9bcfff151da6d575/dpdk/mk/rte.subdir.mk:35: librte_ethdev] Error 2
make[3]: *** [/tmp/SUSE15-64_K4.12.14_Clang5.0.1/x86_64-native-linuxapp-clang/0dcb834ba55044aa9bcfff151da6d575/dpdk/mk/rte.sdkbuild.mk:48: lib] Error 2
make[2]: *** [/tmp/SUSE15-64_K4.12.14_Clang5.0.1/x86_64-native-linuxapp-clang/0dcb834ba55044aa9bcfff151da6d575/dpdk/mk/rte.sdkroot.mk:99: all] Error 2
make[1]: *** [/tmp/SUSE15-64_K4.12.14_Clang5.0.1/x86_64-native-linuxapp-clang/0dcb834ba55044aa9bcfff151da6d575/dpdk/mk/rte.sdkinstall.mk:61: pre_install] Error 2
make: *** [/tmp/SUSE15-64_K4.12.14_Clang5.0.1/x86_64-native-linuxapp-clang/0dcb834ba55044aa9bcfff151da6d575/dpdk/mk/rte.sdkroot.mk:77: install] Error 2


*Make Build Failed #8:
OS: SUSE15-64
Target: x86_64-native-linuxapp-gcc
  ^~~
/tmp/SUSE15-64_K4.12.14_GCC7.3.1/x86_64-native-linuxapp-gcc/0dcb834ba55044aa9bcfff151da6d575/dpdk/lib/librte_ethdev/rte_ethdev.c:1452:2: note: each undeclared identifier is reported only once for each function it appears in
/tmp/SUSE15-64_K4.12.14_GCC7.3.1/x86_64-native-linuxapp-gcc/0dcb834ba55044aa9bcfff151da6d575/dpdk/lib/librte_ethdev/rte_ethdev.c: At top level:
cc1: error: unrecognized command line option ‘-Wno-address-of-packed-member’ [-Werror]
cc1: all warnings being treated as errors
make[5]: *** [/tmp/SUSE15-64_K4.12.14_GCC7.3.1/x86_64-native-linuxapp-gcc/0dcb834ba55044aa9bcfff151da6d575/dpdk/mk/internal/rte.compile-pre.mk:116: rte_ethdev.o] Error 1
make[5]: *** Waiting for unfinished jobs....
  CC cmdline_vt100.o
  CC cmdline_socket.o
  CC cmdline_parse_portlist.o
  AR librte_cmdline.a
  INSTALL-LIB librte_cmdline.a
  AR librte_sched.a
  INSTALL-LIB librte_sched.a
make[4]: *** [/tmp/SUSE15-64_K4.12.14_GCC7.3.1/x86_64-native-linuxapp-gcc/0dcb834ba55044aa9bcfff151da6d575/dpdk/mk/rte.subdir.mk:35: librte_ethdev] Error 2
make[3]: *** [/tmp/SUSE15-64_K4.12.14_GCC7.3.1/x86_64-native-linuxapp-gcc/0dcb834ba55044aa9bcfff151da6d575/dpdk/mk/rte.sdkbuild.mk:48: lib] Error 2
make[2]: *** [/tmp/SUSE15-64_K4.12.14_GCC7.3.1/x86_64-native-linuxapp-gcc/0dcb834ba55044aa9bcfff151da6d575/dpdk/mk/rte.sdkroot.mk:99: all] Error 2
make[1]: *** [/tmp/SUSE15-64_K4.12.14_GCC7.3.1/x86_64-native-linuxapp-gcc/0dcb834ba55044aa9bcfff151da6d575/dpdk/mk/rte.sdkinstall.mk:61: pre_install] Error 2
make: *** [/tmp/SUSE15-64_K4.12.14_GCC7.3.1/x86_64-native-linuxapp-gcc/0dcb834ba55044aa9bcfff151da6d575/dpdk/mk/rte.sdkroot.mk:77: install] Error 2


*Make Build Failed #9:
OS: RHEL76-64
Target: x86_64-native-linuxapp-gcc
  ^
/tmp/RHEL76-64_K3.10.0_GCC4.8.5/x86_64-native-linuxapp-gcc/0dcb834ba55044aa9bcfff151da6d575/dpdk/lib/librte_ethdev/rte_ethdev.c:1452:2: note: each undeclared identifier is reported only once for each function it appears in
/tmp/RHEL76-64_K3.10.0_GCC4.8.5/x86_64-native-linuxapp-gcc/0dcb834ba55044aa9bcfff151da6d575/dpdk/lib/librte_ethdev/rte_ethdev.c: At top level:
cc1: error: unrecognized command line option "-Wno-address-of-packed-member" [-Werror]
cc1: all warnings being treated as errors
make[5]: *** [rte_ethdev.o] Error 1
make[5]: *** Waiting for unfinished jobs....
  CC cmdline_parse.o
  CC cmdline_cirbuf.o
  CC cmdline_parse_etheraddr.o
  AR librte_sched.a
--
  INSTALL-LIB librte_cmdline.a
  AR librte_compressdev.a
  INSTALL-LIB librte_compressdev.a
  AR librte_bbdev.a
  INSTALL-LIB librte_bbdev.a
make[4]: *** [librte_ethdev] Error 2
make[3]: *** [lib] Error 2
make[2]: *** [all] Error 2
make[1]: *** [pre_install] Error 2
make: *** [install] Error 2


*Make Build Failed #10:
OS: FC30-64
Target: x86_64-native-linuxapp-clang
                                               ^
/tmp/FC30-64_K4.20_Clang8.0.0/x86_64-native-linuxapp-clang/0dcb834ba55044aa9bcfff151da6d575/dpdk/lib/librte_ethdev/rte_ethdev.c:1458:10: error: use of undeclared identifier 'ret'
                return ret;
                       ^
4 errors generated.
make[5]: *** [/tmp/FC30-64_K4.20_Clang8.0.0/x86_64-native-linuxapp-clang/0dcb834ba55044aa9bcfff151da6d575/dpdk/mk/internal/rte.compile-pre.mk:116: rte_ethdev.o] Error 1
make[5]: *** Waiting for unfinished jobs....
  CC cmdline_parse_num.o
  CC cmdline_parse_string.o
  CC cmdline_rdline.o
  CC cmdline_vt100.o
--
  CC cmdline_parse_portlist.o
  AR librte_sched.a
  INSTALL-LIB librte_sched.a
  AR librte_cmdline.a
  INSTALL-LIB librte_cmdline.a
make[4]: *** [/tmp/FC30-64_K4.20_Clang8.0.0/x86_64-native-linuxapp-clang/0dcb834ba55044aa9bcfff151da6d575/dpdk/mk/rte.subdir.mk:35: librte_ethdev] Error 2
make[3]: *** [/tmp/FC30-64_K4.20_Clang8.0.0/x86_64-native-linuxapp-clang/0dcb834ba55044aa9bcfff151da6d575/dpdk/mk/rte.sdkbuild.mk:48: lib] Error 2
make[2]: *** [/tmp/FC30-64_K4.20_Clang8.0.0/x86_64-native-linuxapp-clang/0dcb834ba55044aa9bcfff151da6d575/dpdk/mk/rte.sdkroot.mk:99: all] Error 2
make[1]: *** [/tmp/FC30-64_K4.20_Clang8.0.0/x86_64-native-linuxapp-clang/0dcb834ba55044aa9bcfff151da6d575/dpdk/mk/rte.sdkinstall.mk:61: pre_install] Error 2
make: *** [/tmp/FC30-64_K4.20_Clang8.0.0/x86_64-native-linuxapp-clang/0dcb834ba55044aa9bcfff151da6d575/dpdk/mk/rte.sdkroot.mk:77: install] Error 2


*Make Build Failed #11:
OS: RHEL80-64
Target: x86_64-native-linuxapp-gcc
  ^~~
/tmp/RHEL80-64_K3.10.0_GCC8.2.1/x86_64-native-linuxapp-gcc/0dcb834ba55044aa9bcfff151da6d575/dpdk/lib/librte_ethdev/rte_ethdev.c:1452:2: note: each undeclared identifier is reported only once for each function it appears in
/tmp/RHEL80-64_K3.10.0_GCC8.2.1/x86_64-native-linuxapp-gcc/0dcb834ba55044aa9bcfff151da6d575/dpdk/lib/librte_ethdev/rte_ethdev.c: At top level:
cc1: error: unrecognized command line option ‘-Wno-address-of-packed-member’ [-Werror]
cc1: all warnings being treated as errors
make[5]: *** [/tmp/RHEL80-64_K3.10.0_GCC8.2.1/x86_64-native-linuxapp-gcc/0dcb834ba55044aa9bcfff151da6d575/dpdk/mk/internal/rte.compile-pre.mk:116: rte_ethdev.o] Error 1
make[5]: *** Waiting for unfinished jobs....
  CC cmdline_parse_num.o
  CC cmdline_parse_string.o
  CC cmdline_rdline.o
  CC cmdline_vt100.o
--
  CC cmdline_parse_portlist.o
  AR librte_sched.a
  INSTALL-LIB librte_sched.a
  AR librte_cmdline.a
  INSTALL-LIB librte_cmdline.a
make[4]: *** [/tmp/RHEL80-64_K3.10.0_GCC8.2.1/x86_64-native-linuxapp-gcc/0dcb834ba55044aa9bcfff151da6d575/dpdk/mk/rte.subdir.mk:35: librte_ethdev] Error 2
make[3]: *** [/tmp/RHEL80-64_K3.10.0_GCC8.2.1/x86_64-native-linuxapp-gcc/0dcb834ba55044aa9bcfff151da6d575/dpdk/mk/rte.sdkbuild.mk:48: lib] Error 2
make[2]: *** [/tmp/RHEL80-64_K3.10.0_GCC8.2.1/x86_64-native-linuxapp-gcc/0dcb834ba55044aa9bcfff151da6d575/dpdk/mk/rte.sdkroot.mk:99: all] Error 2
make[1]: *** [/tmp/RHEL80-64_K3.10.0_GCC8.2.1/x86_64-native-linuxapp-gcc/0dcb834ba55044aa9bcfff151da6d575/dpdk/mk/rte.sdkinstall.mk:61: pre_install] Error 2
make: *** [/tmp/RHEL80-64_K3.10.0_GCC8.2.1/x86_64-native-linuxapp-gcc/0dcb834ba55044aa9bcfff151da6d575/dpdk/mk/rte.sdkroot.mk:77: install] Error 2


*Make Build Failed #12:
OS: UB1604-64
Target: x86_64-native-linuxapp-gcc
/tmp/UB1604-64_K4.4.0_GCC5.4.0/x86_64-native-linuxapp-gcc/0dcb834ba55044aa9bcfff151da6d575/dpdk/lib/librte_ethdev/rte_ethdev.c:1452:2: note: each undeclared identifier is reported only once for each function it appears in
  CC rte_sched.o
/tmp/UB1604-64_K4.4.0_GCC5.4.0/x86_64-native-linuxapp-gcc/0dcb834ba55044aa9bcfff151da6d575/dpdk/lib/librte_ethdev/rte_ethdev.c: At top level:
cc1: error: unrecognized command line option ‘-Wno-address-of-packed-member’ [-Werror]
cc1: all warnings being treated as errors
/tmp/UB1604-64_K4.4.0_GCC5.4.0/x86_64-native-linuxapp-gcc/0dcb834ba55044aa9bcfff151da6d575/dpdk/mk/internal/rte.compile-pre.mk:114: recipe for target 'rte_ethdev.o' failed
make[5]: *** [rte_ethdev.o] Error 1
make[5]: *** Waiting for unfinished jobs....
  CC cmdline_parse_etheraddr.o
  CC cmdline_parse_ipaddr.o
  CC rte_red.o
  AR librte_lpm.a
--
  INSTALL-LIB librte_member.a
  AR librte_cmdline.a
  INSTALL-LIB librte_cmdline.a
  AR librte_sched.a
  INSTALL-LIB librte_sched.a
/tmp/UB1604-64_K4.4.0_GCC5.4.0/x86_64-native-linuxapp-gcc/0dcb834ba55044aa9bcfff151da6d575/dpdk/mk/rte.subdir.mk:35: recipe for target 'librte_ethdev' failed
make[4]: *** [librte_ethdev] Error 2
/tmp/UB1604-64_K4.4.0_GCC5.4.0/x86_64-native-linuxapp-gcc/0dcb834ba55044aa9bcfff151da6d575/dpdk/mk/rte.sdkbuild.mk:46: recipe for target 'lib' failed
make[3]: *** [lib] Error 2
/tmp/UB1604-64_K4.4.0_GCC5.4.0/x86_64-native-linuxapp-gcc/0dcb834ba55044aa9bcfff151da6d575/dpdk/mk/rte.sdkroot.mk:98: recipe for target 'all' failed
make[2]: *** [all] Error 2
/tmp/UB1604-64_K4.4.0_GCC5.4.0/x86_64-native-linuxapp-gcc/0dcb834ba55044aa9bcfff151da6d575/dpdk/mk/rte.sdkinstall.mk:60: recipe for target 'pre_install' failed
make[1]: *** [pre_install] Error 2
/tmp/UB1604-64_K4.4.0_GCC5.4.0/x86_64-native-linuxapp-gcc/0dcb834ba55044aa9bcfff151da6d575/dpdk/mk/rte.sdkroot.mk:77: recipe for target 'install' failed
make: *** [install] Error 2


*Make Build Failed #13:
OS: UB1804-64
Target: x86_64-native-linuxapp-gcc
/tmp/UB1804-64_K4.15.0_GCC7.3.0/x86_64-native-linuxapp-gcc/0dcb834ba55044aa9bcfff151da6d575/dpdk/lib/librte_ethdev/rte_ethdev.c:1452:2: note: each undeclared identifier is reported only once for each function it appears in
  CC cmdline_parse_ipaddr.o
/tmp/UB1804-64_K4.15.0_GCC7.3.0/x86_64-native-linuxapp-gcc/0dcb834ba55044aa9bcfff151da6d575/dpdk/lib/librte_ethdev/rte_ethdev.c: At top level:
cc1: error: unrecognized command line option ‘-Wno-address-of-packed-member’ [-Werror]
cc1: all warnings being treated as errors
/tmp/UB1804-64_K4.15.0_GCC7.3.0/x86_64-native-linuxapp-gcc/0dcb834ba55044aa9bcfff151da6d575/dpdk/mk/internal/rte.compile-pre.mk:114: recipe for target 'rte_ethdev.o' failed
make[5]: *** [rte_ethdev.o] Error 1
make[5]: *** Waiting for unfinished jobs....
  CC cmdline_parse_num.o
  CC rte_approx.o
  CC cmdline_parse_string.o
  CC cmdline_rdline.o
--
  INSTALL-LIB librte_efd.a
  AR librte_member.a
  INSTALL-LIB librte_member.a
  AR librte_cmdline.a
  INSTALL-LIB librte_cmdline.a
/tmp/UB1804-64_K4.15.0_GCC7.3.0/x86_64-native-linuxapp-gcc/0dcb834ba55044aa9bcfff151da6d575/dpdk/mk/rte.subdir.mk:35: recipe for target 'librte_ethdev' failed
make[4]: *** [librte_ethdev] Error 2
make[4]: *** Waiting for unfinished jobs....
  AR librte_sched.a
  INSTALL-LIB librte_sched.a
/tmp/UB1804-64_K4.15.0_GCC7.3.0/x86_64-native-linuxapp-gcc/0dcb834ba55044aa9bcfff151da6d575/dpdk/mk/rte.sdkbuild.mk:46: recipe for target 'lib' failed
make[3]: *** [lib] Error 2
/tmp/UB1804-64_K4.15.0_GCC7.3.0/x86_64-native-linuxapp-gcc/0dcb834ba55044aa9bcfff151da6d575/dpdk/mk/rte.sdkroot.mk:98: recipe for target 'all' failed
make[2]: *** [all] Error 2
/tmp/UB1804-64_K4.15.0_GCC7.3.0/x86_64-native-linuxapp-gcc/0dcb834ba55044aa9bcfff151da6d575/dpdk/mk/rte.sdkinstall.mk:60: recipe for target 'pre_install' failed
make[1]: *** [pre_install] Error 2
/tmp/UB1804-64_K4.15.0_GCC7.3.0/x86_64-native-linuxapp-gcc/0dcb834ba55044aa9bcfff151da6d575/dpdk/mk/rte.sdkroot.mk:77: recipe for target 'install' failed
make: *** [install] Error 2


*Make Build Failed #14:
OS: FreeBSD12-64
Target: x86_64-native-bsdapp-clang
  CC cmdline_parse_num.o
use of undeclared identifier 'ret'
                return ret;
                       ^
4 errors generated.
gmake[5]: *** [/tmp/FreeBSD12-64_K19.02_Clang6.0.1/x86_64-native-bsdapp-clang/0dcb834ba55044aa9bcfff151da6d575/dpdk/mk/internal/rte.compile-pre.mk:116: rte_ethdev.o] Error 1
gmake[5]: *** Waiting for unfinished jobs....
  CC cmdline_rdline.o
  CC cmdline_parse_string.o
  CC cmdline_vt100.o
  CC cmdline_socket.o
--
  INSTALL-LIB librte_bbdev.a
  AR librte_compressdev.a
  INSTALL-LIB librte_compressdev.a
  AR librte_cmdline.a
  INSTALL-LIB librte_cmdline.a
gmake[4]: *** [/tmp/FreeBSD12-64_K19.02_Clang6.0.1/x86_64-native-bsdapp-clang/0dcb834ba55044aa9bcfff151da6d575/dpdk/mk/rte.subdir.mk:35: librte_ethdev] Error 2
gmake[3]: *** [/tmp/FreeBSD12-64_K19.02_Clang6.0.1/x86_64-native-bsdapp-clang/0dcb834ba55044aa9bcfff151da6d575/dpdk/mk/rte.sdkbuild.mk:48: lib] Error 2
gmake[2]: *** [/tmp/FreeBSD12-64_K19.02_Clang6.0.1/x86_64-native-bsdapp-clang/0dcb834ba55044aa9bcfff151da6d575/dpdk/mk/rte.sdkroot.mk:99: all] Error 2
gmake[1]: *** [/tmp/FreeBSD12-64_K19.02_Clang6.0.1/x86_64-native-bsdapp-clang/0dcb834ba55044aa9bcfff151da6d575/dpdk/mk/rte.sdkinstall.mk:61: pre_install] Error 2
gmake: *** [/tmp/FreeBSD12-64_K19.02_Clang6.0.1/x86_64-native-bsdapp-clang/0dcb834ba55044aa9bcfff151da6d575/dpdk/mk/rte.sdkroot.mk:77: install] Error 2


*Make Build Failed #15:
OS: CENTOS76-64
Target: x86_64-native-linuxapp-clang
                                                           ^
/tmp/CENTOS76-64_K3.10.0_Clang3.4.2/x86_64-native-linuxapp-clang/0dcb834ba55044aa9bcfff151da6d575/dpdk/lib/librte_ethdev/rte_ethdev.c:1458:10: error: use of undeclared identifier 'ret'
                return ret;
                       ^
4 errors generated.
make[5]: *** [rte_ethdev.o] Error 1
make[5]: *** Waiting for unfinished jobs....
  AR librte_bbdev.a
  CC cmdline_vt100.o
  CC cmdline_socket.o
  INSTALL-LIB librte_bbdev.a
  AR librte_sched.a
  CC cmdline_parse_portlist.o
  INSTALL-LIB librte_sched.a
  AR librte_cmdline.a
  INSTALL-LIB librte_cmdline.a
make[4]: *** [librte_ethdev] Error 2
make[3]: *** [lib] Error 2
make[2]: *** [all] Error 2
make[1]: *** [pre_install] Error 2
make: *** [install] Error 2


*Make Build Failed #16:
OS: CENTOS76-64
Target: x86_64-native-linuxapp-gcc
/tmp/CENTOS76-64_K3.10.0_GCC4.8.5/x86_64-native-linuxapp-gcc/0dcb834ba55044aa9bcfff151da6d575/dpdk/lib/librte_ethdev/rte_ethdev.c:1452:2: note: each undeclared identifier is reported only once for each function it appears in
  CC cmdline_vt100.o
/tmp/CENTOS76-64_K3.10.0_GCC4.8.5/x86_64-native-linuxapp-gcc/0dcb834ba55044aa9bcfff151da6d575/dpdk/lib/librte_ethdev/rte_ethdev.c: At top level:
cc1: error: unrecognized command line option "-Wno-address-of-packed-member" [-Werror]
cc1: all warnings being treated as errors
make[5]: *** [rte_ethdev.o] Error 1
make[5]: *** Waiting for unfinished jobs....
  CC cmdline_socket.o
  CC cmdline_parse_portlist.o
  AR librte_cmdline.a
  INSTALL-LIB librte_cmdline.a
  AR librte_sched.a
  INSTALL-LIB librte_sched.a
make[4]: *** [librte_ethdev] Error 2
make[3]: *** [lib] Error 2
make[2]: *** [all] Error 2
make[1]: *** [pre_install] Error 2
make: *** [install] Error 2


*Make Build Failed #17:
OS: CENTOS76-64
Target: x86_64-native-linuxapp-gcc+debug
  SYMLINK-FILE include/cmdline_vt100.h
  SYMLINK-FILE include/cmdline_socket.h
/tmp/CENTOS76-64_K3.10.0_GCC4.8.5/x86_64-native-linuxapp-gcc+debug/0dcb834ba55044aa9bcfff151da6d575/dpdk/lib/librte_ethdev/rte_ethdev.c: At top level:
cc1: error: unrecognized command line option "-Wno-address-of-packed-member" [-Werror]
cc1: all warnings being treated as errors
make[5]: *** [rte_ethdev.o] Error 1
make[5]: *** Waiting for unfinished jobs....
  SYMLINK-FILE include/cmdline_cirbuf.h
  SYMLINK-FILE include/cmdline_parse_portlist.h
  CC cmdline.o
  CC cmdline_cirbuf.o
--
  CC cmdline_parse_portlist.o
  AR librte_cmdline.a
  INSTALL-LIB librte_cmdline.a
  AR librte_sched.a
  INSTALL-LIB librte_sched.a
make[4]: *** [librte_ethdev] Error 2
make[3]: *** [lib] Error 2
make[2]: *** [all] Error 2
make[1]: *** [pre_install] Error 2
make: *** [install] Error 2


*Make Build Failed #18:
OS: CENTOS76-64
Target: x86_64-native-linuxapp-icc
  	ret = rte_eth_dev_config_restore(dev, &dev_info, port_id);
  	^

  CC ethdev_profile.o
compilation aborted for /tmp/CENTOS76-64_K3.10.0_ICC19.0.0/x86_64-native-linuxapp-icc/0dcb834ba55044aa9bcfff151da6d575/dpdk/lib/librte_ethdev/rte_ethdev.c (code 2)
make[5]: *** [rte_ethdev.o] Error 2
make[5]: *** Waiting for unfinished jobs....
  CC cmdline_parse.o
  CC cmdline_parse_etheraddr.o
  CC cmdline_parse_ipaddr.o
  CC cmdline_parse_num.o
--
  AR librte_sched.a
  INSTALL-LIB librte_sched.a
  CC cmdline_parse_portlist.o
  AR librte_cmdline.a
  INSTALL-LIB librte_cmdline.a
make[4]: *** [librte_ethdev] Error 2
make[3]: *** [lib] Error 2
make[2]: *** [all] Error 2
make[1]: *** [pre_install] Error 2
make: *** [install] Error 2


*Make Build Failed #19:
OS: FreeBSD12-64
Target: x86_64-native-bsdapp-gcc
/tmp/FreeBSD12-64_K19.02_GCC7.3.0/x86_64-native-bsdapp-gcc/0dcb834ba55044aa9bcfff151da6d575/dpdk/lib/librte_ethdev/rte_ethdev.c:1452:2: note: each undeclared identifier is reported only once for each function it appears in
  CC rte_flow.o
/tmp/FreeBSD12-64_K19.02_GCC7.3.0/x86_64-native-bsdapp-gcc/0dcb834ba55044aa9bcfff151da6d575/dpdk/lib/librte_ethdev/rte_ethdev.c: At top level:
cc1: error: unrecognized command line option '-Wno-address-of-packed-member' [-Werror]
cc1: all warnings being treated as errors
gmake[5]: *** [/tmp/FreeBSD12-64_K19.02_GCC7.3.0/x86_64-native-bsdapp-gcc/0dcb834ba55044aa9bcfff151da6d575/dpdk/mk/internal/rte.compile-pre.mk:116: rte_ethdev.o] Error 1
gmake[5]: *** Waiting for unfinished jobs....
  CC cmdline_parse_etheraddr.o
  CC cmdline_parse_ipaddr.o
  CC cmdline_parse_num.o
  CC cmdline_parse_string.o
--
  INSTALL-LIB librte_compressdev.a
  AR librte_cmdline.a
  INSTALL-LIB librte_cmdline.a
  AR librte_bbdev.a
  INSTALL-LIB librte_bbdev.a
gmake[4]: *** [/tmp/FreeBSD12-64_K19.02_GCC7.3.0/x86_64-native-bsdapp-gcc/0dcb834ba55044aa9bcfff151da6d575/dpdk/mk/rte.subdir.mk:35: librte_ethdev] Error 2
gmake[4]: *** Waiting for unfinished jobs....
  AR librte_sched.a
  INSTALL-LIB librte_sched.a
gmake[3]: *** [/tmp/FreeBSD12-64_K19.02_GCC7.3.0/x86_64-native-bsdapp-gcc/0dcb834ba55044aa9bcfff151da6d575/dpdk/mk/rte.sdkbuild.mk:48: lib] Error 2
gmake[2]: *** [/tmp/FreeBSD12-64_K19.02_GCC7.3.0/x86_64-native-bsdapp-gcc/0dcb834ba55044aa9bcfff151da6d575/dpdk/mk/rte.sdkroot.mk:99: all] Error 2
gmake[1]: *** [/tmp/FreeBSD12-64_K19.02_GCC7.3.0/x86_64-native-bsdapp-gcc/0dcb834ba55044aa9bcfff151da6d575/dpdk/mk/rte.sdkinstall.mk:61: pre_install] Error 2
gmake: *** [/tmp/FreeBSD12-64_K19.02_GCC7.3.0/x86_64-native-bsdapp-gcc/0dcb834ba55044aa9bcfff151da6d575/dpdk/mk/rte.sdkroot.mk:77: install] Error 2


*Make Build Failed #20:
OS: FreeBSD12-64
Target: x86_64-native-bsdapp-gcc+shared
  ^~~
/tmp/FreeBSD12-64_K19.02_GCC7.3.0/x86_64-native-bsdapp-gcc+shared/0dcb834ba55044aa9bcfff151da6d575/dpdk/lib/librte_ethdev/rte_ethdev.c:1452:2: note: each undeclared identifier is reported only once for each function it appears in
/tmp/FreeBSD12-64_K19.02_GCC7.3.0/x86_64-native-bsdapp-gcc+shared/0dcb834ba55044aa9bcfff151da6d575/dpdk/lib/librte_ethdev/rte_ethdev.c: At top level:
cc1: error: unrecognized command line option '-Wno-address-of-packed-member' [-Werror]
cc1: all warnings being treated as errors
gmake[5]: *** [/tmp/FreeBSD12-64_K19.02_GCC7.3.0/x86_64-native-bsdapp-gcc+shared/0dcb834ba55044aa9bcfff151da6d575/dpdk/mk/internal/rte.compile-pre.mk:116: rte_ethdev.o] Error 1
gmake[5]: *** Waiting for unfinished jobs....
  CC cmdline_socket.o
  CC cmdline_parse_portlist.o
  LD librte_cmdline.so.2.1
  INSTALL-LIB librte_cmdline.so.2.1
  LD librte_sched.so.3.1
  INSTALL-LIB librte_sched.so.3.1
gmake[4]: *** [/tmp/FreeBSD12-64_K19.02_GCC7.3.0/x86_64-native-bsdapp-gcc+shared/0dcb834ba55044aa9bcfff151da6d575/dpdk/mk/rte.subdir.mk:35: librte_ethdev] Error 2
gmake[3]: *** [/tmp/FreeBSD12-64_K19.02_GCC7.3.0/x86_64-native-bsdapp-gcc+shared/0dcb834ba55044aa9bcfff151da6d575/dpdk/mk/rte.sdkbuild.mk:48: lib] Error 2
gmake[2]: *** [/tmp/FreeBSD12-64_K19.02_GCC7.3.0/x86_64-native-bsdapp-gcc+shared/0dcb834ba55044aa9bcfff151da6d575/dpdk/mk/rte.sdkroot.mk:99: all] Error 2
gmake[1]: *** [/tmp/FreeBSD12-64_K19.02_GCC7.3.0/x86_64-native-bsdapp-gcc+shared/0dcb834ba55044aa9bcfff151da6d575/dpdk/mk/rte.sdkinstall.mk:61: pre_install] Error 2
gmake: *** [/tmp/FreeBSD12-64_K19.02_GCC7.3.0/x86_64-native-bsdapp-gcc+shared/0dcb834ba55044aa9bcfff151da6d575/dpdk/mk/rte.sdkroot.mk:77: install] Error 2


*Make Build Failed #21:
OS: FreeBSD12-64
Target: x86_64-native-bsdapp-gcc+debug
/tmp/FreeBSD12-64_K19.02_GCC7.3.0/x86_64-native-bsdapp-gcc+debug/0dcb834ba55044aa9bcfff151da6d575/dpdk/lib/librte_ethdev/rte_ethdev.c: At top level:
cc1: error: unrecognized command line option '-Wno-address-of-packed-member' [-Werror]
cc1: all warnings being treated as errors
  AR librte_lpm.a
  INSTALL-LIB librte_lpm.a
gmake[5]: *** [/tmp/FreeBSD12-64_K19.02_GCC7.3.0/x86_64-native-bsdapp-gcc+debug/0dcb834ba55044aa9bcfff151da6d575/dpdk/mk/internal/rte.compile-pre.mk:116: rte_ethdev.o] Error 1
gmake[5]: *** Waiting for unfinished jobs....
  CC rte_red.o
  CC rte_approx.o
  CC rte_mtr.o
  CC cmdline_parse_string.o
--
  INSTALL-LIB librte_compressdev.a
  AR librte_cmdline.a
  INSTALL-LIB librte_cmdline.a
  AR librte_sched.a
  INSTALL-LIB librte_sched.a
gmake[4]: *** [/tmp/FreeBSD12-64_K19.02_GCC7.3.0/x86_64-native-bsdapp-gcc+debug/0dcb834ba55044aa9bcfff151da6d575/dpdk/mk/rte.subdir.mk:35: librte_ethdev] Error 2
gmake[3]: *** [/tmp/FreeBSD12-64_K19.02_GCC7.3.0/x86_64-native-bsdapp-gcc+debug/0dcb834ba55044aa9bcfff151da6d575/dpdk/mk/rte.sdkbuild.mk:48: lib] Error 2
gmake[2]: *** [/tmp/FreeBSD12-64_K19.02_GCC7.3.0/x86_64-native-bsdapp-gcc+debug/0dcb834ba55044aa9bcfff151da6d575/dpdk/mk/rte.sdkroot.mk:99: all] Error 2
gmake[1]: *** [/tmp/FreeBSD12-64_K19.02_GCC7.3.0/x86_64-native-bsdapp-gcc+debug/0dcb834ba55044aa9bcfff151da6d575/dpdk/mk/rte.sdkinstall.mk:61: pre_install] Error 2
gmake: *** [/tmp/FreeBSD12-64_K19.02_GCC7.3.0/x86_64-native-bsdapp-gcc+debug/0dcb834ba55044aa9bcfff151da6d575/dpdk/mk/rte.sdkroot.mk:77: install] Error 2


*Make Build Failed #22:
OS: CENTOS76-64
Target: x86_64-native-linuxapp-gcc+shared
/tmp/CENTOS76-64_K3.10.0_GCC4.8.5/x86_64-native-linuxapp-gcc+shared/0dcb834ba55044aa9bcfff151da6d575/dpdk/lib/librte_ethdev/rte_ethdev.c:1452:2: note: each undeclared identifier is reported only once for each function it appears in
  CC cmdline_parse_etheraddr.o
/tmp/CENTOS76-64_K3.10.0_GCC4.8.5/x86_64-native-linuxapp-gcc+shared/0dcb834ba55044aa9bcfff151da6d575/dpdk/lib/librte_ethdev/rte_ethdev.c: At top level:
cc1: error: unrecognized command line option "-Wno-address-of-packed-member" [-Werror]
cc1: all warnings being treated as errors
make[5]: *** [rte_ethdev.o] Error 1
make[5]: *** Waiting for unfinished jobs....
  CC cmdline_parse_ipaddr.o
  CC cmdline_parse_num.o
  CC cmdline_parse_string.o
  LD librte_compressdev.so.1.1
--
  CC cmdline_parse_portlist.o
  LD librte_cmdline.so.2.1
  INSTALL-LIB librte_cmdline.so.2.1
  LD librte_sched.so.3.1
  INSTALL-LIB librte_sched.so.3.1
make[4]: *** [librte_ethdev] Error 2
make[3]: *** [lib] Error 2
make[2]: *** [all] Error 2
make[1]: *** [pre_install] Error 2
make: *** [install] Error 2

*Meson Build Failed #1:
OS: SUSE15-64
Target:build-gcc-static
FAILED: lib/76b5a35@@rte_ethdev at sta/librte_ethdev_rte_ethdev.c.o 
gcc -Ilib/76b5a35@@rte_ethdev at sta -Ilib -I../lib -Ilib/librte_ethdev -I../lib/librte_ethdev -I. -I../ -Iconfig -I../config -Ilib/librte_eal/common/include -I../lib/librte_eal/common/include -I../lib/librte_eal/linux/eal/include -Ilib/librte_eal/common -I../lib/librte_eal/common -Ilib/librte_eal/common/include/arch/x86 -I../lib/librte_eal/common/include/arch/x86 -Ilib/librte_eal -I../lib/librte_eal -Ilib/librte_kvargs -I../lib/librte_kvargs -Ilib/librte_net -I../lib/librte_net -Ilib/librte_mbuf -I../lib/librte_mbuf -Ilib/librte_mempool -I../lib/librte_mempool -Ilib/librte_ring -I../lib/librte_ring -Ilib/librte_meter -I../lib/librte_meter -fdiagnostics-color=always -pipe -D_FILE_OFFSET_BITS=64 -Wall -Winvalid-pch -Werror -O3 -include rte_config.h -Wunused-parameter -Wsign-compare -Wcast-qual -D_GNU_SOURCE -fPIC -march=native -Wno-format-truncation -DALLOW_EXPERIMENTAL_API -MD -MQ 'lib/76b5a35@@rte_ethdev at sta/librte_ethdev_rte_ethdev.c.o' -MF 'lib/76b5a35@@rte_ethdev at sta/librte_ethdev_rte_ethdev.c.o.d' -o 'lib/76b5a35@@rte_ethdev at sta/librte_ethdev_rte_ethdev.c.o' -c ../lib/librte_ethdev/rte_ethdev.c
../lib/librte_ethdev/rte_ethdev.c: In function ‘rte_eth_dev_start’:
../lib/librte_ethdev/rte_ethdev.c:1452:2: error: ‘ret’ undeclared (first use in this function)
  ret = rte_eth_dev_config_restore(dev, &dev_info, port_id);
  ^~~
../lib/librte_ethdev/rte_ethdev.c:1452:2: note: each undeclared identifier is reported only once for each function it appears in
[88/1831] Linking static target lib/librte_net.a.
[89/1831] Generating pci_def with a custom command.
[90/1831] Compiling C object 'lib/76b5a35@@rte_ethdev at sta/librte_ethdev_ethdev_profile.c.o'.
[91/1831] Compiling C object 'lib/76b5a35@@rte_ethdev at sta/librte_ethdev_rte_mtr.c.o'.
[92/1831] Generating symbol file 'lib/76b5a35@@rte_eal at sha/librte_eal.so.11.1.symbols'.
[93/1831] Compiling C object 'lib/76b5a35@@rte_ethdev at sta/librte_ethdev_rte_tm.c.o'.
[94/1831] Compiling C object 'lib/76b5a35@@rte_ethdev at sta/librte_ethdev_rte_flow.c.o'.
ninja: build stopped: subcommand failed




*Meson Build Failed #2:
OS: UB1604-32
Target:build-gcc-static
FAILED: lib/76b5a35@@rte_ethdev at sta/librte_ethdev_rte_ethdev.c.o 
gcc -Ilib/76b5a35@@rte_ethdev at sta -Ilib -I../lib -Ilib/librte_ethdev -I../lib/librte_ethdev -I. -I../ -Iconfig -I../config -Ilib/librte_eal/common/include -I../lib/librte_eal/common/include -I../lib/librte_eal/linux/eal/include -Ilib/librte_eal/common -I../lib/librte_eal/common -Ilib/librte_eal/common/include/arch/x86 -I../lib/librte_eal/common/include/arch/x86 -Ilib/librte_eal -I../lib/librte_eal -Ilib/librte_kvargs -I../lib/librte_kvargs -Ilib/librte_net -I../lib/librte_net -Ilib/librte_mbuf -I../lib/librte_mbuf -Ilib/librte_mempool -I../lib/librte_mempool -Ilib/librte_ring -I../lib/librte_ring -Ilib/librte_meter -I../lib/librte_meter -fdiagnostics-color=always -pipe -D_FILE_OFFSET_BITS=64 -Wall -Winvalid-pch -Werror -O3 -include rte_config.h -Wunused-parameter -Wsign-compare -Wcast-qual -Wno-pointer-to-int-cast -D_GNU_SOURCE -fPIC -march=native -DALLOW_EXPERIMENTAL_API -MD -MQ 'lib/76b5a35@@rte_ethdev at sta/librte_ethdev_rte_ethdev.c.o' -MF 'lib/76b5a35@@rte_ethdev at sta/librte_ethdev_rte_ethdev.c.o.d' -o 'lib/76b5a35@@rte_ethdev at sta/librte_ethdev_rte_ethdev.c.o' -c ../lib/librte_ethdev/rte_ethdev.c
../lib/librte_ethdev/rte_ethdev.c: In function ‘rte_eth_dev_start’:
../lib/librte_ethdev/rte_ethdev.c:1452:2: error: ‘ret’ undeclared (first use in this function)
  ret = rte_eth_dev_config_restore(dev, &dev_info, port_id);
  ^
../lib/librte_ethdev/rte_ethdev.c:1452:2: note: each undeclared identifier is reported only once for each function it appears in
[98/1656] Generating ethdev_def with a custom command.
[99/1656] Generating symbol file 'lib/76b5a35@@rte_mempool at sha/librte_mempool.so.5.1.symbols'.
[100/1656] Compiling C object 'lib/76b5a35@@rte_ethdev at sta/librte_ethdev_rte_mtr.c.o'.
[101/1656] Compiling C object 'lib/76b5a35@@rte_ethdev at sta/librte_ethdev_rte_tm.c.o'.
[102/1656] Compiling C object 'lib/76b5a35@@rte_ethdev at sta/librte_ethdev_rte_flow.c.o'.
ninja: build stopped: subcommand failed




*Meson Build Failed #3:
OS: FC30-64
Target:build-gcc-static
FAILED: lib/76b5a35@@rte_ethdev at sta/librte_ethdev_rte_ethdev.c.o 
gcc -Ilib/76b5a35@@rte_ethdev at sta -Ilib -I../lib -Ilib/librte_ethdev -I../lib/librte_ethdev -I. -I../ -Iconfig -I../config -Ilib/librte_eal/common/include -I../lib/librte_eal/common/include -I../lib/librte_eal/linux/eal/include -Ilib/librte_eal/common -I../lib/librte_eal/common -Ilib/librte_eal/common/include/arch/x86 -I../lib/librte_eal/common/include/arch/x86 -Ilib/librte_eal -I../lib/librte_eal -Ilib/librte_kvargs -I../lib/librte_kvargs -Ilib/librte_net -I../lib/librte_net -Ilib/librte_mbuf -I../lib/librte_mbuf -Ilib/librte_mempool -I../lib/librte_mempool -Ilib/librte_ring -I../lib/librte_ring -Ilib/librte_meter -I../lib/librte_meter -fdiagnostics-color=always -pipe -D_FILE_OFFSET_BITS=64 -Wall -Winvalid-pch -Werror -O3 -include rte_config.h -Wunused-parameter -Wsign-compare -Wcast-qual -Wno-address-of-packed-member -D_GNU_SOURCE -fPIC -march=native -mno-avx512f -Wno-format-truncation -DALLOW_EXPERIMENTAL_API -MD -MQ 'lib/76b5a35@@rte_ethdev at sta/librte_ethdev_rte_ethdev.c.o' -MF 'lib/76b5a35@@rte_ethdev at sta/librte_ethdev_rte_ethdev.c.o.d' -o 'lib/76b5a35@@rte_ethdev at sta/librte_ethdev_rte_ethdev.c.o' -c ../lib/librte_ethdev/rte_ethdev.c
../lib/librte_ethdev/rte_ethdev.c: In function ‘rte_eth_dev_start’:
../lib/librte_ethdev/rte_ethdev.c:1452:2: error: ‘ret’ undeclared (first use in this function)
 1452 |  ret = rte_eth_dev_config_restore(dev, &dev_info, port_id);
      |  ^~~
../lib/librte_ethdev/rte_ethdev.c:1452:2: note: each undeclared identifier is reported only once for each function it appears in
[89/1784] Linking target lib/librte_ring.so.2.1.
[90/1784] Linking target lib/librte_meter.so.3.1.
[91/1784] Compiling C object 'lib/76b5a35@@rte_ethdev at sta/librte_ethdev_ethdev_profile.c.o'.
[92/1784] Compiling C object 'lib/76b5a35@@rte_ethdev at sta/librte_ethdev_rte_mtr.c.o'.
[93/1784] Compiling C object 'lib/76b5a35@@rte_ethdev at sta/librte_ethdev_rte_class_eth.c.o'.
[94/1784] Compiling C object 'lib/76b5a35@@rte_ethdev at sta/librte_ethdev_rte_tm.c.o'.
[95/1784] Compiling C object 'lib/76b5a35@@rte_ethdev at sta/librte_ethdev_rte_flow.c.o'.
ninja: build stopped: subcommand failed




*Meson Build Failed #4:
OS: UB1804-64
Target:build-gcc-static
FAILED: lib/76b5a35@@rte_ethdev at sta/librte_ethdev_rte_ethdev.c.o 
gcc -Ilib/76b5a35@@rte_ethdev at sta -Ilib -I../lib -Ilib/librte_ethdev -I../lib/librte_ethdev -I. -I../ -Iconfig -I../config -Ilib/librte_eal/common/include -I../lib/librte_eal/common/include -I../lib/librte_eal/linux/eal/include -Ilib/librte_eal/common -I../lib/librte_eal/common -Ilib/librte_eal/common/include/arch/x86 -I../lib/librte_eal/common/include/arch/x86 -Ilib/librte_eal -I../lib/librte_eal -Ilib/librte_kvargs -I../lib/librte_kvargs -Ilib/librte_net -I../lib/librte_net -Ilib/librte_mbuf -I../lib/librte_mbuf -Ilib/librte_mempool -I../lib/librte_mempool -Ilib/librte_ring -I../lib/librte_ring -Ilib/librte_meter -I../lib/librte_meter -fdiagnostics-color=always -pipe -D_FILE_OFFSET_BITS=64 -Wall -Winvalid-pch -Werror -O3 -include rte_config.h -Wunused-parameter -Wsign-compare -Wcast-qual -D_GNU_SOURCE -fPIC -march=native -mno-avx512f -Wno-format-truncation -DALLOW_EXPERIMENTAL_API -MD -MQ 'lib/76b5a35@@rte_ethdev at sta/librte_ethdev_rte_ethdev.c.o' -MF 'lib/76b5a35@@rte_ethdev at sta/librte_ethdev_rte_ethdev.c.o.d' -o 'lib/76b5a35@@rte_ethdev at sta/librte_ethdev_rte_ethdev.c.o' -c ../lib/librte_ethdev/rte_ethdev.c
../lib/librte_ethdev/rte_ethdev.c: In function ‘rte_eth_dev_start’:
../lib/librte_ethdev/rte_ethdev.c:1452:2: error: ‘ret’ undeclared (first use in this function)
  ret = rte_eth_dev_config_restore(dev, &dev_info, port_id);
  ^~~
../lib/librte_ethdev/rte_ethdev.c:1452:2: note: each undeclared identifier is reported only once for each function it appears in
[93/1791] Linking target lib/librte_mempool.so.5.1.
[94/1791] Generating symbol file 'lib/76b5a35@@rte_meter at sha/librte_meter.so.3.1.symbols'.
[95/1791] Compiling C object 'lib/76b5a35@@rte_ethdev at sta/librte_ethdev_rte_mtr.c.o'.
[96/1791] Compiling C object 'lib/76b5a35@@rte_ethdev at sta/librte_ethdev_rte_tm.c.o'.
[97/1791] Compiling C object 'lib/76b5a35@@rte_ethdev at sta/librte_ethdev_rte_flow.c.o'.
ninja: build stopped: subcommand failed




*Meson Build Failed #5:
OS: FreeBSD12-64
Target:build-gcc-static
FAILED: lib/76b5a35@@rte_ethdev at sta/librte_ethdev_rte_ethdev.c.o 
ccache gcc -Ilib/76b5a35@@rte_ethdev at sta -Ilib -I../lib -Ilib/librte_ethdev -I../lib/librte_ethdev -I. -I../ -Iconfig -I../config -Ilib/librte_eal/common/include -I../lib/librte_eal/common/include -I../lib/librte_eal/freebsd/eal/include -Ilib/librte_eal/common -I../lib/librte_eal/common -Ilib/librte_eal/common/include/arch/x86 -I../lib/librte_eal/common/include/arch/x86 -Ilib/librte_eal -I../lib/librte_eal -Ilib/librte_kvargs -I../lib/librte_kvargs -Ilib/librte_net -I../lib/librte_net -Ilib/librte_mbuf -I../lib/librte_mbuf -Ilib/librte_mempool -I../lib/librte_mempool -Ilib/librte_ring -I../lib/librte_ring -Ilib/librte_meter -I../lib/librte_meter -fdiagnostics-color=always -pipe -D_FILE_OFFSET_BITS=64 -Wall -Winvalid-pch -Werror -O3 -include rte_config.h -Wunused-parameter -Wsign-compare -Wcast-qual -D_GNU_SOURCE -D__BSD_VISIBLE -fPIC -march=native -Wno-format-truncation -DALLOW_EXPERIMENTAL_API -MD -MQ 'lib/76b5a35@@rte_ethdev at sta/librte_ethdev_rte_ethdev.c.o' -MF 'lib/76b5a35@@rte_ethdev at sta/librte_ethdev_rte_ethdev.c.o.d' -o 'lib/76b5a35@@rte_ethdev at sta/librte_ethdev_rte_ethdev.c.o' -c ../lib/librte_ethdev/rte_ethdev.c
../lib/librte_ethdev/rte_ethdev.c: In function 'rte_eth_dev_start':
../lib/librte_ethdev/rte_ethdev.c:1452:2: error: 'ret' undeclared (first use in this function)
  ret = rte_eth_dev_config_restore(dev, &dev_info, port_id);
  ^~~
../lib/librte_ethdev/rte_ethdev.c:1452:2: note: each undeclared identifier is reported only once for each function it appears in
[136/1413] Generating symbol file 'lib/76b5a35@@rte_eal at sha/librte_eal.so.11.1.symbols'.
[137/1413] Compiling C object 'drivers/a715181@@tmp_rte_pmd_bond at sta/net_bonding_rte_eth_bond_alb.c.o'.
[138/1413] Compiling C object 'drivers/a715181@@tmp_rte_pmd_bond at sta/net_bonding_rte_eth_bond_args.c.o'.
[139/1413] Compiling C object 'drivers/a715181@@tmp_rte_pmd_bond at sta/net_bonding_rte_eth_bond_8023ad.c.o'.
[140/1413] Compiling C object 'drivers/a715181@@tmp_rte_pmd_bnx2x at sta/net_bnx2x_bnx2x.c.o'.
ninja: build stopped: subcommand failed



DPDK STV team


More information about the test-report mailing list