[dpdk-test-report] |FAILURE| pw59204[v4, 37/54] examples/ip_reassembly: check status of getting ethdev info

sys_stv at intel.com sys_stv at intel.com
Thu Sep 19 04:02:33 CEST 2019


Test-Label: Intel-compilation
Test-Status: FAILURE
http://dpdk.org/patch/59204

_Compilation issues_

Submitter: Andrew Rybchenko <arybchenko at solarflare.com>
Date: 2019-09-12 16:42:48
Reply_mail: 1568306586-27831-38-git-send-email-arybchenko at solarflare.com
DPDK git baseline: Repo:dpdk, CommitID: f991c135bbe365afd34fe8f082a9cfc92e1d2fa4

Makefile build Summary: 22 Builds Done, 22 Successful, 0 Failures

Meson build Summary: 7 Builds Done, 2 Successful, 5 Failures

               +==============================================+===========+==========+
               |                   Makefile                   |   Meson   | Document |
+--------------+------+-------+------+------------+-----------+-----------+----------+
| os           | gcc  | clang | icc  | gcc+shared | gcc+debug | gcc/clang | pdf/html |
+--------------+------+-------+------+------------+-----------+-----------+----------+
| RHEL76-64    | pass |       |      |            |           |           |          |
| CENTOS76-64  | pass | pass  | pass | pass       | pass      |           |          |
| UB1804-64    | pass | pass  | pass |            |           | FAIL      | pass     |
| UB1604-32    | pass |       |      |            |           | FAIL      |          |
| UB1904-64    | pass |       |      |            |           |           |          |
| UB1604-64    | pass | pass  |      |            |           |           |          |
| FC30-64      | pass | pass  |      |            |           | FAIL      |          |
| WIN10-64     |      |       |      |            |           | pass      |          |
| FreeBSD12-64 | pass | pass  |      | pass       | pass      | FAIL      |          |
| RHEL80-64    | pass |       |      |            |           |           |          |
| SUSE15-64    | pass | pass  |      |            |           | FAIL      |          |
+--------------+------+-------+------+------------+-----------+-----------+----------+

Test environment and configuration as below:

** Makefile build **


OS: RHEL76-64
	Kernel Version: 3.10.0-957.el7.x86_64
	CPU info: Intel(R) Xeon(R) CPU E5-2699 v4 @ 2.20GHz
	GCC Version: gcc (GCC) 4.8.5 20150623 (Red Hat 4.8.5-36)
	Clang Version: NA
	x86_64-native-linuxapp-gcc


OS: CENTOS76-64
	Kernel Version: 3.10.0-957.10.1.el7.x86_64
	CPU info: Intel(R) Xeon(R) CPU E5-2699 v4 @ 2.20GHz
	GCC Version: gcc (GCC) 4.8.5 20150623 (Red Hat 4.8.5-36)
	Clang Version: 3.4.2 (tags/RELEASE_34/dot2-final)
	x86_64-native-linuxapp-clang
	x86_64-native-linuxapp-gcc+debug
	x86_64-native-linuxapp-gcc
	x86_64-native-linuxapp-gcc+shared
	x86_64-native-linuxapp-icc


OS: UB1804-64
	Kernel Version: 4.15.0-20-generic
	CPU info: Intel(R) Xeon(R) CPU E5-2699 v3 @ 2.30GHz
	GCC Version: gcc (Ubuntu 7.3.0-16ubuntu3) 7.3.0
	Clang Version: 6.0.0-1ubuntu2 (tags/RELEASE_600/final)
	x86_64-native-linuxapp-clang
	x86_64-native-linuxapp-icc
	x86_64-native-linuxapp-gcc


OS: UB1904-64
	Kernel Version: 5.0.0-13-generic
	CPU info: Intel(R) Xeon(R) CPU E5-2699 v3 @ 2.30GHz
	GCC Version: gcc (Ubuntu 8.3.0-6ubuntu1) 8.3.0
	Clang Version: 8.0.0-3 (tags/RELEASE_800/final)
	x86_64-native-linuxapp-gcc


OS: UB1604-32
	Kernel Version: 4.4.0-131-generic
	CPU info: Intel(R) Xeon(R) CPU E5-2699 v3 @ 2.30GHz
	GCC Version: gcc (Ubuntu 5.4.0-6ubuntu1~16.04.11) 5.4.0 20160609
	Clang Version: 3.8.0-2ubuntu4 (tags/RELEASE_380/final)
	i686-native-linuxapp-gcc


OS: UB1604-64
	Kernel Version: 4.4.0-47-generic
	CPU info: Intel(R) Xeon(R) CPU E5-2699 v3 @ 2.30GHz
	GCC Version: gcc (Ubuntu 5.4.0-6ubuntu1~16.04.10) 5.4.0 20160609
	Clang Version: 3.8.0-2ubuntu4 (tags/RELEASE_380/final)
	x86_64-native-linuxapp-clang
	x86_64-native-linuxapp-gcc


OS: FC30-64
	Kernel Version: 5.1.7-300.fc30.x86_64
	CPU info: Intel(R) Xeon(R) CPU E5-2699 v4 @ 2.20GHz
	GCC Version: gcc (GCC) 9.1.1 20190503 (Red Hat 9.1.1-1)
	Clang Version: 8.0.0 (Fedora 8.0.0-1.fc30)
	x86_64-native-linuxapp-gcc
	x86_64-native-linuxapp-clang


OS: FreeBSD12-64
	Kernel Version: 12.0-RC3
	CPU info: Intel(R) Xeon(R) CPU E5-2699 v4 @ 2.20GHz (2194.97-MHz K8-class CPU)
	GCC Version: gcc (FreeBSD Ports Collection) 7.3.0
	Clang Version: 6.0.1 (tags/RELEASE_601/final 335540) (based on LLVM 6.0.1)
	x86_64-native-bsdapp-gcc+debug
	x86_64-native-bsdapp-gcc+shared
	x86_64-native-bsdapp-clang
	x86_64-native-bsdapp-gcc


OS: RHEL80-64
	Kernel Version: 4.18.0-80.el8.x86_64
	CPU info: Intel(R) Xeon(R) CPU E5-2699 v4 @ 2.20GHz
	GCC Version: gcc (GCC) 8.2.1 20180905 (Red Hat 8.2.1-3)
	Clang Version: 6.0.1 (tags/RELEASE_601/final)
	x86_64-native-linuxapp-gcc


OS: SUSE15-64
	Kernel Version: 4.12.14-lp150.11-default
	CPU info: Intel(R) Xeon(R) CPU E5-2699 v4 @ 2.20GHz
	GCC Version: gcc (SUSE Linux) 7.3.1 20180323 [gcc-7-branch revision 258812]
	Clang Version: 5.0.1 (tags/RELEASE_501/final 312548)
	x86_64-native-linuxapp-gcc
	x86_64-native-linuxapp-clang


** Meson build **


OS: UB1804-64
	Kernel Version: 4.15.0-20-generic
	CPU info: Intel(R) Xeon(R) CPU E5-2699 v4 @ 2.20GHz
	GCC Version: gcc (Ubuntu 7.3.0-27ubuntu1~18.04) 7.3.0
	Clang Version: 6.0.0-1ubuntu2 (tags/RELEASE_600/final)
	x86_64-native-linuxapp-doc
	build-gcc-static
	build-gcc-shared
	build-clang-static
	build-clang-shared
	build-x86-default


OS: UB1604-32
	Kernel Version: 4.4.0-131-generic
	CPU info: Intel(R) Xeon(R) CPU E5-2699 v4 @ 2.20GHz
	GCC Version: gcc (Ubuntu 5.4.0-6ubuntu1~16.04.11) 5.4.0 20160609
	Clang Version: 3.8.0-2ubuntu4 (tags/RELEASE_380/final)
	build-gcc-static
	build-gcc-shared
	build-clang-static
	build-clang-shared
	build-x86-default


OS: FC30-64
	Kernel Version: 5.0.9-301.fc30.x86_64
	CPU info: Intel(R) Xeon(R) CPU E5-2699 v4 @ 2.20GHz
	GCC Version: gcc (GCC) 9.1.1 20190503 (Red Hat 9.1.1-1)
	Clang Version: 8.0.0 (Fedora 8.0.0-1.fc30)
	build-gcc-static
	build-gcc-shared
	build-clang-static
	build-clang-shared
	build-x86-default


OS: WIN10-64
	Kernel Version: N/A
	CPU info: N/A
	GCC Version: N/A
	Clang Version: Clang 8.0.0
	x86_64-windows-clang


OS: FreeBSD12-64
	Kernel Version: 12.0-RC3
	CPU info: Intel(R) Xeon(R) CPU E5-2699 v4 @ 2.20GHz (2194.99-MHz K8-class CPU)
	GCC Version: gcc (FreeBSD Ports Collection) 7.3.0
	Clang Version: 6.0.1 (tags/RELEASE_601/final 335540) (based on LLVM 6.0.1)
	build-gcc-static
	build-gcc-shared
	build-clang-static
	build-clang-shared
	build-x86-default


OS: SUSE15-64
	Kernel Version: 4.12.14-lp150.11-default
	CPU info: Intel(R) Xeon(R) CPU E5-2699 v4 @ 2.20GHz
	GCC Version: gcc (SUSE Linux) 7.3.1 20180323 [gcc-7-branch revision 258812]
	Clang Version: 5.0.1 (tags/RELEASE_501/final 312548)
	build-gcc-static
	build-gcc-shared
	build-clang-static
	build-clang-shared
	build-x86-default


*Meson Build Failed #1:
OS: SUSE15-64
Target:build-gcc-static
FAILED: examples/c590b3c@@dpdk-exception_path at exe/exception_path_main.c.o 
gcc -Iexamples/c590b3c@@dpdk-exception_path at exe -Iexamples -I../examples -Iexamples/exception_path -I../examples/exception_path -I. -I../ -Iconfig -I../config -Ilib/librte_eal/common/include -I../lib/librte_eal/common/include -I../lib/librte_eal/linux/eal/include -Ilib/librte_eal/common -I../lib/librte_eal/common -Ilib/librte_eal/common/include/arch/x86 -I../lib/librte_eal/common/include/arch/x86 -Ilib/librte_eal -I../lib/librte_eal -Ilib/librte_kvargs -I../lib/librte_kvargs -Ilib/librte_mempool -I../lib/librte_mempool -Ilib/librte_ring -I../lib/librte_ring -Ilib/librte_net -I../lib/librte_net -Ilib/librte_mbuf -I../lib/librte_mbuf -Ilib/librte_ethdev -I../lib/librte_ethdev -Ilib/librte_meter -I../lib/librte_meter -Ilib/librte_cmdline -I../lib/librte_cmdline -fdiagnostics-color=always -pipe -D_FILE_OFFSET_BITS=64 -Wall -Winvalid-pch -Werror -O3 -include rte_config.h -Wunused-parameter -Wsign-compare -Wcast-qual -D_GNU_SOURCE -march=native -Wno-format-truncation -MD -MQ 'examples/c590b3c@@dpdk-exception_path at exe/exception_path_main.c.o' -MF 'examples/c590b3c@@dpdk-exception_path at exe/exception_path_main.c.o.d' -o 'examples/c590b3c@@dpdk-exception_path at exe/exception_path_main.c.o' -c ../examples/exception_path/main.c
../examples/exception_path/main.c: In function ‘init_port’:
../examples/exception_path/main.c:436:6: error: void value not ignored as it ought to be
  ret = rte_eth_dev_info_get(port, &dev_info);
      ^
[1694/1831] Linking target examples/dpdk-cmdline.
[1695/1831] Linking target examples/dpdk-bond.
[1696/1831] Compiling C object 'examples/c590b3c@@dpdk-distributor at exe/distributor_main.c.o'.
[1697/1831] Compiling C object 'app/test/3062f5d@@dpdk-test at exe/test_compressdev.c.o'.
[1698/1831] Compiling C object 'app/test/3062f5d@@dpdk-test at exe/test_memcpy_perf.c.o'.
[1699/1831] Compiling C object 'examples/c590b3c@@dpdk-bbdev_app at exe/bbdev_app_main.c.o'.
[1700/1831] Compiling C object 'examples/c590b3c@@dpdk-l3fwd-power at exe/l3fwd-power_main.c.o'.
ninja: build stopped: subcommand failed




*Meson Build Failed #2:
OS: UB1604-32
Target:build-gcc-static
FAILED: examples/c590b3c@@dpdk-exception_path at exe/exception_path_main.c.o 
gcc -Iexamples/c590b3c@@dpdk-exception_path at exe -Iexamples -I../examples -Iexamples/exception_path -I../examples/exception_path -I. -I../ -Iconfig -I../config -Ilib/librte_eal/common/include -I../lib/librte_eal/common/include -I../lib/librte_eal/linux/eal/include -Ilib/librte_eal/common -I../lib/librte_eal/common -Ilib/librte_eal/common/include/arch/x86 -I../lib/librte_eal/common/include/arch/x86 -Ilib/librte_eal -I../lib/librte_eal -Ilib/librte_kvargs -I../lib/librte_kvargs -Ilib/librte_mempool -I../lib/librte_mempool -Ilib/librte_ring -I../lib/librte_ring -Ilib/librte_net -I../lib/librte_net -Ilib/librte_mbuf -I../lib/librte_mbuf -Ilib/librte_ethdev -I../lib/librte_ethdev -Ilib/librte_meter -I../lib/librte_meter -Ilib/librte_cmdline -I../lib/librte_cmdline -fdiagnostics-color=always -pipe -D_FILE_OFFSET_BITS=64 -Wall -Winvalid-pch -Werror -O3 -include rte_config.h -Wunused-parameter -Wsign-compare -Wcast-qual -Wno-pointer-to-int-cast -D_GNU_SOURCE -march=native -MD -MQ 'examples/c590b3c@@dpdk-exception_path at exe/exception_path_main.c.o' -MF 'examples/c590b3c@@dpdk-exception_path at exe/exception_path_main.c.o.d' -o 'examples/c590b3c@@dpdk-exception_path at exe/exception_path_main.c.o' -c ../examples/exception_path/main.c
../examples/exception_path/main.c: In function ‘init_port’:
../examples/exception_path/main.c:436:6: error: void value not ignored as it ought to be
  ret = rte_eth_dev_info_get(port, &dev_info);
      ^
[1512/1656] Compiling C object 'examples/c590b3c@@dpdk-flow_classify at exe/flow_classify_flow_classify.c.o'.
[1513/1656] Compiling C object 'examples/c590b3c@@dpdk-bond at exe/bond_main.c.o'.
[1514/1656] Linking target app/test/dpdk-test.
[1515/1656] Compiling C object 'examples/c590b3c@@dpdk-bbdev_app at exe/bbdev_app_main.c.o'.
[1516/1656] Compiling C object 'examples/c590b3c@@dpdk-distributor at exe/distributor_main.c.o'.
ninja: build stopped: subcommand failed




*Meson Build Failed #3:
OS: FC30-64
Target:build-gcc-static
FAILED: examples/c590b3c@@dpdk-exception_path at exe/exception_path_main.c.o 
gcc -Iexamples/c590b3c@@dpdk-exception_path at exe -Iexamples -I../examples -Iexamples/exception_path -I../examples/exception_path -I. -I../ -Iconfig -I../config -Ilib/librte_eal/common/include -I../lib/librte_eal/common/include -I../lib/librte_eal/linux/eal/include -Ilib/librte_eal/common -I../lib/librte_eal/common -Ilib/librte_eal/common/include/arch/x86 -I../lib/librte_eal/common/include/arch/x86 -Ilib/librte_eal -I../lib/librte_eal -Ilib/librte_kvargs -I../lib/librte_kvargs -Ilib/librte_mempool -I../lib/librte_mempool -Ilib/librte_ring -I../lib/librte_ring -Ilib/librte_net -I../lib/librte_net -Ilib/librte_mbuf -I../lib/librte_mbuf -Ilib/librte_ethdev -I../lib/librte_ethdev -Ilib/librte_meter -I../lib/librte_meter -Ilib/librte_cmdline -I../lib/librte_cmdline -fdiagnostics-color=always -pipe -D_FILE_OFFSET_BITS=64 -Wall -Winvalid-pch -Werror -O3 -include rte_config.h -Wunused-parameter -Wsign-compare -Wcast-qual -Wno-address-of-packed-member -D_GNU_SOURCE -march=native -mno-avx512f -Wno-format-truncation -MD -MQ 'examples/c590b3c@@dpdk-exception_path at exe/exception_path_main.c.o' -MF 'examples/c590b3c@@dpdk-exception_path at exe/exception_path_main.c.o.d' -o 'examples/c590b3c@@dpdk-exception_path at exe/exception_path_main.c.o' -c ../examples/exception_path/main.c
../examples/exception_path/main.c: In function ‘init_port’:
../examples/exception_path/main.c:436:6: error: void value not ignored as it ought to be
  436 |  ret = rte_eth_dev_info_get(port, &dev_info);
      |      ^
[1658/1784] Compiling C object 'examples/c590b3c@@dpdk-ip_pipeline at exe/ip_pipeline_tap.c.o'.
[1659/1784] Compiling C object 'examples/c590b3c@@dpdk-fips_validation at exe/fips_validation_main.c.o'.
[1660/1784] Compiling C object 'examples/c590b3c@@dpdk-ip_pipeline at exe/ip_pipeline_main.c.o'.
[1661/1784] Linking target examples/dpdk-bbdev_app.
[1662/1784] Compiling C object 'examples/c590b3c@@dpdk-ip_pipeline at exe/ip_pipeline_mempool.c.o'.
[1663/1784] Linking target examples/dpdk-flow_classify.
[1664/1784] Linking target examples/dpdk-distributor.
ninja: build stopped: subcommand failed




*Meson Build Failed #4:
OS: UB1804-64
Target:build-gcc-static
FAILED: examples/c590b3c@@dpdk-exception_path at exe/exception_path_main.c.o 
gcc -Iexamples/c590b3c@@dpdk-exception_path at exe -Iexamples -I../examples -Iexamples/exception_path -I../examples/exception_path -I. -I../ -Iconfig -I../config -Ilib/librte_eal/common/include -I../lib/librte_eal/common/include -I../lib/librte_eal/linux/eal/include -Ilib/librte_eal/common -I../lib/librte_eal/common -Ilib/librte_eal/common/include/arch/x86 -I../lib/librte_eal/common/include/arch/x86 -Ilib/librte_eal -I../lib/librte_eal -Ilib/librte_kvargs -I../lib/librte_kvargs -Ilib/librte_mempool -I../lib/librte_mempool -Ilib/librte_ring -I../lib/librte_ring -Ilib/librte_net -I../lib/librte_net -Ilib/librte_mbuf -I../lib/librte_mbuf -Ilib/librte_ethdev -I../lib/librte_ethdev -Ilib/librte_meter -I../lib/librte_meter -Ilib/librte_cmdline -I../lib/librte_cmdline -fdiagnostics-color=always -pipe -D_FILE_OFFSET_BITS=64 -Wall -Winvalid-pch -Werror -O3 -include rte_config.h -Wunused-parameter -Wsign-compare -Wcast-qual -D_GNU_SOURCE -march=native -mno-avx512f -Wno-format-truncation -MD -MQ 'examples/c590b3c@@dpdk-exception_path at exe/exception_path_main.c.o' -MF 'examples/c590b3c@@dpdk-exception_path at exe/exception_path_main.c.o.d' -o 'examples/c590b3c@@dpdk-exception_path at exe/exception_path_main.c.o' -c ../examples/exception_path/main.c
../examples/exception_path/main.c: In function ‘init_port’:
../examples/exception_path/main.c:436:6: error: void value not ignored as it ought to be
  ret = rte_eth_dev_info_get(port, &dev_info);
      ^
[1658/1791] Compiling C object 'examples/c590b3c@@dpdk-fips_validation at exe/fips_validation_fips_validation_hmac.c.o'.
[1659/1791] Linking target examples/dpdk-distributor.
[1660/1791] Compiling C object 'examples/c590b3c@@dpdk-fips_validation at exe/fips_validation_fips_dev_self_test.c.o'.
[1661/1791] Linking target examples/dpdk-bbdev_app.
[1662/1791] Compiling C object 'examples/c590b3c@@dpdk-flow_classify at exe/flow_classify_flow_classify.c.o'.
ninja: build stopped: subcommand failed




*Meson Build Failed #5:
OS: FreeBSD12-64
Target:build-gcc-static
FAILED: examples/c590b3c@@dpdk-exception_path at exe/exception_path_main.c.o 
ccache gcc -Iexamples/c590b3c@@dpdk-exception_path at exe -Iexamples -I../examples -Iexamples/exception_path -I../examples/exception_path -I. -I../ -Iconfig -I../config -Ilib/librte_eal/common/include -I../lib/librte_eal/common/include -I../lib/librte_eal/freebsd/eal/include -Ilib/librte_eal/common -I../lib/librte_eal/common -Ilib/librte_eal/common/include/arch/x86 -I../lib/librte_eal/common/include/arch/x86 -Ilib/librte_eal -I../lib/librte_eal -Ilib/librte_kvargs -I../lib/librte_kvargs -Ilib/librte_mempool -I../lib/librte_mempool -Ilib/librte_ring -I../lib/librte_ring -Ilib/librte_net -I../lib/librte_net -Ilib/librte_mbuf -I../lib/librte_mbuf -Ilib/librte_ethdev -I../lib/librte_ethdev -Ilib/librte_meter -I../lib/librte_meter -Ilib/librte_cmdline -I../lib/librte_cmdline -fdiagnostics-color=always -pipe -D_FILE_OFFSET_BITS=64 -Wall -Winvalid-pch -Werror -O3 -include rte_config.h -Wunused-parameter -Wsign-compare -Wcast-qual -D_GNU_SOURCE -D__BSD_VISIBLE -march=native -Wno-format-truncation -MD -MQ 'examples/c590b3c@@dpdk-exception_path at exe/exception_path_main.c.o' -MF 'examples/c590b3c@@dpdk-exception_path at exe/exception_path_main.c.o.d' -o 'examples/c590b3c@@dpdk-exception_path at exe/exception_path_main.c.o' -c ../examples/exception_path/main.c
../examples/exception_path/main.c: In function 'init_port':
../examples/exception_path/main.c:436:6: error: void value not ignored as it ought to be
  ret = rte_eth_dev_info_get(port, &dev_info);
      ^
[1332/1413] Compiling C object 'examples/c590b3c@@dpdk-ipsec-secgw at exe/ipsec-secgw_ipsec.c.o'.
[1333/1413] Compiling C object 'examples/c590b3c@@dpdk-ipsec-secgw at exe/ipsec-secgw_ipsec_process.c.o'.
[1334/1413] Linking target examples/dpdk-flow_filtering.
[1335/1413] Linking target examples/dpdk-ip_fragmentation.
[1336/1413] Linking target examples/dpdk-ip_reassembly.
ninja: build stopped: subcommand failed



DPDK STV team


More information about the test-report mailing list