[dpdk-test-report] |FAILURE| pw59449[3/8] examples/fips_validation: initialize IV for AES-GCM

sys_stv at intel.com sys_stv at intel.com
Thu Sep 19 14:34:28 CEST 2019


Test-Label: Intel-compilation
Test-Status: FAILURE
http://dpdk.org/patch/59449

_Compilation issues_

Submitter: Michael Shamis <michaelsh at marvell.com>
Date: 2019-09-19 12:12:27
Reply_mail: 20190919121232.4864-4-michaelsh at marvell.com
DPDK git baseline: Repo:dpdk, CommitID: bd253daa7717835f88bbc58b09a94d0060380396

Makefile build Summary: 22 Builds Done, 22 Successful, 0 Failures

Meson build Summary: 7 Builds Done, 2 Successful, 5 Failures

               +==============================================+===========+==========+
               |                   Makefile                   |   Meson   | Document |
+--------------+------+-------+------+------------+-----------+-----------+----------+
| os           | gcc  | clang | icc  | gcc+shared | gcc+debug | gcc/clang | pdf/html |
+--------------+------+-------+------+------------+-----------+-----------+----------+
| RHEL76-64    | pass |       |      |            |           |           |          |
| CENTOS76-64  | pass | pass  | pass | pass       | pass      |           |          |
| UB1804-64    | pass | pass  | pass |            |           | FAIL      | pass     |
| UB1604-32    | pass |       |      |            |           | FAIL      |          |
| UB1904-64    | pass |       |      |            |           |           |          |
| UB1604-64    | pass | pass  |      |            |           |           |          |
| FC30-64      | pass | pass  |      |            |           | FAIL      |          |
| WIN10-64     |      |       |      |            |           | pass      |          |
| FreeBSD12-64 | pass | pass  |      | pass       | pass      | FAIL      |          |
| RHEL80-64    | pass |       |      |            |           |           |          |
| SUSE15-64    | pass | pass  |      |            |           | FAIL      |          |
+--------------+------+-------+------+------------+-----------+-----------+----------+

Test environment and configuration as below:

** Makefile build **


OS: RHEL76-64
	Kernel Version: 3.10.0-957.el7.x86_64
	CPU info: Intel(R) Xeon(R) CPU E5-2699 v4 @ 2.20GHz
	GCC Version: gcc (GCC) 4.8.5 20150623 (Red Hat 4.8.5-36)
	Clang Version: NA
	x86_64-native-linuxapp-gcc


OS: CENTOS76-64
	Kernel Version: 3.10.0-957.10.1.el7.x86_64
	CPU info: Intel(R) Xeon(R) CPU E5-2699 v4 @ 2.20GHz
	GCC Version: gcc (GCC) 4.8.5 20150623 (Red Hat 4.8.5-36)
	Clang Version: 3.4.2 (tags/RELEASE_34/dot2-final)
	x86_64-native-linuxapp-clang
	x86_64-native-linuxapp-gcc+debug
	x86_64-native-linuxapp-gcc
	x86_64-native-linuxapp-gcc+shared
	x86_64-native-linuxapp-icc


OS: UB1804-64
	Kernel Version: 4.15.0-20-generic
	CPU info: Intel(R) Xeon(R) CPU E5-2699 v3 @ 2.30GHz
	GCC Version: gcc (Ubuntu 7.3.0-16ubuntu3) 7.3.0
	Clang Version: 6.0.0-1ubuntu2 (tags/RELEASE_600/final)
	x86_64-native-linuxapp-clang
	x86_64-native-linuxapp-icc
	x86_64-native-linuxapp-gcc


OS: UB1904-64
	Kernel Version: 5.0.0-13-generic
	CPU info: Intel(R) Xeon(R) CPU E5-2699 v3 @ 2.30GHz
	GCC Version: gcc (Ubuntu 8.3.0-6ubuntu1) 8.3.0
	Clang Version: 8.0.0-3 (tags/RELEASE_800/final)
	x86_64-native-linuxapp-gcc


OS: UB1604-32
	Kernel Version: 4.4.0-131-generic
	CPU info: Intel(R) Xeon(R) CPU E5-2699 v3 @ 2.30GHz
	GCC Version: gcc (Ubuntu 5.4.0-6ubuntu1~16.04.11) 5.4.0 20160609
	Clang Version: 3.8.0-2ubuntu4 (tags/RELEASE_380/final)
	i686-native-linuxapp-gcc


OS: UB1604-64
	Kernel Version: 4.4.0-47-generic
	CPU info: Intel(R) Xeon(R) CPU E5-2699 v3 @ 2.30GHz
	GCC Version: gcc (Ubuntu 5.4.0-6ubuntu1~16.04.10) 5.4.0 20160609
	Clang Version: 3.8.0-2ubuntu4 (tags/RELEASE_380/final)
	x86_64-native-linuxapp-clang
	x86_64-native-linuxapp-gcc


OS: FC30-64
	Kernel Version: 5.1.7-300.fc30.x86_64
	CPU info: Intel(R) Xeon(R) CPU E5-2699 v4 @ 2.20GHz
	GCC Version: gcc (GCC) 9.1.1 20190503 (Red Hat 9.1.1-1)
	Clang Version: 8.0.0 (Fedora 8.0.0-1.fc30)
	x86_64-native-linuxapp-gcc
	x86_64-native-linuxapp-clang


OS: FreeBSD12-64
	Kernel Version: 12.0-RC3
	CPU info: Intel(R) Xeon(R) CPU E5-2699 v4 @ 2.20GHz (2194.97-MHz K8-class CPU)
	GCC Version: gcc (FreeBSD Ports Collection) 7.3.0
	Clang Version: 6.0.1 (tags/RELEASE_601/final 335540) (based on LLVM 6.0.1)
	x86_64-native-bsdapp-gcc+shared
	x86_64-native-bsdapp-gcc+debug
	x86_64-native-bsdapp-clang
	x86_64-native-bsdapp-gcc


OS: RHEL80-64
	Kernel Version: 4.18.0-80.el8.x86_64
	CPU info: Intel(R) Xeon(R) CPU E5-2699 v4 @ 2.20GHz
	GCC Version: gcc (GCC) 8.2.1 20180905 (Red Hat 8.2.1-3)
	Clang Version: 6.0.1 (tags/RELEASE_601/final)
	x86_64-native-linuxapp-gcc


OS: SUSE15-64
	Kernel Version: 4.12.14-lp150.11-default
	CPU info: Intel(R) Xeon(R) CPU E5-2699 v4 @ 2.20GHz
	GCC Version: gcc (SUSE Linux) 7.3.1 20180323 [gcc-7-branch revision 258812]
	Clang Version: 5.0.1 (tags/RELEASE_501/final 312548)
	x86_64-native-linuxapp-gcc
	x86_64-native-linuxapp-clang


** Meson build **


OS: UB1804-64
	Kernel Version: 4.15.0-20-generic
	CPU info: Intel(R) Xeon(R) CPU E5-2699 v4 @ 2.20GHz
	GCC Version: gcc (Ubuntu 7.3.0-27ubuntu1~18.04) 7.3.0
	Clang Version: 6.0.0-1ubuntu2 (tags/RELEASE_600/final)
	x86_64-native-linuxapp-doc
	build-gcc-static
	build-gcc-shared
	build-clang-static
	build-clang-shared
	build-x86-default


OS: UB1604-32
	Kernel Version: 4.4.0-131-generic
	CPU info: Intel(R) Xeon(R) CPU E5-2699 v4 @ 2.20GHz
	GCC Version: gcc (Ubuntu 5.4.0-6ubuntu1~16.04.11) 5.4.0 20160609
	Clang Version: 3.8.0-2ubuntu4 (tags/RELEASE_380/final)
	build-gcc-static
	build-gcc-shared
	build-clang-static
	build-clang-shared
	build-x86-default


OS: FC30-64
	Kernel Version: 5.0.9-301.fc30.x86_64
	CPU info: Intel(R) Xeon(R) CPU E5-2699 v4 @ 2.20GHz
	GCC Version: gcc (GCC) 9.1.1 20190503 (Red Hat 9.1.1-1)
	Clang Version: 8.0.0 (Fedora 8.0.0-1.fc30)
	build-gcc-static
	build-gcc-shared
	build-clang-static
	build-clang-shared
	build-x86-default


OS: WIN10-64
	Kernel Version: N/A
	CPU info: N/A
	GCC Version: N/A
	Clang Version: Clang 8.0.0
	x86_64-windows-clang


OS: FreeBSD12-64
	Kernel Version: 12.0-RC3
	CPU info: Intel(R) Xeon(R) CPU E5-2699 v4 @ 2.20GHz (2194.99-MHz K8-class CPU)
	GCC Version: gcc (FreeBSD Ports Collection) 7.3.0
	Clang Version: 6.0.1 (tags/RELEASE_601/final 335540) (based on LLVM 6.0.1)
	build-gcc-static
	build-gcc-shared
	build-clang-static
	build-clang-shared
	build-x86-default


OS: SUSE15-64
	Kernel Version: 4.12.14-lp150.11-default
	CPU info: Intel(R) Xeon(R) CPU E5-2699 v4 @ 2.20GHz
	GCC Version: gcc (SUSE Linux) 7.3.1 20180323 [gcc-7-branch revision 258812]
	Clang Version: 5.0.1 (tags/RELEASE_501/final 312548)
	build-gcc-static
	build-gcc-shared
	build-clang-static
	build-clang-shared
	build-x86-default


*Meson Build Failed #1:
OS: SUSE15-64
Target:build-gcc-static
FAILED: examples/c590b3c@@dpdk-fips_validation at exe/fips_validation_fips_validation.c.o 
gcc -Iexamples/c590b3c@@dpdk-fips_validation at exe -Iexamples -I../examples -Iexamples/fips_validation -I../examples/fips_validation -I. -I../ -Iconfig -I../config -Ilib/librte_eal/common/include -I../lib/librte_eal/common/include -I../lib/librte_eal/linux/eal/include -Ilib/librte_eal/common -I../lib/librte_eal/common -Ilib/librte_eal/common/include/arch/x86 -I../lib/librte_eal/common/include/arch/x86 -Ilib/librte_eal -I../lib/librte_eal -Ilib/librte_kvargs -I../lib/librte_kvargs -Ilib/librte_mempool -I../lib/librte_mempool -Ilib/librte_ring -I../lib/librte_ring -Ilib/librte_net -I../lib/librte_net -Ilib/librte_mbuf -I../lib/librte_mbuf -Ilib/librte_ethdev -I../lib/librte_ethdev -Ilib/librte_meter -I../lib/librte_meter -Ilib/librte_cmdline -I../lib/librte_cmdline -Ilib/librte_cryptodev -I../lib/librte_cryptodev -fdiagnostics-color=always -pipe -D_FILE_OFFSET_BITS=64 -Wall -Winvalid-pch -Werror -O3 -include rte_config.h -Wunused-parameter -Wsign-compare -Wcast-qual -D_GNU_SOURCE -march=native -Wno-format-truncation -DALLOW_EXPERIMENTAL_API -MD -MQ 'examples/c590b3c@@dpdk-fips_validation at exe/fips_validation_fips_validation.c.o' -MF 'examples/c590b3c@@dpdk-fips_validation at exe/fips_validation_fips_validation.c.o.d' -o 'examples/c590b3c@@dpdk-fips_validation at exe/fips_validation_fips_validation.c.o' -c ../examples/fips_validation/fips_validation.c
../examples/fips_validation/fips_validation.c: In function ‘fips_test_parse_header’:
../examples/fips_validation/fips_validation.c:253:19: error: ‘struct fips_test_interim_info’ has no member named ‘file_name’; did you mean ‘file_type’?
   if (strstr(info.file_name, "AESVS")) {
                   ^~~~~~~~~
                   file_type
../examples/fips_validation/fips_validation.c:258:26: error: ‘struct fips_test_interim_info’ has no member named ‘file_name’; did you mean ‘file_type’?
   } else if (strstr(info.file_name, "GCM")) {
                          ^~~~~~~~~
                          file_type
../examples/fips_validation/fips_validation.c:263:26: error: ‘struct fips_test_interim_info’ has no member named ‘file_name’; did you mean ‘file_type’?
   } else if (strstr(info.file_name, "CMAC")) {
                          ^~~~~~~~~
                          file_type
../examples/fips_validation/fips_validation.c:268:26: error: ‘struct fips_test_interim_info’ has no member named ‘file_name’; did you mean ‘file_type’?
   } else if (strstr(info.file_name, "CCM")) {
                          ^~~~~~~~~
                          file_type
../examples/fips_validation/fips_validation.c:273:26: error: ‘struct fips_test_interim_info’ has no member named ‘file_name’; did you mean ‘file_type’?
   } else if (strstr(info.file_name, "HMAC")) {
                          ^~~~~~~~~
                          file_type
../examples/fips_validation/fips_validation.c:278:26: error: ‘struct fips_test_interim_info’ has no member named ‘file_name’; did you mean ‘file_type’?
   } else if (strstr(info.file_name, "TDES")) {
                          ^~~~~~~~~
                          file_type
../examples/fips_validation/fips_validation.c:283:26: error: ‘struct fips_test_interim_info’ has no member named ‘file_name’; did you mean ‘file_type’?
   } else if (strstr(info.file_name, "SHA-")) {
                          ^~~~~~~~~
                          file_type
[1563/1831] Compiling C object 'app/a172ced@@dpdk-testpmd at exe/test-pmd_bpf_cmd.c.o'.
[1564/1831] Compiling C object 'app/a172ced@@dpdk-testpmd at exe/test-pmd_cmdline.c.o'.
[1565/1831] Compiling C object 'examples/c590b3c@@dpdk-l3fwd-vf at exe/l3fwd-vf_main.c.o'.
[1566/1831] Compiling C object 'app/test/3062f5d@@dpdk-test at exe/commands.c.o'.
[1567/1831] Compiling C object 'app/test/3062f5d@@dpdk-test at exe/test_acl.c.o'.
[1568/1831] Compiling C object 'app/a172ced@@dpdk-testpmd at exe/test-pmd_parameters.c.o'.
[1569/1831] Compiling C object 'app/a172ced@@dpdk-testpmd at exe/test-pmd_testpmd.c.o'.
ninja: build stopped: subcommand failed




*Meson Build Failed #2:
OS: UB1604-32
Target:build-gcc-static
FAILED: examples/c590b3c@@dpdk-fips_validation at exe/fips_validation_fips_validation.c.o 
gcc -Iexamples/c590b3c@@dpdk-fips_validation at exe -Iexamples -I../examples -Iexamples/fips_validation -I../examples/fips_validation -I. -I../ -Iconfig -I../config -Ilib/librte_eal/common/include -I../lib/librte_eal/common/include -I../lib/librte_eal/linux/eal/include -Ilib/librte_eal/common -I../lib/librte_eal/common -Ilib/librte_eal/common/include/arch/x86 -I../lib/librte_eal/common/include/arch/x86 -Ilib/librte_eal -I../lib/librte_eal -Ilib/librte_kvargs -I../lib/librte_kvargs -Ilib/librte_mempool -I../lib/librte_mempool -Ilib/librte_ring -I../lib/librte_ring -Ilib/librte_net -I../lib/librte_net -Ilib/librte_mbuf -I../lib/librte_mbuf -Ilib/librte_ethdev -I../lib/librte_ethdev -Ilib/librte_meter -I../lib/librte_meter -Ilib/librte_cmdline -I../lib/librte_cmdline -Ilib/librte_cryptodev -I../lib/librte_cryptodev -fdiagnostics-color=always -pipe -D_FILE_OFFSET_BITS=64 -Wall -Winvalid-pch -Werror -O3 -include rte_config.h -Wunused-parameter -Wsign-compare -Wcast-qual -Wno-pointer-to-int-cast -D_GNU_SOURCE -march=native -DALLOW_EXPERIMENTAL_API -MD -MQ 'examples/c590b3c@@dpdk-fips_validation at exe/fips_validation_fips_validation.c.o' -MF 'examples/c590b3c@@dpdk-fips_validation at exe/fips_validation_fips_validation.c.o.d' -o 'examples/c590b3c@@dpdk-fips_validation at exe/fips_validation_fips_validation.c.o' -c ../examples/fips_validation/fips_validation.c
../examples/fips_validation/fips_validation.c: In function ‘fips_test_parse_header’:
../examples/fips_validation/fips_validation.c:253:18: error: ‘struct fips_test_interim_info’ has no member named ‘file_name’
   if (strstr(info.file_name, "AESVS")) {
                  ^
../examples/fips_validation/fips_validation.c:258:25: error: ‘struct fips_test_interim_info’ has no member named ‘file_name’
   } else if (strstr(info.file_name, "GCM")) {
                         ^
../examples/fips_validation/fips_validation.c:263:25: error: ‘struct fips_test_interim_info’ has no member named ‘file_name’
   } else if (strstr(info.file_name, "CMAC")) {
                         ^
../examples/fips_validation/fips_validation.c:268:25: error: ‘struct fips_test_interim_info’ has no member named ‘file_name’
   } else if (strstr(info.file_name, "CCM")) {
                         ^
../examples/fips_validation/fips_validation.c:273:25: error: ‘struct fips_test_interim_info’ has no member named ‘file_name’
   } else if (strstr(info.file_name, "HMAC")) {
                         ^
../examples/fips_validation/fips_validation.c:278:25: error: ‘struct fips_test_interim_info’ has no member named ‘file_name’
   } else if (strstr(info.file_name, "TDES")) {
                         ^
../examples/fips_validation/fips_validation.c:283:25: error: ‘struct fips_test_interim_info’ has no member named ‘file_name’
   } else if (strstr(info.file_name, "SHA-")) {
                         ^
[1386/1656] Compiling C object 'examples/c590b3c@@dpdk-fips_validation at exe/fips_validation_fips_validation_aes.c.o'.
[1387/1656] Compiling C object 'app/test/3062f5d@@dpdk-test at exe/test_acl.c.o'.
[1388/1656] Compiling C object 'app/a172ced@@dpdk-testpmd at exe/test-pmd_cmdline.c.o'.
[1389/1656] Compiling C object 'app/a172ced@@dpdk-testpmd at exe/test-pmd_rxonly.c.o'.
[1390/1656] Compiling C object 'app/a172ced@@dpdk-testpmd at exe/test-pmd_testpmd.c.o'.
ninja: build stopped: subcommand failed




*Meson Build Failed #3:
OS: FC30-64
Target:build-gcc-static
FAILED: examples/c590b3c@@dpdk-fips_validation at exe/fips_validation_fips_validation.c.o 
gcc -Iexamples/c590b3c@@dpdk-fips_validation at exe -Iexamples -I../examples -Iexamples/fips_validation -I../examples/fips_validation -I. -I../ -Iconfig -I../config -Ilib/librte_eal/common/include -I../lib/librte_eal/common/include -I../lib/librte_eal/linux/eal/include -Ilib/librte_eal/common -I../lib/librte_eal/common -Ilib/librte_eal/common/include/arch/x86 -I../lib/librte_eal/common/include/arch/x86 -Ilib/librte_eal -I../lib/librte_eal -Ilib/librte_kvargs -I../lib/librte_kvargs -Ilib/librte_mempool -I../lib/librte_mempool -Ilib/librte_ring -I../lib/librte_ring -Ilib/librte_net -I../lib/librte_net -Ilib/librte_mbuf -I../lib/librte_mbuf -Ilib/librte_ethdev -I../lib/librte_ethdev -Ilib/librte_meter -I../lib/librte_meter -Ilib/librte_cmdline -I../lib/librte_cmdline -Ilib/librte_cryptodev -I../lib/librte_cryptodev -fdiagnostics-color=always -pipe -D_FILE_OFFSET_BITS=64 -Wall -Winvalid-pch -Werror -O3 -include rte_config.h -Wunused-parameter -Wsign-compare -Wcast-qual -Wno-address-of-packed-member -D_GNU_SOURCE -march=native -mno-avx512f -Wno-format-truncation -DALLOW_EXPERIMENTAL_API -MD -MQ 'examples/c590b3c@@dpdk-fips_validation at exe/fips_validation_fips_validation.c.o' -MF 'examples/c590b3c@@dpdk-fips_validation at exe/fips_validation_fips_validation.c.o.d' -o 'examples/c590b3c@@dpdk-fips_validation at exe/fips_validation_fips_validation.c.o' -c ../examples/fips_validation/fips_validation.c
../examples/fips_validation/fips_validation.c: In function ‘fips_test_parse_header’:
../examples/fips_validation/fips_validation.c:253:19: error: ‘struct fips_test_interim_info’ has no member named ‘file_name’; did you mean ‘file_type’?
  253 |   if (strstr(info.file_name, "AESVS")) {
      |                   ^~~~~~~~~
      |                   file_type
../examples/fips_validation/fips_validation.c:258:26: error: ‘struct fips_test_interim_info’ has no member named ‘file_name’; did you mean ‘file_type’?
  258 |   } else if (strstr(info.file_name, "GCM")) {
      |                          ^~~~~~~~~
      |                          file_type
../examples/fips_validation/fips_validation.c:263:26: error: ‘struct fips_test_interim_info’ has no member named ‘file_name’; did you mean ‘file_type’?
  263 |   } else if (strstr(info.file_name, "CMAC")) {
      |                          ^~~~~~~~~
      |                          file_type
../examples/fips_validation/fips_validation.c:268:26: error: ‘struct fips_test_interim_info’ has no member named ‘file_name’; did you mean ‘file_type’?
  268 |   } else if (strstr(info.file_name, "CCM")) {
      |                          ^~~~~~~~~
      |                          file_type
../examples/fips_validation/fips_validation.c:273:26: error: ‘struct fips_test_interim_info’ has no member named ‘file_name’; did you mean ‘file_type’?
  273 |   } else if (strstr(info.file_name, "HMAC")) {
      |                          ^~~~~~~~~
      |                          file_type
../examples/fips_validation/fips_validation.c:278:26: error: ‘struct fips_test_interim_info’ has no member named ‘file_name’; did you mean ‘file_type’?
  278 |   } else if (strstr(info.file_name, "TDES")) {
      |                          ^~~~~~~~~
      |                          file_type
../examples/fips_validation/fips_validation.c:283:26: error: ‘struct fips_test_interim_info’ has no member named ‘file_name’; did you mean ‘file_type’?
  283 |   } else if (strstr(info.file_name, "SHA-")) {
      |                          ^~~~~~~~~
      |                          file_type
[1501/1784] Compiling C object 'app/a172ced@@dpdk-testpmd at exe/test-pmd_flowgen.c.o'.
[1502/1784] Compiling C object 'app/a172ced@@dpdk-testpmd at exe/test-pmd_ieee1588fwd.c.o'.
[1503/1784] Compiling C object 'examples/c590b3c@@dpdk-mp_client at exe/multi_process_client_server_mp_mp_client_client.c.o'.
[1504/1784] Compiling C object 'app/a172ced@@dpdk-testpmd at exe/test-pmd_noisy_vnf.c.o'.
[1505/1784] Compiling C object 'app/a172ced@@dpdk-testpmd at exe/test-pmd_cmdline.c.o'.
[1506/1784] Compiling C object 'examples/c590b3c@@dpdk-l3fwd-power at exe/l3fwd-power_main.c.o'.
[1507/1784] Compiling C object 'app/a172ced@@dpdk-testpmd at exe/test-pmd_macswap.c.o'.
ninja: build stopped: subcommand failed




*Meson Build Failed #4:
OS: UB1804-64
Target:build-gcc-static
FAILED: examples/c590b3c@@dpdk-fips_validation at exe/fips_validation_fips_validation.c.o 
gcc -Iexamples/c590b3c@@dpdk-fips_validation at exe -Iexamples -I../examples -Iexamples/fips_validation -I../examples/fips_validation -I. -I../ -Iconfig -I../config -Ilib/librte_eal/common/include -I../lib/librte_eal/common/include -I../lib/librte_eal/linux/eal/include -Ilib/librte_eal/common -I../lib/librte_eal/common -Ilib/librte_eal/common/include/arch/x86 -I../lib/librte_eal/common/include/arch/x86 -Ilib/librte_eal -I../lib/librte_eal -Ilib/librte_kvargs -I../lib/librte_kvargs -Ilib/librte_mempool -I../lib/librte_mempool -Ilib/librte_ring -I../lib/librte_ring -Ilib/librte_net -I../lib/librte_net -Ilib/librte_mbuf -I../lib/librte_mbuf -Ilib/librte_ethdev -I../lib/librte_ethdev -Ilib/librte_meter -I../lib/librte_meter -Ilib/librte_cmdline -I../lib/librte_cmdline -Ilib/librte_cryptodev -I../lib/librte_cryptodev -fdiagnostics-color=always -pipe -D_FILE_OFFSET_BITS=64 -Wall -Winvalid-pch -Werror -O3 -include rte_config.h -Wunused-parameter -Wsign-compare -Wcast-qual -D_GNU_SOURCE -march=native -mno-avx512f -Wno-format-truncation -DALLOW_EXPERIMENTAL_API -MD -MQ 'examples/c590b3c@@dpdk-fips_validation at exe/fips_validation_fips_validation.c.o' -MF 'examples/c590b3c@@dpdk-fips_validation at exe/fips_validation_fips_validation.c.o.d' -o 'examples/c590b3c@@dpdk-fips_validation at exe/fips_validation_fips_validation.c.o' -c ../examples/fips_validation/fips_validation.c
../examples/fips_validation/fips_validation.c: In function ‘fips_test_parse_header’:
../examples/fips_validation/fips_validation.c:253:19: error: ‘struct fips_test_interim_info’ has no member named ‘file_name’; did you mean ‘file_type’?
   if (strstr(info.file_name, "AESVS")) {
                   ^~~~~~~~~
                   file_type
../examples/fips_validation/fips_validation.c:258:26: error: ‘struct fips_test_interim_info’ has no member named ‘file_name’; did you mean ‘file_type’?
   } else if (strstr(info.file_name, "GCM")) {
                          ^~~~~~~~~
                          file_type
../examples/fips_validation/fips_validation.c:263:26: error: ‘struct fips_test_interim_info’ has no member named ‘file_name’; did you mean ‘file_type’?
   } else if (strstr(info.file_name, "CMAC")) {
                          ^~~~~~~~~
                          file_type
../examples/fips_validation/fips_validation.c:268:26: error: ‘struct fips_test_interim_info’ has no member named ‘file_name’; did you mean ‘file_type’?
   } else if (strstr(info.file_name, "CCM")) {
                          ^~~~~~~~~
                          file_type
../examples/fips_validation/fips_validation.c:273:26: error: ‘struct fips_test_interim_info’ has no member named ‘file_name’; did you mean ‘file_type’?
   } else if (strstr(info.file_name, "HMAC")) {
                          ^~~~~~~~~
                          file_type
../examples/fips_validation/fips_validation.c:278:26: error: ‘struct fips_test_interim_info’ has no member named ‘file_name’; did you mean ‘file_type’?
   } else if (strstr(info.file_name, "TDES")) {
                          ^~~~~~~~~
                          file_type
../examples/fips_validation/fips_validation.c:283:26: error: ‘struct fips_test_interim_info’ has no member named ‘file_name’; did you mean ‘file_type’?
   } else if (strstr(info.file_name, "SHA-")) {
                          ^~~~~~~~~
                          file_type
[1512/1791] Compiling C object 'app/a172ced@@dpdk-testpmd at exe/test-pmd_csumonly.c.o'.
[1513/1791] Compiling C object 'app/a172ced@@dpdk-testpmd at exe/test-pmd_iofwd.c.o'.
[1514/1791] Compiling C object 'app/a172ced@@dpdk-testpmd at exe/test-pmd_ieee1588fwd.c.o'.
[1515/1791] Compiling C object 'app/a172ced@@dpdk-testpmd at exe/test-pmd_util.c.o'.
[1516/1791] Compiling C object 'app/a172ced@@dpdk-testpmd at exe/test-pmd_cmdline.c.o'.
ninja: build stopped: subcommand failed




*Meson Build Failed #5:
OS: FreeBSD12-64
Target:build-gcc-static
FAILED: examples/c590b3c@@dpdk-fips_validation at exe/fips_validation_fips_validation.c.o 
ccache gcc -Iexamples/c590b3c@@dpdk-fips_validation at exe -Iexamples -I../examples -Iexamples/fips_validation -I../examples/fips_validation -I. -I../ -Iconfig -I../config -Ilib/librte_eal/common/include -I../lib/librte_eal/common/include -I../lib/librte_eal/freebsd/eal/include -Ilib/librte_eal/common -I../lib/librte_eal/common -Ilib/librte_eal/common/include/arch/x86 -I../lib/librte_eal/common/include/arch/x86 -Ilib/librte_eal -I../lib/librte_eal -Ilib/librte_kvargs -I../lib/librte_kvargs -Ilib/librte_mempool -I../lib/librte_mempool -Ilib/librte_ring -I../lib/librte_ring -Ilib/librte_net -I../lib/librte_net -Ilib/librte_mbuf -I../lib/librte_mbuf -Ilib/librte_ethdev -I../lib/librte_ethdev -Ilib/librte_meter -I../lib/librte_meter -Ilib/librte_cmdline -I../lib/librte_cmdline -Ilib/librte_cryptodev -I../lib/librte_cryptodev -fdiagnostics-color=always -pipe -D_FILE_OFFSET_BITS=64 -Wall -Winvalid-pch -Werror -O3 -include rte_config.h -Wunused-parameter -Wsign-compare -Wcast-qual -D_GNU_SOURCE -D__BSD_VISIBLE -march=native -Wno-format-truncation -DALLOW_EXPERIMENTAL_API -MD -MQ 'examples/c590b3c@@dpdk-fips_validation at exe/fips_validation_fips_validation.c.o' -MF 'examples/c590b3c@@dpdk-fips_validation at exe/fips_validation_fips_validation.c.o.d' -o 'examples/c590b3c@@dpdk-fips_validation at exe/fips_validation_fips_validation.c.o' -c ../examples/fips_validation/fips_validation.c
../examples/fips_validation/fips_validation.c: In function 'fips_test_parse_header':
../examples/fips_validation/fips_validation.c:253:19: error: 'struct fips_test_interim_info' has no member named 'file_name'; did you mean 'file_type'?
   if (strstr(info.file_name, "AESVS")) {
                   ^~~~~~~~~
                   file_type
../examples/fips_validation/fips_validation.c:258:26: error: 'struct fips_test_interim_info' has no member named 'file_name'; did you mean 'file_type'?
   } else if (strstr(info.file_name, "GCM")) {
                          ^~~~~~~~~
                          file_type
../examples/fips_validation/fips_validation.c:263:26: error: 'struct fips_test_interim_info' has no member named 'file_name'; did you mean 'file_type'?
   } else if (strstr(info.file_name, "CMAC")) {
                          ^~~~~~~~~
                          file_type
../examples/fips_validation/fips_validation.c:268:26: error: 'struct fips_test_interim_info' has no member named 'file_name'; did you mean 'file_type'?
   } else if (strstr(info.file_name, "CCM")) {
                          ^~~~~~~~~
                          file_type
../examples/fips_validation/fips_validation.c:273:26: error: 'struct fips_test_interim_info' has no member named 'file_name'; did you mean 'file_type'?
   } else if (strstr(info.file_name, "HMAC")) {
                          ^~~~~~~~~
                          file_type
../examples/fips_validation/fips_validation.c:278:26: error: 'struct fips_test_interim_info' has no member named 'file_name'; did you mean 'file_type'?
   } else if (strstr(info.file_name, "TDES")) {
                          ^~~~~~~~~
                          file_type
../examples/fips_validation/fips_validation.c:283:26: error: 'struct fips_test_interim_info' has no member named 'file_name'; did you mean 'file_type'?
   } else if (strstr(info.file_name, "SHA-")) {
                          ^~~~~~~~~
                          file_type
[1326/1413] Linking target examples/dpdk-flow_filtering.
[1327/1413] Compiling C object 'examples/c590b3c@@dpdk-ip_fragmentation at exe/ip_fragmentation_main.c.o'.
[1328/1413] Compiling C object 'examples/c590b3c@@dpdk-fips_validation at exe/fips_validation_fips_validation_gcm.c.o'.
[1329/1413] Linking target examples/dpdk-helloworld.
[1330/1413] Compiling C object 'examples/c590b3c@@dpdk-fips_validation at exe/fips_validation_main.c.o'.
ninja: build stopped: subcommand failed



DPDK STV team


More information about the test-report mailing list