[dpdk-test-report] |FAILURE| pw59487[v7, 04/10] vhost: add two new messages to support a shared buffer

sys_stv at intel.com sys_stv at intel.com
Fri Sep 20 06:49:59 CEST 2019


Test-Label: Intel-compilation
Test-Status: FAILURE
http://dpdk.org/patch/59487

_Compilation issues_

Submitter: Jin Yu <jin.yu at intel.com>
Date: 2019-09-20 12:00:56
Reply_mail: 20190920120102.29828-5-jin.yu at intel.com
DPDK git baseline: Repo:dpdk-next-virtio, CommitID: 51b6ef726114e5e18761fe19ace4bb6b5b4daa7d

Makefile build Summary: 22 Builds Done, 22 Successful, 0 Failures

Meson build Summary: 7 Builds Done, 3 Successful, 4 Failures

               +==============================================+===========+==========+
               |                   Makefile                   |   Meson   | Document |
+--------------+------+-------+------+------------+-----------+-----------+----------+
| os           | gcc  | clang | icc  | gcc+shared | gcc+debug | gcc/clang | pdf/html |
+--------------+------+-------+------+------------+-----------+-----------+----------+
| RHEL76-64    | pass |       |      |            |           |           |          |
| CENTOS76-64  | pass | pass  | pass | pass       | pass      |           |          |
| UB1804-64    | pass | pass  | pass |            |           | FAIL      | pass     |
| UB1604-32    | pass |       |      |            |           | FAIL      |          |
| UB1904-64    | pass |       |      |            |           |           |          |
| UB1604-64    | pass | pass  |      |            |           |           |          |
| FC30-64      | pass | pass  |      |            |           | FAIL      |          |
| WIN10-64     |      |       |      |            |           | pass      |          |
| FreeBSD12-64 | pass | pass  |      | pass       | pass      | pass      |          |
| RHEL80-64    | pass |       |      |            |           |           |          |
| SUSE15-64    | pass | pass  |      |            |           | FAIL      |          |
+--------------+------+-------+------+------------+-----------+-----------+----------+

Test environment and configuration as below:

** Makefile build **


OS: RHEL76-64
	Kernel Version: 3.10.0-957.el7.x86_64
	CPU info: Intel(R) Xeon(R) CPU E5-2699 v4 @ 2.20GHz
	GCC Version: gcc (GCC) 4.8.5 20150623 (Red Hat 4.8.5-36)
	Clang Version: NA
	x86_64-native-linuxapp-gcc


OS: CENTOS76-64
	Kernel Version: 3.10.0-957.10.1.el7.x86_64
	CPU info: Intel(R) Xeon(R) CPU E5-2699 v4 @ 2.20GHz
	GCC Version: gcc (GCC) 4.8.5 20150623 (Red Hat 4.8.5-36)
	Clang Version: 3.4.2 (tags/RELEASE_34/dot2-final)
	x86_64-native-linuxapp-clang
	x86_64-native-linuxapp-gcc+debug
	x86_64-native-linuxapp-gcc
	x86_64-native-linuxapp-gcc+shared
	x86_64-native-linuxapp-icc


OS: UB1804-64
	Kernel Version: 4.15.0-20-generic
	CPU info: Intel(R) Xeon(R) CPU E5-2699 v3 @ 2.30GHz
	GCC Version: gcc (Ubuntu 7.3.0-16ubuntu3) 7.3.0
	Clang Version: 6.0.0-1ubuntu2 (tags/RELEASE_600/final)
	x86_64-native-linuxapp-clang
	x86_64-native-linuxapp-icc
	x86_64-native-linuxapp-gcc


OS: UB1904-64
	Kernel Version: 5.0.0-13-generic
	CPU info: Intel(R) Xeon(R) CPU E5-2699 v3 @ 2.30GHz
	GCC Version: gcc (Ubuntu 8.3.0-6ubuntu1) 8.3.0
	Clang Version: 8.0.0-3 (tags/RELEASE_800/final)
	x86_64-native-linuxapp-gcc


OS: UB1604-32
	Kernel Version: 4.4.0-131-generic
	CPU info: Intel(R) Xeon(R) CPU E5-2699 v3 @ 2.30GHz
	GCC Version: gcc (Ubuntu 5.4.0-6ubuntu1~16.04.11) 5.4.0 20160609
	Clang Version: 3.8.0-2ubuntu4 (tags/RELEASE_380/final)
	i686-native-linuxapp-gcc


OS: UB1604-64
	Kernel Version: 4.4.0-47-generic
	CPU info: Intel(R) Xeon(R) CPU E5-2699 v3 @ 2.30GHz
	GCC Version: gcc (Ubuntu 5.4.0-6ubuntu1~16.04.10) 5.4.0 20160609
	Clang Version: 3.8.0-2ubuntu4 (tags/RELEASE_380/final)
	x86_64-native-linuxapp-clang
	x86_64-native-linuxapp-gcc


OS: FC30-64
	Kernel Version: 5.1.7-300.fc30.x86_64
	CPU info: Intel(R) Xeon(R) CPU E5-2699 v4 @ 2.20GHz
	GCC Version: gcc (GCC) 9.1.1 20190503 (Red Hat 9.1.1-1)
	Clang Version: 8.0.0 (Fedora 8.0.0-1.fc30)
	x86_64-native-linuxapp-gcc
	x86_64-native-linuxapp-clang


OS: FreeBSD12-64
	Kernel Version: 12.0-RC3
	CPU info: Intel(R) Xeon(R) CPU E5-2699 v4 @ 2.20GHz (2194.97-MHz K8-class CPU)
	GCC Version: gcc (FreeBSD Ports Collection) 7.3.0
	Clang Version: 6.0.1 (tags/RELEASE_601/final 335540) (based on LLVM 6.0.1)
	x86_64-native-bsdapp-gcc+debug
	x86_64-native-bsdapp-gcc+shared
	x86_64-native-bsdapp-clang
	x86_64-native-bsdapp-gcc


OS: RHEL80-64
	Kernel Version: 4.18.0-80.el8.x86_64
	CPU info: Intel(R) Xeon(R) CPU E5-2699 v4 @ 2.20GHz
	GCC Version: gcc (GCC) 8.2.1 20180905 (Red Hat 8.2.1-3)
	Clang Version: 6.0.1 (tags/RELEASE_601/final)
	x86_64-native-linuxapp-gcc


OS: SUSE15-64
	Kernel Version: 4.12.14-lp150.11-default
	CPU info: Intel(R) Xeon(R) CPU E5-2699 v4 @ 2.20GHz
	GCC Version: gcc (SUSE Linux) 7.3.1 20180323 [gcc-7-branch revision 258812]
	Clang Version: 5.0.1 (tags/RELEASE_501/final 312548)
	x86_64-native-linuxapp-gcc
	x86_64-native-linuxapp-clang


** Meson build **


OS: UB1804-64
	Kernel Version: 4.15.0-20-generic
	CPU info: Intel(R) Xeon(R) CPU E5-2699 v4 @ 2.20GHz
	GCC Version: gcc (Ubuntu 7.3.0-27ubuntu1~18.04) 7.3.0
	Clang Version: 6.0.0-1ubuntu2 (tags/RELEASE_600/final)
	x86_64-native-linuxapp-doc
	build-gcc-static
	build-gcc-shared
	build-clang-static
	build-clang-shared
	build-x86-default


OS: UB1604-32
	Kernel Version: 4.4.0-131-generic
	CPU info: Intel(R) Xeon(R) CPU E5-2699 v4 @ 2.20GHz
	GCC Version: gcc (Ubuntu 5.4.0-6ubuntu1~16.04.11) 5.4.0 20160609
	Clang Version: 3.8.0-2ubuntu4 (tags/RELEASE_380/final)
	build-gcc-static
	build-gcc-shared
	build-clang-static
	build-clang-shared
	build-x86-default


OS: FC30-64
	Kernel Version: 5.0.9-301.fc30.x86_64
	CPU info: Intel(R) Xeon(R) CPU E5-2699 v4 @ 2.20GHz
	GCC Version: gcc (GCC) 9.1.1 20190503 (Red Hat 9.1.1-1)
	Clang Version: 8.0.0 (Fedora 8.0.0-1.fc30)
	build-gcc-static
	build-gcc-shared
	build-clang-static
	build-clang-shared
	build-x86-default


OS: WIN10-64
	Kernel Version: N/A
	CPU info: N/A
	GCC Version: N/A
	Clang Version: Clang 8.0.0
	x86_64-windows-clang


OS: FreeBSD12-64
	Kernel Version: 12.0-RC3
	CPU info: Intel(R) Xeon(R) CPU E5-2699 v4 @ 2.20GHz (2194.99-MHz K8-class CPU)
	GCC Version: gcc (FreeBSD Ports Collection) 7.3.0
	Clang Version: 6.0.1 (tags/RELEASE_601/final 335540) (based on LLVM 6.0.1)
	build-gcc-static
	build-gcc-shared
	build-clang-static
	build-clang-shared
	build-x86-default


OS: SUSE15-64
	Kernel Version: 4.12.14-lp150.11-default
	CPU info: Intel(R) Xeon(R) CPU E5-2699 v4 @ 2.20GHz
	GCC Version: gcc (SUSE Linux) 7.3.1 20180323 [gcc-7-branch revision 258812]
	Clang Version: 5.0.1 (tags/RELEASE_501/final 312548)
	build-gcc-static
	build-gcc-shared
	build-clang-static
	build-clang-shared
	build-x86-default


*Meson Build Failed #1:
OS: UB1604-32
Target:build-gcc-static
FAILED: examples/c590b3c@@dpdk-vhost_scsi at exe/vhost_scsi_vhost_scsi.c.o 
gcc -Iexamples/c590b3c@@dpdk-vhost_scsi at exe -Iexamples -I../examples -Iexamples/vhost_scsi -I../examples/vhost_scsi -I. -I../ -Iconfig -I../config -Ilib/librte_eal/common/include -I../lib/librte_eal/common/include -I../lib/librte_eal/linux/eal/include -Ilib/librte_eal/common -I../lib/librte_eal/common -Ilib/librte_eal/common/include/arch/x86 -I../lib/librte_eal/common/include/arch/x86 -Ilib/librte_eal -I../lib/librte_eal -Ilib/librte_kvargs -I../lib/librte_kvargs -Ilib/librte_mempool -I../lib/librte_mempool -Ilib/librte_ring -I../lib/librte_ring -Ilib/librte_net -I../lib/librte_net -Ilib/librte_mbuf -I../lib/librte_mbuf -Ilib/librte_ethdev -I../lib/librte_ethdev -Ilib/librte_meter -I../lib/librte_meter -Ilib/librte_cmdline -I../lib/librte_cmdline -Ilib/librte_vhost -I../lib/librte_vhost -Ilib/librte_cryptodev -I../lib/librte_cryptodev -Ilib/librte_hash -I../lib/librte_hash -Ilib/librte_pci -I../lib/librte_pci -fdiagnostics-color=always -pipe -D_FILE_OFFSET_BITS=64 -Wall -Winvalid-pch -Werror -O3 -include rte_config.h -Wunused-parameter -Wsign-compare -Wcast-qual -Wno-pointer-to-int-cast -D_GNU_SOURCE -march=native -MD -MQ 'examples/c590b3c@@dpdk-vhost_scsi at exe/vhost_scsi_vhost_scsi.c.o' -MF 'examples/c590b3c@@dpdk-vhost_scsi at exe/vhost_scsi_vhost_scsi.c.o.d' -o 'examples/c590b3c@@dpdk-vhost_scsi at exe/vhost_scsi_vhost_scsi.c.o' -c ../examples/vhost_scsi/vhost_scsi.c
../examples/vhost_scsi/vhost_scsi.c: In function ‘gpa_to_vva’:
../examples/vhost_scsi/vhost_scsi.c:61:2: error: ‘rte_vhost_va_from_guest_pa’ is deprecated: Symbol is not yet part of stable ABI [-Werror=deprecated-declarations]
  return rte_vhost_va_from_guest_pa(ctrlr->mem, gpa, len);
  ^
In file included from ../examples/vhost_scsi/vhost_scsi.c:18:0:
../lib/librte_vhost/rte_vhost.h:314:1: note: declared here
 rte_vhost_va_from_guest_pa(struct rte_vhost_memory *mem,
 ^
cc1: all warnings being treated as errors
[1641/1656] Linking target examples/dpdk-tep_termination.
[1642/1656] Compiling C object 'examples/c590b3c@@dpdk-vhost at exe/vhost_virtio_net.c.o'.
[1643/1656] Compiling C object 'examples/c590b3c@@dpdk-vhost_crypto at exe/vhost_crypto_main.c.o'.
[1644/1656] Compiling C object 'examples/c590b3c@@dpdk-vhost_scsi at exe/vhost_scsi_scsi.c.o'.
[1645/1656] Compiling C object 'examples/c590b3c@@dpdk-vhost at exe/vhost_main.c.o'.
ninja: build stopped: subcommand failed




*Meson Build Failed #2:
OS: SUSE15-64
Target:build-gcc-static
FAILED: examples/c590b3c@@dpdk-vhost_scsi at exe/vhost_scsi_vhost_scsi.c.o 
gcc -Iexamples/c590b3c@@dpdk-vhost_scsi at exe -Iexamples -I../examples -Iexamples/vhost_scsi -I../examples/vhost_scsi -I. -I../ -Iconfig -I../config -Ilib/librte_eal/common/include -I../lib/librte_eal/common/include -I../lib/librte_eal/linux/eal/include -Ilib/librte_eal/common -I../lib/librte_eal/common -Ilib/librte_eal/common/include/arch/x86 -I../lib/librte_eal/common/include/arch/x86 -Ilib/librte_eal -I../lib/librte_eal -Ilib/librte_kvargs -I../lib/librte_kvargs -Ilib/librte_mempool -I../lib/librte_mempool -Ilib/librte_ring -I../lib/librte_ring -Ilib/librte_net -I../lib/librte_net -Ilib/librte_mbuf -I../lib/librte_mbuf -Ilib/librte_ethdev -I../lib/librte_ethdev -Ilib/librte_meter -I../lib/librte_meter -Ilib/librte_cmdline -I../lib/librte_cmdline -Ilib/librte_vhost -I../lib/librte_vhost -Ilib/librte_cryptodev -I../lib/librte_cryptodev -Ilib/librte_hash -I../lib/librte_hash -Ilib/librte_pci -I../lib/librte_pci -fdiagnostics-color=always -pipe -D_FILE_OFFSET_BITS=64 -Wall -Winvalid-pch -Werror -O3 -include rte_config.h -Wunused-parameter -Wsign-compare -Wcast-qual -D_GNU_SOURCE -march=native -Wno-format-truncation -MD -MQ 'examples/c590b3c@@dpdk-vhost_scsi at exe/vhost_scsi_vhost_scsi.c.o' -MF 'examples/c590b3c@@dpdk-vhost_scsi at exe/vhost_scsi_vhost_scsi.c.o.d' -o 'examples/c590b3c@@dpdk-vhost_scsi at exe/vhost_scsi_vhost_scsi.c.o' -c ../examples/vhost_scsi/vhost_scsi.c
../examples/vhost_scsi/vhost_scsi.c: In function ‘gpa_to_vva’:
../examples/vhost_scsi/vhost_scsi.c:61:2: error: ‘rte_vhost_va_from_guest_pa’ is deprecated: Symbol is not yet part of stable ABI [-Werror=deprecated-declarations]
  return rte_vhost_va_from_guest_pa(ctrlr->mem, gpa, len);
  ^~~~~~
In file included from ../examples/vhost_scsi/vhost_scsi.c:18:0:
../lib/librte_vhost/rte_vhost.h:314:1: note: declared here
 rte_vhost_va_from_guest_pa(struct rte_vhost_memory *mem,
 ^~~~~~~~~~~~~~~~~~~~~~~~~~
cc1: all warnings being treated as errors
[1821/1831] Compiling C object 'examples/c590b3c@@dpdk-tep_termination at exe/tep_termination_main.c.o'.
[1822/1831] Linking target examples/dpdk-skeleton.
[1823/1831] Linking target examples/dpdk-packet_ordering.
[1824/1831] Compiling C object 'examples/c590b3c@@dpdk-vhost_crypto at exe/vhost_crypto_main.c.o'.
[1825/1831] Linking target examples/dpdk-vdpa.
[1826/1831] Compiling C object 'examples/c590b3c@@dpdk-vhost at exe/vhost_main.c.o'.
[1827/1831] Generating igb_uio with a custom command.
make: Entering directory '/usr/src/linux-4.12.14-lp150.12.48-obj/x86_64/default'
  CC [M]  /tmp/SUSE15-64_K4.12.14_GCC7.3.1/x86_64-native-linuxapp-gcc/0988927b74f448959308863e0124e1ef/dpdk/build-gcc-static/kernel/linux/igb_uio/igb_uio.o
  Building modules, stage 2.
  MODPOST 1 modules
  CC      /tmp/SUSE15-64_K4.12.14_GCC7.3.1/x86_64-native-linuxapp-gcc/0988927b74f448959308863e0124e1ef/dpdk/build-gcc-static/kernel/linux/igb_uio/igb_uio.mod.o
  LD [M]  /tmp/SUSE15-64_K4.12.14_GCC7.3.1/x86_64-native-linuxapp-gcc/0988927b74f448959308863e0124e1ef/dpdk/build-gcc-static/kernel/linux/igb_uio/igb_uio.ko
make: Leaving directory '/usr/src/linux-4.12.14-lp150.12.48-obj/x86_64/default'
ninja: build stopped: subcommand failed




*Meson Build Failed #3:
OS: FC30-64
Target:build-gcc-static
FAILED: examples/c590b3c@@dpdk-vhost_scsi at exe/vhost_scsi_vhost_scsi.c.o 
gcc -Iexamples/c590b3c@@dpdk-vhost_scsi at exe -Iexamples -I../examples -Iexamples/vhost_scsi -I../examples/vhost_scsi -I. -I../ -Iconfig -I../config -Ilib/librte_eal/common/include -I../lib/librte_eal/common/include -I../lib/librte_eal/linux/eal/include -Ilib/librte_eal/common -I../lib/librte_eal/common -Ilib/librte_eal/common/include/arch/x86 -I../lib/librte_eal/common/include/arch/x86 -Ilib/librte_eal -I../lib/librte_eal -Ilib/librte_kvargs -I../lib/librte_kvargs -Ilib/librte_mempool -I../lib/librte_mempool -Ilib/librte_ring -I../lib/librte_ring -Ilib/librte_net -I../lib/librte_net -Ilib/librte_mbuf -I../lib/librte_mbuf -Ilib/librte_ethdev -I../lib/librte_ethdev -Ilib/librte_meter -I../lib/librte_meter -Ilib/librte_cmdline -I../lib/librte_cmdline -Ilib/librte_vhost -I../lib/librte_vhost -Ilib/librte_cryptodev -I../lib/librte_cryptodev -Ilib/librte_hash -I../lib/librte_hash -Ilib/librte_pci -I../lib/librte_pci -fdiagnostics-color=always -pipe -D_FILE_OFFSET_BITS=64 -Wall -Winvalid-pch -Werror -O3 -include rte_config.h -Wunused-parameter -Wsign-compare -Wcast-qual -Wno-address-of-packed-member -D_GNU_SOURCE -march=native -mno-avx512f -Wno-format-truncation -MD -MQ 'examples/c590b3c@@dpdk-vhost_scsi at exe/vhost_scsi_vhost_scsi.c.o' -MF 'examples/c590b3c@@dpdk-vhost_scsi at exe/vhost_scsi_vhost_scsi.c.o.d' -o 'examples/c590b3c@@dpdk-vhost_scsi at exe/vhost_scsi_vhost_scsi.c.o' -c ../examples/vhost_scsi/vhost_scsi.c
../examples/vhost_scsi/vhost_scsi.c: In function ‘gpa_to_vva’:
../examples/vhost_scsi/vhost_scsi.c:61:2: error: ‘rte_vhost_va_from_guest_pa’ is deprecated: Symbol is not yet part of stable ABI [-Werror=deprecated-declarations]
   61 |  return rte_vhost_va_from_guest_pa(ctrlr->mem, gpa, len);
      |  ^~~~~~
In file included from ../examples/vhost_scsi/vhost_scsi.c:18:
../lib/librte_vhost/rte_vhost.h:314:1: note: declared here
  314 | rte_vhost_va_from_guest_pa(struct rte_vhost_memory *mem,
      | ^~~~~~~~~~~~~~~~~~~~~~~~~~
cc1: all warnings being treated as errors
[1758/1784] Linking target examples/dpdk-service_cores.
[1759/1784] Linking target examples/dpdk-qos_meter.
[1760/1784] Compiling C object 'examples/c590b3c@@dpdk-tep_termination at exe/tep_termination_vxlan_setup.c.o'.
[1761/1784] Compiling C object 'examples/c590b3c@@dpdk-skeleton at exe/skeleton_basicfwd.c.o'.
[1762/1784] Linking target examples/dpdk-qos_sched.
[1763/1784] Linking target examples/dpdk-rxtx_callbacks.
[1764/1784] Compiling C object 'examples/c590b3c@@dpdk-vhost at exe/vhost_virtio_net.c.o'.
ninja: build stopped: subcommand failed




*Meson Build Failed #4:
OS: UB1804-64
Target:build-gcc-static
FAILED: examples/c590b3c@@dpdk-vhost_scsi at exe/vhost_scsi_vhost_scsi.c.o 
gcc -Iexamples/c590b3c@@dpdk-vhost_scsi at exe -Iexamples -I../examples -Iexamples/vhost_scsi -I../examples/vhost_scsi -I. -I../ -Iconfig -I../config -Ilib/librte_eal/common/include -I../lib/librte_eal/common/include -I../lib/librte_eal/linux/eal/include -Ilib/librte_eal/common -I../lib/librte_eal/common -Ilib/librte_eal/common/include/arch/x86 -I../lib/librte_eal/common/include/arch/x86 -Ilib/librte_eal -I../lib/librte_eal -Ilib/librte_kvargs -I../lib/librte_kvargs -Ilib/librte_mempool -I../lib/librte_mempool -Ilib/librte_ring -I../lib/librte_ring -Ilib/librte_net -I../lib/librte_net -Ilib/librte_mbuf -I../lib/librte_mbuf -Ilib/librte_ethdev -I../lib/librte_ethdev -Ilib/librte_meter -I../lib/librte_meter -Ilib/librte_cmdline -I../lib/librte_cmdline -Ilib/librte_vhost -I../lib/librte_vhost -Ilib/librte_cryptodev -I../lib/librte_cryptodev -Ilib/librte_hash -I../lib/librte_hash -Ilib/librte_pci -I../lib/librte_pci -fdiagnostics-color=always -pipe -D_FILE_OFFSET_BITS=64 -Wall -Winvalid-pch -Werror -O3 -include rte_config.h -Wunused-parameter -Wsign-compare -Wcast-qual -D_GNU_SOURCE -march=native -mno-avx512f -Wno-format-truncation -MD -MQ 'examples/c590b3c@@dpdk-vhost_scsi at exe/vhost_scsi_vhost_scsi.c.o' -MF 'examples/c590b3c@@dpdk-vhost_scsi at exe/vhost_scsi_vhost_scsi.c.o.d' -o 'examples/c590b3c@@dpdk-vhost_scsi at exe/vhost_scsi_vhost_scsi.c.o' -c ../examples/vhost_scsi/vhost_scsi.c
../examples/vhost_scsi/vhost_scsi.c: In function ‘gpa_to_vva’:
../examples/vhost_scsi/vhost_scsi.c:61:2: error: ‘rte_vhost_va_from_guest_pa’ is deprecated: Symbol is not yet part of stable ABI [-Werror=deprecated-declarations]
  return rte_vhost_va_from_guest_pa(ctrlr->mem, gpa, len);
  ^~~~~~
In file included from ../examples/vhost_scsi/vhost_scsi.c:18:0:
../lib/librte_vhost/rte_vhost.h:314:1: note: declared here
 rte_vhost_va_from_guest_pa(struct rte_vhost_memory *mem,
 ^~~~~~~~~~~~~~~~~~~~~~~~~~
cc1: all warnings being treated as errors
[1773/1791] Linking target examples/dpdk-skeleton.
[1774/1791] Compiling C object 'examples/c590b3c@@dpdk-vhost_crypto at exe/vhost_crypto_main.c.o'.
[1775/1791] Compiling C object 'examples/c590b3c@@dpdk-tep_termination at exe/tep_termination_main.c.o'.
[1776/1791] Compiling C object 'examples/c590b3c@@dpdk-vhost at exe/vhost_virtio_net.c.o'.
[1777/1791] Compiling C object 'examples/c590b3c@@dpdk-vhost at exe/vhost_main.c.o'.
ninja: build stopped: subcommand failed



DPDK STV team


More information about the test-report mailing list