[dpdk-test-report] |FAILURE| pw59506[v2, 09/22] net/hns3: add support for link_update operation

sys_stv at intel.com sys_stv at intel.com
Fri Sep 20 16:28:35 CEST 2019


Test-Label: Intel-compilation
Test-Status: FAILURE
http://dpdk.org/patch/59506

_Compilation issues_

Submitter: Wei Hu (Xavier) <xavier.huwei at huawei.com>
Date: 2019-09-20 13:25:42
Reply_mail: 1568985955-13548-10-git-send-email-xavier.huwei at huawei.com
DPDK git baseline: Repo:dpdk, CommitID: bd253daa7717835f88bbc58b09a94d0060380396

Makefile build Summary: 22 Builds Done, 22 Successful, 0 Failures

Meson build Summary: 7 Builds Done, 4 Successful, 3 Failures

               +==============================================+===========+==========+
               |                   Makefile                   |   Meson   | Document |
+--------------+------+-------+------+------------+-----------+-----------+----------+
| os           | gcc  | clang | icc  | gcc+shared | gcc+debug | gcc/clang | pdf/html |
+--------------+------+-------+------+------------+-----------+-----------+----------+
| RHEL76-64    | pass |       |      |            |           |           |          |
| CENTOS76-64  | pass | pass  | pass | pass       | pass      |           |          |
| UB1804-64    | pass | pass  | pass |            |           | FAIL      | pass     |
| UB1604-32    | pass |       |      |            |           | pass      |          |
| UB1904-64    | pass |       |      |            |           |           |          |
| UB1604-64    | pass | pass  |      |            |           |           |          |
| FC30-64      | pass | pass  |      |            |           | FAIL      |          |
| WIN10-64     |      |       |      |            |           | pass      |          |
| FreeBSD12-64 | pass | pass  |      | pass       | pass      | pass      |          |
| RHEL80-64    | pass |       |      |            |           |           |          |
| SUSE15-64    | pass | pass  |      |            |           | FAIL      |          |
+--------------+------+-------+------+------------+-----------+-----------+----------+

Test environment and configuration as below:

** Makefile build **


OS: RHEL76-64
	Kernel Version: 3.10.0-957.el7.x86_64
	CPU info: Intel(R) Xeon(R) CPU E5-2699 v4 @ 2.20GHz
	GCC Version: gcc (GCC) 4.8.5 20150623 (Red Hat 4.8.5-36)
	Clang Version: NA
	x86_64-native-linuxapp-gcc


OS: CENTOS76-64
	Kernel Version: 3.10.0-957.10.1.el7.x86_64
	CPU info: Intel(R) Xeon(R) CPU E5-2699 v4 @ 2.20GHz
	GCC Version: gcc (GCC) 4.8.5 20150623 (Red Hat 4.8.5-36)
	Clang Version: 3.4.2 (tags/RELEASE_34/dot2-final)
	x86_64-native-linuxapp-clang
	x86_64-native-linuxapp-gcc+debug
	x86_64-native-linuxapp-gcc
	x86_64-native-linuxapp-gcc+shared
	x86_64-native-linuxapp-icc


OS: UB1804-64
	Kernel Version: 4.15.0-20-generic
	CPU info: Intel(R) Xeon(R) CPU E5-2699 v3 @ 2.30GHz
	GCC Version: gcc (Ubuntu 7.3.0-16ubuntu3) 7.3.0
	Clang Version: 6.0.0-1ubuntu2 (tags/RELEASE_600/final)
	x86_64-native-linuxapp-clang
	x86_64-native-linuxapp-icc
	x86_64-native-linuxapp-gcc


OS: UB1904-64
	Kernel Version: 5.0.0-13-generic
	CPU info: Intel(R) Xeon(R) CPU E5-2699 v3 @ 2.30GHz
	GCC Version: gcc (Ubuntu 8.3.0-6ubuntu1) 8.3.0
	Clang Version: 8.0.0-3 (tags/RELEASE_800/final)
	x86_64-native-linuxapp-gcc


OS: UB1604-32
	Kernel Version: 4.4.0-131-generic
	CPU info: Intel(R) Xeon(R) CPU E5-2699 v3 @ 2.30GHz
	GCC Version: gcc (Ubuntu 5.4.0-6ubuntu1~16.04.11) 5.4.0 20160609
	Clang Version: 3.8.0-2ubuntu4 (tags/RELEASE_380/final)
	i686-native-linuxapp-gcc


OS: UB1604-64
	Kernel Version: 4.4.0-47-generic
	CPU info: Intel(R) Xeon(R) CPU E5-2699 v3 @ 2.30GHz
	GCC Version: gcc (Ubuntu 5.4.0-6ubuntu1~16.04.10) 5.4.0 20160609
	Clang Version: 3.8.0-2ubuntu4 (tags/RELEASE_380/final)
	x86_64-native-linuxapp-clang
	x86_64-native-linuxapp-gcc


OS: FC30-64
	Kernel Version: 5.1.7-300.fc30.x86_64
	CPU info: Intel(R) Xeon(R) CPU E5-2699 v4 @ 2.20GHz
	GCC Version: gcc (GCC) 9.1.1 20190503 (Red Hat 9.1.1-1)
	Clang Version: 8.0.0 (Fedora 8.0.0-1.fc30)
	x86_64-native-linuxapp-gcc
	x86_64-native-linuxapp-clang


OS: FreeBSD12-64
	Kernel Version: 12.0-RC3
	CPU info: Intel(R) Xeon(R) CPU E5-2699 v4 @ 2.20GHz (2194.97-MHz K8-class CPU)
	GCC Version: gcc (FreeBSD Ports Collection) 7.3.0
	Clang Version: 6.0.1 (tags/RELEASE_601/final 335540) (based on LLVM 6.0.1)
	x86_64-native-bsdapp-gcc+debug
	x86_64-native-bsdapp-gcc+shared
	x86_64-native-bsdapp-clang
	x86_64-native-bsdapp-gcc


OS: RHEL80-64
	Kernel Version: 4.18.0-80.el8.x86_64
	CPU info: Intel(R) Xeon(R) CPU E5-2699 v4 @ 2.20GHz
	GCC Version: gcc (GCC) 8.2.1 20180905 (Red Hat 8.2.1-3)
	Clang Version: 6.0.1 (tags/RELEASE_601/final)
	x86_64-native-linuxapp-gcc


OS: SUSE15-64
	Kernel Version: 4.12.14-lp150.11-default
	CPU info: Intel(R) Xeon(R) CPU E5-2699 v4 @ 2.20GHz
	GCC Version: gcc (SUSE Linux) 7.3.1 20180323 [gcc-7-branch revision 258812]
	Clang Version: 5.0.1 (tags/RELEASE_501/final 312548)
	x86_64-native-linuxapp-gcc
	x86_64-native-linuxapp-clang


** Meson build **


OS: UB1804-64
	Kernel Version: 4.15.0-20-generic
	CPU info: Intel(R) Xeon(R) CPU E5-2699 v4 @ 2.20GHz
	GCC Version: gcc (Ubuntu 7.3.0-27ubuntu1~18.04) 7.3.0
	Clang Version: 6.0.0-1ubuntu2 (tags/RELEASE_600/final)
	x86_64-native-linuxapp-doc
	build-gcc-static
	build-gcc-shared
	build-clang-static
	build-clang-shared
	build-x86-default


OS: UB1604-32
	Kernel Version: 4.4.0-131-generic
	CPU info: Intel(R) Xeon(R) CPU E5-2699 v4 @ 2.20GHz
	GCC Version: gcc (Ubuntu 5.4.0-6ubuntu1~16.04.11) 5.4.0 20160609
	Clang Version: 3.8.0-2ubuntu4 (tags/RELEASE_380/final)
	build-gcc-static
	build-gcc-shared
	build-clang-static
	build-clang-shared
	build-x86-default


OS: FC30-64
	Kernel Version: 5.0.9-301.fc30.x86_64
	CPU info: Intel(R) Xeon(R) CPU E5-2699 v4 @ 2.20GHz
	GCC Version: gcc (GCC) 9.1.1 20190503 (Red Hat 9.1.1-1)
	Clang Version: 8.0.0 (Fedora 8.0.0-1.fc30)
	build-gcc-static
	build-gcc-shared
	build-clang-static
	build-clang-shared
	build-x86-default


OS: WIN10-64
	Kernel Version: N/A
	CPU info: N/A
	GCC Version: N/A
	Clang Version: Clang 8.0.0
	x86_64-windows-clang


OS: FreeBSD12-64
	Kernel Version: 12.0-RC3
	CPU info: Intel(R) Xeon(R) CPU E5-2699 v4 @ 2.20GHz (2194.99-MHz K8-class CPU)
	GCC Version: gcc (FreeBSD Ports Collection) 7.3.0
	Clang Version: 6.0.1 (tags/RELEASE_601/final 335540) (based on LLVM 6.0.1)
	build-gcc-static
	build-gcc-shared
	build-clang-static
	build-clang-shared
	build-x86-default


OS: SUSE15-64
	Kernel Version: 4.12.14-lp150.11-default
	CPU info: Intel(R) Xeon(R) CPU E5-2699 v4 @ 2.20GHz
	GCC Version: gcc (SUSE Linux) 7.3.1 20180323 [gcc-7-branch revision 258812]
	Clang Version: 5.0.1 (tags/RELEASE_501/final 312548)
	build-gcc-static
	build-gcc-shared
	build-clang-static
	build-clang-shared
	build-x86-default


*Meson Build Failed #1:
OS: FC30-64
Target:build-gcc-static
FAILED: drivers/a715181@@tmp_rte_pmd_hns3 at sta/net_hns3_hns3_ethdev_vf.c.o 
gcc -Idrivers/a715181@@tmp_rte_pmd_hns3 at sta -Idrivers -I../drivers -Idrivers/net/hns3 -I../drivers/net/hns3 -Ilib/librte_ethdev -I../lib/librte_ethdev -I. -I../ -Iconfig -I../config -Ilib/librte_eal/common/include -I../lib/librte_eal/common/include -I../lib/librte_eal/linux/eal/include -Ilib/librte_eal/common -I../lib/librte_eal/common -Ilib/librte_eal/common/include/arch/x86 -I../lib/librte_eal/common/include/arch/x86 -Ilib/librte_eal -I../lib/librte_eal -Ilib/librte_kvargs -I../lib/librte_kvargs -Ilib/librte_net -I../lib/librte_net -Ilib/librte_mbuf -I../lib/librte_mbuf -Ilib/librte_mempool -I../lib/librte_mempool -Ilib/librte_ring -I../lib/librte_ring -Ilib/librte_meter -I../lib/librte_meter -Idrivers/bus/pci -I../drivers/bus/pci -I../drivers/bus/pci/linux -Ilib/librte_pci -I../lib/librte_pci -Idrivers/bus/vdev -I../drivers/bus/vdev -Ilib/librte_hash -I../lib/librte_hash -fdiagnostics-color=always -pipe -D_FILE_OFFSET_BITS=64 -Wall -Winvalid-pch -Werror -O3 -include rte_config.h -Wunused-parameter -Wsign-compare -Wcast-qual -Wno-address-of-packed-member -D_GNU_SOURCE -fPIC -march=native -mno-avx512f -Wno-format-truncation -DALLOW_EXPERIMENTAL_API -MD -MQ 'drivers/a715181@@tmp_rte_pmd_hns3 at sta/net_hns3_hns3_ethdev_vf.c.o' -MF 'drivers/a715181@@tmp_rte_pmd_hns3 at sta/net_hns3_hns3_ethdev_vf.c.o.d' -o 'drivers/a715181@@tmp_rte_pmd_hns3 at sta/net_hns3_hns3_ethdev_vf.c.o' -c ../drivers/net/hns3/hns3_ethdev_vf.c
../drivers/net/hns3/hns3_ethdev_vf.c:1552:24: error: initialization of ‘void (*)(struct rte_eth_dev *, struct rte_eth_dev_info *)’ from incompatible pointer type ‘int (*)(struct rte_eth_dev *, struct rte_eth_dev_info *)’ [-Werror=incompatible-pointer-types]
 1552 |  .dev_infos_get      = hns3vf_dev_infos_get,
      |                        ^~~~~~~~~~~~~~~~~~~~
../drivers/net/hns3/hns3_ethdev_vf.c:1552:24: note: (near initialization for ‘hns3vf_eth_dev_ops.dev_infos_get’)
cc1: all warnings being treated as errors
[822/1803] Compiling C object 'drivers/a715181@@tmp_rte_pmd_hns3 at sta/net_hns3_hns3_ethdev.c.o'.
FAILED: drivers/a715181@@tmp_rte_pmd_hns3 at sta/net_hns3_hns3_ethdev.c.o 
gcc -Idrivers/a715181@@tmp_rte_pmd_hns3 at sta -Idrivers -I../drivers -Idrivers/net/hns3 -I../drivers/net/hns3 -Ilib/librte_ethdev -I../lib/librte_ethdev -I. -I../ -Iconfig -I../config -Ilib/librte_eal/common/include -I../lib/librte_eal/common/include -I../lib/librte_eal/linux/eal/include -Ilib/librte_eal/common -I../lib/librte_eal/common -Ilib/librte_eal/common/include/arch/x86 -I../lib/librte_eal/common/include/arch/x86 -Ilib/librte_eal -I../lib/librte_eal -Ilib/librte_kvargs -I../lib/librte_kvargs -Ilib/librte_net -I../lib/librte_net -Ilib/librte_mbuf -I../lib/librte_mbuf -Ilib/librte_mempool -I../lib/librte_mempool -Ilib/librte_ring -I../lib/librte_ring -Ilib/librte_meter -I../lib/librte_meter -Idrivers/bus/pci -I../drivers/bus/pci -I../drivers/bus/pci/linux -Ilib/librte_pci -I../lib/librte_pci -Idrivers/bus/vdev -I../drivers/bus/vdev -Ilib/librte_hash -I../lib/librte_hash -fdiagnostics-color=always -pipe -D_FILE_OFFSET_BITS=64 -Wall -Winvalid-pch -Werror -O3 -include rte_config.h -Wunused-parameter -Wsign-compare -Wcast-qual -Wno-address-of-packed-member -D_GNU_SOURCE -fPIC -march=native -mno-avx512f -Wno-format-truncation -DALLOW_EXPERIMENTAL_API -MD -MQ 'drivers/a715181@@tmp_rte_pmd_hns3 at sta/net_hns3_hns3_ethdev.c.o' -MF 'drivers/a715181@@tmp_rte_pmd_hns3 at sta/net_hns3_hns3_ethdev.c.o.d' -o 'drivers/a715181@@tmp_rte_pmd_hns3 at sta/net_hns3_hns3_ethdev.c.o' -c ../drivers/net/hns3/hns3_ethdev.c
../drivers/net/hns3/hns3_ethdev.c:4727:28: error: initialization of ‘void (*)(struct rte_eth_dev *, struct rte_eth_dev_info *)’ from incompatible pointer type ‘int (*)(struct rte_eth_dev *, struct rte_eth_dev_info *)’ [-Werror=incompatible-pointer-types]
 4727 |  .dev_infos_get          = hns3_dev_infos_get,
      |                            ^~~~~~~~~~~~~~~~~~
../drivers/net/hns3/hns3_ethdev.c:4727:28: note: (near initialization for ‘hns3_eth_dev_ops.dev_infos_get’)
cc1: all warnings being treated as errors
[823/1803] Compiling C object 'drivers/a715181@@tmp_rte_pmd_hns3 at sta/net_hns3_hns3_rss.c.o'.
[824/1803] Compiling C object 'drivers/a715181@@tmp_rte_pmd_hns3 at sta/net_hns3_hns3_regs.c.o'.
[825/1803] Compiling C object 'drivers/a715181@@tmp_rte_pmd_hns3 at sta/net_hns3_hns3_mbx.c.o'.
[826/1803] Compiling C object 'drivers/a715181@@tmp_rte_pmd_hns3 at sta/net_hns3_hns3_stats.c.o'.
[827/1803] Compiling C object 'drivers/a715181@@tmp_rte_pmd_hns3 at sta/net_hns3_hns3_flow.c.o'.
[828/1803] Compiling C object 'drivers/a715181@@tmp_rte_pmd_hns3 at sta/net_hns3_hns3_rxtx.c.o'.
ninja: build stopped: subcommand failed




*Meson Build Failed #2:
OS: SUSE15-64
Target:build-gcc-static
FAILED: drivers/a715181@@tmp_rte_pmd_hns3 at sta/net_hns3_hns3_ethdev.c.o 
gcc -Idrivers/a715181@@tmp_rte_pmd_hns3 at sta -Idrivers -I../drivers -Idrivers/net/hns3 -I../drivers/net/hns3 -Ilib/librte_ethdev -I../lib/librte_ethdev -I. -I../ -Iconfig -I../config -Ilib/librte_eal/common/include -I../lib/librte_eal/common/include -I../lib/librte_eal/linux/eal/include -Ilib/librte_eal/common -I../lib/librte_eal/common -Ilib/librte_eal/common/include/arch/x86 -I../lib/librte_eal/common/include/arch/x86 -Ilib/librte_eal -I../lib/librte_eal -Ilib/librte_kvargs -I../lib/librte_kvargs -Ilib/librte_net -I../lib/librte_net -Ilib/librte_mbuf -I../lib/librte_mbuf -Ilib/librte_mempool -I../lib/librte_mempool -Ilib/librte_ring -I../lib/librte_ring -Ilib/librte_meter -I../lib/librte_meter -Idrivers/bus/pci -I../drivers/bus/pci -I../drivers/bus/pci/linux -Ilib/librte_pci -I../lib/librte_pci -Idrivers/bus/vdev -I../drivers/bus/vdev -Ilib/librte_hash -I../lib/librte_hash -fdiagnostics-color=always -pipe -D_FILE_OFFSET_BITS=64 -Wall -Winvalid-pch -Werror -O3 -include rte_config.h -Wunused-parameter -Wsign-compare -Wcast-qual -D_GNU_SOURCE -fPIC -march=native -Wno-format-truncation -DALLOW_EXPERIMENTAL_API -MD -MQ 'drivers/a715181@@tmp_rte_pmd_hns3 at sta/net_hns3_hns3_ethdev.c.o' -MF 'drivers/a715181@@tmp_rte_pmd_hns3 at sta/net_hns3_hns3_ethdev.c.o.d' -o 'drivers/a715181@@tmp_rte_pmd_hns3 at sta/net_hns3_hns3_ethdev.c.o' -c ../drivers/net/hns3/hns3_ethdev.c
../drivers/net/hns3/hns3_ethdev.c:4727:28: error: initialization from incompatible pointer type [-Werror=incompatible-pointer-types]
  .dev_infos_get          = hns3_dev_infos_get,
                            ^~~~~~~~~~~~~~~~~~
../drivers/net/hns3/hns3_ethdev.c:4727:28: note: (near initialization for ‘hns3_eth_dev_ops.dev_infos_get’)
cc1: all warnings being treated as errors
[830/1850] Compiling C object 'drivers/a715181@@tmp_rte_pmd_hns3 at sta/net_hns3_hns3_flow.c.o'.
[831/1850] Compiling C object 'drivers/a715181@@tmp_rte_pmd_hinic at sta/net_hinic_hinic_pmd_tx.c.o'.
[832/1850] Compiling C object 'drivers/a715181@@tmp_rte_pmd_hns3 at sta/net_hns3_hns3_ethdev_vf.c.o'.
FAILED: drivers/a715181@@tmp_rte_pmd_hns3 at sta/net_hns3_hns3_ethdev_vf.c.o 
gcc -Idrivers/a715181@@tmp_rte_pmd_hns3 at sta -Idrivers -I../drivers -Idrivers/net/hns3 -I../drivers/net/hns3 -Ilib/librte_ethdev -I../lib/librte_ethdev -I. -I../ -Iconfig -I../config -Ilib/librte_eal/common/include -I../lib/librte_eal/common/include -I../lib/librte_eal/linux/eal/include -Ilib/librte_eal/common -I../lib/librte_eal/common -Ilib/librte_eal/common/include/arch/x86 -I../lib/librte_eal/common/include/arch/x86 -Ilib/librte_eal -I../lib/librte_eal -Ilib/librte_kvargs -I../lib/librte_kvargs -Ilib/librte_net -I../lib/librte_net -Ilib/librte_mbuf -I../lib/librte_mbuf -Ilib/librte_mempool -I../lib/librte_mempool -Ilib/librte_ring -I../lib/librte_ring -Ilib/librte_meter -I../lib/librte_meter -Idrivers/bus/pci -I../drivers/bus/pci -I../drivers/bus/pci/linux -Ilib/librte_pci -I../lib/librte_pci -Idrivers/bus/vdev -I../drivers/bus/vdev -Ilib/librte_hash -I../lib/librte_hash -fdiagnostics-color=always -pipe -D_FILE_OFFSET_BITS=64 -Wall -Winvalid-pch -Werror -O3 -include rte_config.h -Wunused-parameter -Wsign-compare -Wcast-qual -D_GNU_SOURCE -fPIC -march=native -Wno-format-truncation -DALLOW_EXPERIMENTAL_API -MD -MQ 'drivers/a715181@@tmp_rte_pmd_hns3 at sta/net_hns3_hns3_ethdev_vf.c.o' -MF 'drivers/a715181@@tmp_rte_pmd_hns3 at sta/net_hns3_hns3_ethdev_vf.c.o.d' -o 'drivers/a715181@@tmp_rte_pmd_hns3 at sta/net_hns3_hns3_ethdev_vf.c.o' -c ../drivers/net/hns3/hns3_ethdev_vf.c
../drivers/net/hns3/hns3_ethdev_vf.c:1552:24: error: initialization from incompatible pointer type [-Werror=incompatible-pointer-types]
  .dev_infos_get      = hns3vf_dev_infos_get,
                        ^~~~~~~~~~~~~~~~~~~~
../drivers/net/hns3/hns3_ethdev_vf.c:1552:24: note: (near initialization for ‘hns3vf_eth_dev_ops.dev_infos_get’)
cc1: all warnings being treated as errors
[833/1850] Compiling C object 'drivers/a715181@@tmp_rte_pmd_hns3 at sta/net_hns3_hns3_mp.c.o'.
[834/1850] Compiling C object 'drivers/a715181@@tmp_rte_pmd_hns3 at sta/net_hns3_hns3_stats.c.o'.
[835/1850] Compiling C object 'drivers/a715181@@tmp_rte_pmd_hns3 at sta/net_hns3_hns3_dcb.c.o'.
[836/1850] Compiling C object 'drivers/a715181@@tmp_rte_pmd_hns3 at sta/net_hns3_hns3_rxtx.c.o'.
ninja: build stopped: subcommand failed




*Meson Build Failed #3:
OS: UB1804-64
Target:build-gcc-static
FAILED: drivers/a715181@@tmp_rte_pmd_hns3 at sta/net_hns3_hns3_ethdev_vf.c.o 
gcc -Idrivers/a715181@@tmp_rte_pmd_hns3 at sta -Idrivers -I../drivers -Idrivers/net/hns3 -I../drivers/net/hns3 -Ilib/librte_ethdev -I../lib/librte_ethdev -I. -I../ -Iconfig -I../config -Ilib/librte_eal/common/include -I../lib/librte_eal/common/include -I../lib/librte_eal/linux/eal/include -Ilib/librte_eal/common -I../lib/librte_eal/common -Ilib/librte_eal/common/include/arch/x86 -I../lib/librte_eal/common/include/arch/x86 -Ilib/librte_eal -I../lib/librte_eal -Ilib/librte_kvargs -I../lib/librte_kvargs -Ilib/librte_net -I../lib/librte_net -Ilib/librte_mbuf -I../lib/librte_mbuf -Ilib/librte_mempool -I../lib/librte_mempool -Ilib/librte_ring -I../lib/librte_ring -Ilib/librte_meter -I../lib/librte_meter -Idrivers/bus/pci -I../drivers/bus/pci -I../drivers/bus/pci/linux -Ilib/librte_pci -I../lib/librte_pci -Idrivers/bus/vdev -I../drivers/bus/vdev -Ilib/librte_hash -I../lib/librte_hash -fdiagnostics-color=always -pipe -D_FILE_OFFSET_BITS=64 -Wall -Winvalid-pch -Werror -O3 -include rte_config.h -Wunused-parameter -Wsign-compare -Wcast-qual -D_GNU_SOURCE -fPIC -march=native -mno-avx512f -Wno-format-truncation -DALLOW_EXPERIMENTAL_API -MD -MQ 'drivers/a715181@@tmp_rte_pmd_hns3 at sta/net_hns3_hns3_ethdev_vf.c.o' -MF 'drivers/a715181@@tmp_rte_pmd_hns3 at sta/net_hns3_hns3_ethdev_vf.c.o.d' -o 'drivers/a715181@@tmp_rte_pmd_hns3 at sta/net_hns3_hns3_ethdev_vf.c.o' -c ../drivers/net/hns3/hns3_ethdev_vf.c
../drivers/net/hns3/hns3_ethdev_vf.c:1552:24: error: initialization from incompatible pointer type [-Werror=incompatible-pointer-types]
  .dev_infos_get      = hns3vf_dev_infos_get,
                        ^~~~~~~~~~~~~~~~~~~~
../drivers/net/hns3/hns3_ethdev_vf.c:1552:24: note: (near initialization for ‘hns3vf_eth_dev_ops.dev_infos_get’)
cc1: all warnings being treated as errors
[836/1810] Compiling C object 'drivers/a715181@@tmp_rte_pmd_hns3 at sta/net_hns3_hns3_mbx.c.o'.
[837/1810] Compiling C object 'drivers/a715181@@tmp_rte_pmd_hns3 at sta/net_hns3_hns3_regs.c.o'.
[838/1810] Compiling C object 'drivers/a715181@@tmp_rte_pmd_hns3 at sta/net_hns3_hns3_ethdev.c.o'.
FAILED: drivers/a715181@@tmp_rte_pmd_hns3 at sta/net_hns3_hns3_ethdev.c.o 
gcc -Idrivers/a715181@@tmp_rte_pmd_hns3 at sta -Idrivers -I../drivers -Idrivers/net/hns3 -I../drivers/net/hns3 -Ilib/librte_ethdev -I../lib/librte_ethdev -I. -I../ -Iconfig -I../config -Ilib/librte_eal/common/include -I../lib/librte_eal/common/include -I../lib/librte_eal/linux/eal/include -Ilib/librte_eal/common -I../lib/librte_eal/common -Ilib/librte_eal/common/include/arch/x86 -I../lib/librte_eal/common/include/arch/x86 -Ilib/librte_eal -I../lib/librte_eal -Ilib/librte_kvargs -I../lib/librte_kvargs -Ilib/librte_net -I../lib/librte_net -Ilib/librte_mbuf -I../lib/librte_mbuf -Ilib/librte_mempool -I../lib/librte_mempool -Ilib/librte_ring -I../lib/librte_ring -Ilib/librte_meter -I../lib/librte_meter -Idrivers/bus/pci -I../drivers/bus/pci -I../drivers/bus/pci/linux -Ilib/librte_pci -I../lib/librte_pci -Idrivers/bus/vdev -I../drivers/bus/vdev -Ilib/librte_hash -I../lib/librte_hash -fdiagnostics-color=always -pipe -D_FILE_OFFSET_BITS=64 -Wall -Winvalid-pch -Werror -O3 -include rte_config.h -Wunused-parameter -Wsign-compare -Wcast-qual -D_GNU_SOURCE -fPIC -march=native -mno-avx512f -Wno-format-truncation -DALLOW_EXPERIMENTAL_API -MD -MQ 'drivers/a715181@@tmp_rte_pmd_hns3 at sta/net_hns3_hns3_ethdev.c.o' -MF 'drivers/a715181@@tmp_rte_pmd_hns3 at sta/net_hns3_hns3_ethdev.c.o.d' -o 'drivers/a715181@@tmp_rte_pmd_hns3 at sta/net_hns3_hns3_ethdev.c.o' -c ../drivers/net/hns3/hns3_ethdev.c
../drivers/net/hns3/hns3_ethdev.c:4727:28: error: initialization from incompatible pointer type [-Werror=incompatible-pointer-types]
  .dev_infos_get          = hns3_dev_infos_get,
                            ^~~~~~~~~~~~~~~~~~
../drivers/net/hns3/hns3_ethdev.c:4727:28: note: (near initialization for ‘hns3_eth_dev_ops.dev_infos_get’)
cc1: all warnings being treated as errors
[839/1810] Compiling C object 'drivers/a715181@@tmp_rte_pmd_hns3 at sta/net_hns3_hns3_rss.c.o'.
[840/1810] Compiling C object 'drivers/a715181@@tmp_rte_pmd_hns3 at sta/net_hns3_hns3_rxtx.c.o'.
ninja: build stopped: subcommand failed



DPDK STV team


More information about the test-report mailing list