[dpdk-test-report] |FAILURE| pw59328vhost: translate incoming log address to gpa

sys_stv at intel.com sys_stv at intel.com
Mon Sep 23 04:49:19 CEST 2019


Test-Label: Intel-compilation
Test-Status: FAILURE
http://dpdk.org/patch/59328

_Compilation issues_

Submitter: Adrian Moreno <amorenoz at redhat.com>
Date: 2019-09-17 14:49:00
Reply_mail: 20190917144900.14407-1-amorenoz at redhat.com
DPDK git baseline: Repo:dpdk-next-virtio, CommitID: 51b6ef726114e5e18761fe19ace4bb6b5b4daa7d

Makefile build Summary: 22 Builds Done, 22 Successful, 0 Failures

Meson build Summary: 7 Builds Done, 3 Successful, 4 Failures

               +==============================================+===========+==========+
               |                   Makefile                   |   Meson   | Document |
+--------------+------+-------+------+------------+-----------+-----------+----------+
| os           | gcc  | clang | icc  | gcc+shared | gcc+debug | gcc/clang | pdf/html |
+--------------+------+-------+------+------------+-----------+-----------+----------+
| RHEL76-64    | pass |       |      |            |           |           |          |
| CENTOS76-64  | pass | pass  | pass | pass       | pass      |           |          |
| UB1804-64    | pass | pass  | pass |            |           | FAIL      | pass     |
| UB1604-32    | pass |       |      |            |           | FAIL      |          |
| UB1904-64    | pass |       |      |            |           |           |          |
| UB1604-64    | pass | pass  |      |            |           |           |          |
| FC30-64      | pass | pass  |      |            |           | FAIL      |          |
| WIN10-64     |      |       |      |            |           | pass      |          |
| FreeBSD12-64 | pass | pass  |      | pass       | pass      | pass      |          |
| RHEL80-64    | pass |       |      |            |           |           |          |
| SUSE15-64    | pass | pass  |      |            |           | FAIL      |          |
+--------------+------+-------+------+------------+-----------+-----------+----------+

Test environment and configuration as below:

** Makefile build **


OS: RHEL76-64
	Kernel Version: 3.10.0-957.el7.x86_64
	CPU info: Intel(R) Xeon(R) CPU E5-2699 v4 @ 2.20GHz
	GCC Version: gcc (GCC) 4.8.5 20150623 (Red Hat 4.8.5-36)
	Clang Version: NA
	x86_64-native-linuxapp-gcc


OS: CENTOS76-64
	Kernel Version: 3.10.0-957.10.1.el7.x86_64
	CPU info: Intel(R) Xeon(R) CPU E5-2699 v4 @ 2.20GHz
	GCC Version: gcc (GCC) 4.8.5 20150623 (Red Hat 4.8.5-36)
	Clang Version: 3.4.2 (tags/RELEASE_34/dot2-final)
	x86_64-native-linuxapp-clang
	x86_64-native-linuxapp-gcc+debug
	x86_64-native-linuxapp-gcc
	x86_64-native-linuxapp-gcc+shared
	x86_64-native-linuxapp-icc


OS: UB1804-64
	Kernel Version: 4.15.0-20-generic
	CPU info: Intel(R) Xeon(R) CPU E5-2699 v3 @ 2.30GHz
	GCC Version: gcc (Ubuntu 7.3.0-16ubuntu3) 7.3.0
	Clang Version: 6.0.0-1ubuntu2 (tags/RELEASE_600/final)
	x86_64-native-linuxapp-clang
	x86_64-native-linuxapp-icc
	x86_64-native-linuxapp-gcc


OS: UB1904-64
	Kernel Version: 5.0.0-13-generic
	CPU info: Intel(R) Xeon(R) CPU E5-2699 v3 @ 2.30GHz
	GCC Version: gcc (Ubuntu 8.3.0-6ubuntu1) 8.3.0
	Clang Version: 8.0.0-3 (tags/RELEASE_800/final)
	x86_64-native-linuxapp-gcc


OS: UB1604-32
	Kernel Version: 4.4.0-131-generic
	CPU info: Intel(R) Xeon(R) CPU E5-2699 v3 @ 2.30GHz
	GCC Version: gcc (Ubuntu 5.4.0-6ubuntu1~16.04.11) 5.4.0 20160609
	Clang Version: 3.8.0-2ubuntu4 (tags/RELEASE_380/final)
	i686-native-linuxapp-gcc


OS: UB1604-64
	Kernel Version: 4.4.0-47-generic
	CPU info: Intel(R) Xeon(R) CPU E5-2699 v3 @ 2.30GHz
	GCC Version: gcc (Ubuntu 5.4.0-6ubuntu1~16.04.10) 5.4.0 20160609
	Clang Version: 3.8.0-2ubuntu4 (tags/RELEASE_380/final)
	x86_64-native-linuxapp-clang
	x86_64-native-linuxapp-gcc


OS: FC30-64
	Kernel Version: 5.1.7-300.fc30.x86_64
	CPU info: Intel(R) Xeon(R) CPU E5-2699 v4 @ 2.20GHz
	GCC Version: gcc (GCC) 9.1.1 20190503 (Red Hat 9.1.1-1)
	Clang Version: 8.0.0 (Fedora 8.0.0-1.fc30)
	x86_64-native-linuxapp-gcc
	x86_64-native-linuxapp-clang


OS: FreeBSD12-64
	Kernel Version: 12.0-RC3
	CPU info: Intel(R) Xeon(R) CPU E5-2699 v4 @ 2.20GHz (2194.97-MHz K8-class CPU)
	GCC Version: gcc (FreeBSD Ports Collection) 7.3.0
	Clang Version: 6.0.1 (tags/RELEASE_601/final 335540) (based on LLVM 6.0.1)
	x86_64-native-bsdapp-gcc+debug
	x86_64-native-bsdapp-gcc+shared
	x86_64-native-bsdapp-clang
	x86_64-native-bsdapp-gcc


OS: RHEL80-64
	Kernel Version: 4.18.0-80.el8.x86_64
	CPU info: Intel(R) Xeon(R) CPU E5-2699 v4 @ 2.20GHz
	GCC Version: gcc (GCC) 8.2.1 20180905 (Red Hat 8.2.1-3)
	Clang Version: 6.0.1 (tags/RELEASE_601/final)
	x86_64-native-linuxapp-gcc


OS: SUSE15-64
	Kernel Version: 4.12.14-lp150.11-default
	CPU info: Intel(R) Xeon(R) CPU E5-2699 v4 @ 2.20GHz
	GCC Version: gcc (SUSE Linux) 7.3.1 20180323 [gcc-7-branch revision 258812]
	Clang Version: 5.0.1 (tags/RELEASE_501/final 312548)
	x86_64-native-linuxapp-gcc
	x86_64-native-linuxapp-clang


** Meson build **


OS: UB1804-64
	Kernel Version: 4.15.0-20-generic
	CPU info: Intel(R) Xeon(R) CPU E5-2699 v4 @ 2.20GHz
	GCC Version: gcc (Ubuntu 7.3.0-27ubuntu1~18.04) 7.3.0
	Clang Version: 6.0.0-1ubuntu2 (tags/RELEASE_600/final)
	x86_64-native-linuxapp-doc
	build-gcc-static
	build-gcc-shared
	build-clang-static
	build-clang-shared
	build-x86-default


OS: UB1604-32
	Kernel Version: 4.4.0-131-generic
	CPU info: Intel(R) Xeon(R) CPU E5-2699 v4 @ 2.20GHz
	GCC Version: gcc (Ubuntu 5.4.0-6ubuntu1~16.04.11) 5.4.0 20160609
	Clang Version: 3.8.0-2ubuntu4 (tags/RELEASE_380/final)
	build-gcc-static
	build-gcc-shared
	build-clang-static
	build-clang-shared
	build-x86-default


OS: FC30-64
	Kernel Version: 5.0.9-301.fc30.x86_64
	CPU info: Intel(R) Xeon(R) CPU E5-2699 v4 @ 2.20GHz
	GCC Version: gcc (GCC) 9.1.1 20190503 (Red Hat 9.1.1-1)
	Clang Version: 8.0.0 (Fedora 8.0.0-1.fc30)
	build-gcc-static
	build-gcc-shared
	build-clang-static
	build-clang-shared
	build-x86-default


OS: WIN10-64
	Kernel Version: N/A
	CPU info: N/A
	GCC Version: N/A
	Clang Version: Clang 8.0.0
	x86_64-windows-clang


OS: FreeBSD12-64
	Kernel Version: 12.0-RC3
	CPU info: Intel(R) Xeon(R) CPU E5-2699 v4 @ 2.20GHz (2194.99-MHz K8-class CPU)
	GCC Version: gcc (FreeBSD Ports Collection) 7.3.0
	Clang Version: 6.0.1 (tags/RELEASE_601/final 335540) (based on LLVM 6.0.1)
	build-gcc-static
	build-gcc-shared
	build-clang-static
	build-clang-shared
	build-x86-default


OS: SUSE15-64
	Kernel Version: 4.12.14-lp150.11-default
	CPU info: Intel(R) Xeon(R) CPU E5-2699 v4 @ 2.20GHz
	GCC Version: gcc (SUSE Linux) 7.3.1 20180323 [gcc-7-branch revision 258812]
	Clang Version: 5.0.1 (tags/RELEASE_501/final 312548)
	build-gcc-static
	build-gcc-shared
	build-clang-static
	build-clang-shared
	build-x86-default


*Meson Build Failed #1:
OS: UB1604-32
Target:build-gcc-static
FAILED: lib/76b5a35@@rte_vhost at sta/librte_vhost_vhost_user.c.o 
gcc -Ilib/76b5a35@@rte_vhost at sta -Ilib -I../lib -Ilib/librte_vhost -I../lib/librte_vhost -I. -I../ -Iconfig -I../config -Ilib/librte_eal/common/include -I../lib/librte_eal/common/include -I../lib/librte_eal/linux/eal/include -Ilib/librte_eal/common -I../lib/librte_eal/common -Ilib/librte_eal/common/include/arch/x86 -I../lib/librte_eal/common/include/arch/x86 -Ilib/librte_eal -I../lib/librte_eal -Ilib/librte_kvargs -I../lib/librte_kvargs -Ilib/librte_ethdev -I../lib/librte_ethdev -Ilib/librte_net -I../lib/librte_net -Ilib/librte_mbuf -I../lib/librte_mbuf -Ilib/librte_mempool -I../lib/librte_mempool -Ilib/librte_ring -I../lib/librte_ring -Ilib/librte_meter -I../lib/librte_meter -Ilib/librte_cryptodev -I../lib/librte_cryptodev -Ilib/librte_hash -I../lib/librte_hash -Ilib/librte_pci -I../lib/librte_pci -fdiagnostics-color=always -pipe -D_FILE_OFFSET_BITS=64 -Wall -Winvalid-pch -Werror -O3 -include rte_config.h -Wunused-parameter -Wsign-compare -Wcast-qual -Wno-pointer-to-int-cast -D_GNU_SOURCE -fPIC -march=native -fno-strict-aliasing -DALLOW_EXPERIMENTAL_API -MD -MQ 'lib/76b5a35@@rte_vhost at sta/librte_vhost_vhost_user.c.o' -MF 'lib/76b5a35@@rte_vhost at sta/librte_vhost_vhost_user.c.o.d' -o 'lib/76b5a35@@rte_vhost at sta/librte_vhost_vhost_user.c.o' -c ../lib/librte_vhost/vhost_user.c
In file included from ../lib/librte_eal/common/include/rte_bus.h:24:0,
                 from ../lib/librte_eal/common/include/rte_eal.h:21,
                 from ../lib/librte_eal/common/include/rte_lcore.h:16,
                 from ../lib/librte_eal/common/include/generic/rte_spinlock.h:21,
                 from ../lib/librte_eal/common/include/arch/x86/rte_spinlock.h:12,
                 from ../lib/librte_eal/common/include/arch/x86/rte_rwlock.h:13,
                 from ../lib/librte_eal/common/include/rte_fbarray.h:40,
                 from ../lib/librte_eal/common/include/rte_memory.h:25,
                 from ../lib/librte_eal/common/include/rte_malloc.h:17,
                 from ../lib/librte_vhost/vhost_user.c:42:
../lib/librte_vhost/vhost_user.c: In function ‘translate_log_addr’:
../lib/librte_vhost/vhost_user.c:632:18: error: format ‘%lx’ expects argument of type ‘long unsigned int’, but argument 4 has type ‘uint64_t {aka long long unsigned int}’ [-Werror=format=]
     log_addr, vva);
                  ^
../lib/librte_eal/common/include/rte_log.h:324:25: note: in definition of macro ‘RTE_LOG’
    RTE_LOGTYPE_ ## t, # t ": " __VA_ARGS__)
                         ^
../lib/librte_vhost/vhost_user.c:632:18: error: format ‘%lx’ expects argument of type ‘long unsigned int’, but argument 5 has type ‘uint64_t {aka long long unsigned int}’ [-Werror=format=]
     log_addr, vva);
                  ^
../lib/librte_eal/common/include/rte_log.h:324:25: note: in definition of macro ‘RTE_LOG’
    RTE_LOGTYPE_ ## t, # t ": " __VA_ARGS__)
                         ^
cc1: all warnings being treated as errors
[307/1656] Compiling C object 'lib/76b5a35@@rte_ipsec at sta/librte_ipsec_esp_outb.c.o'.
[308/1656] Compiling C object 'lib/76b5a35@@rte_ipsec at sta/librte_ipsec_ses.c.o'.
[309/1656] Compiling C object 'lib/76b5a35@@rte_ipsec at sta/librte_ipsec_esp_inb.c.o'.
[310/1656] Compiling C object 'lib/76b5a35@@rte_vhost at sta/librte_vhost_vhost_crypto.c.o'.
[311/1656] Compiling C object 'lib/76b5a35@@rte_vhost at sta/librte_vhost_virtio_net.c.o'.
ninja: build stopped: subcommand failed




*Meson Build Failed #2:
OS: SUSE15-64
Target:build-gcc-static
FAILED: examples/c590b3c@@dpdk-vhost_scsi at exe/vhost_scsi_vhost_scsi.c.o 
gcc -Iexamples/c590b3c@@dpdk-vhost_scsi at exe -Iexamples -I../examples -Iexamples/vhost_scsi -I../examples/vhost_scsi -I. -I../ -Iconfig -I../config -Ilib/librte_eal/common/include -I../lib/librte_eal/common/include -I../lib/librte_eal/linux/eal/include -Ilib/librte_eal/common -I../lib/librte_eal/common -Ilib/librte_eal/common/include/arch/x86 -I../lib/librte_eal/common/include/arch/x86 -Ilib/librte_eal -I../lib/librte_eal -Ilib/librte_kvargs -I../lib/librte_kvargs -Ilib/librte_mempool -I../lib/librte_mempool -Ilib/librte_ring -I../lib/librte_ring -Ilib/librte_net -I../lib/librte_net -Ilib/librte_mbuf -I../lib/librte_mbuf -Ilib/librte_ethdev -I../lib/librte_ethdev -Ilib/librte_meter -I../lib/librte_meter -Ilib/librte_cmdline -I../lib/librte_cmdline -Ilib/librte_vhost -I../lib/librte_vhost -Ilib/librte_cryptodev -I../lib/librte_cryptodev -Ilib/librte_hash -I../lib/librte_hash -Ilib/librte_pci -I../lib/librte_pci -fdiagnostics-color=always -pipe -D_FILE_OFFSET_BITS=64 -Wall -Winvalid-pch -Werror -O3 -include rte_config.h -Wunused-parameter -Wsign-compare -Wcast-qual -D_GNU_SOURCE -march=native -Wno-format-truncation -MD -MQ 'examples/c590b3c@@dpdk-vhost_scsi at exe/vhost_scsi_vhost_scsi.c.o' -MF 'examples/c590b3c@@dpdk-vhost_scsi at exe/vhost_scsi_vhost_scsi.c.o.d' -o 'examples/c590b3c@@dpdk-vhost_scsi at exe/vhost_scsi_vhost_scsi.c.o' -c ../examples/vhost_scsi/vhost_scsi.c
../examples/vhost_scsi/vhost_scsi.c: In function ‘gpa_to_vva’:
../examples/vhost_scsi/vhost_scsi.c:61:2: error: ‘rte_vhost_va_from_guest_pa’ is deprecated: Symbol is not yet part of stable ABI [-Werror=deprecated-declarations]
  return rte_vhost_va_from_guest_pa(ctrlr->mem, gpa, len);
  ^~~~~~
In file included from ../examples/vhost_scsi/vhost_scsi.c:18:0:
../lib/librte_vhost/rte_vhost.h:238:1: note: declared here
 rte_vhost_va_from_guest_pa(struct rte_vhost_memory *mem,
 ^~~~~~~~~~~~~~~~~~~~~~~~~~
cc1: all warnings being treated as errors
[815/822] Linking target examples/dpdk-vdpa.
[816/822] Compiling C object 'examples/c590b3c@@dpdk-vhost at exe/vhost_virtio_net.c.o'.
[817/822] Compiling C object 'examples/c590b3c@@dpdk-vhost_crypto at exe/vhost_crypto_main.c.o'.
[818/822] Compiling C object 'examples/c590b3c@@dpdk-vhost at exe/vhost_main.c.o'.
[819/822] Linking target examples/dpdk-tep_termination.
ninja: build stopped: subcommand failed.
ninja -C build-gcc-shared
ninja: Entering directory `build-gcc-shared'
[0/1] Regenerating build files.
The Meson build system
Version: 0.50.1
Source dir: /tmp/SUSE15-64_K4.12.14_GCC7.3.1/x86_64-native-linuxapp-gcc/f54e1db45cd243e78997de60e0477310/dpdk
Build dir: /tmp/SUSE15-64_K4.12.14_GCC7.3.1/x86_64-native-linuxapp-gcc/f54e1db45cd243e78997de60e0477310/dpdk/build-gcc-shared
Build type: native build
Program cat found: YES (/usr/bin/cat)
Project name: DPDK
Project version: 19.11.0-rc0
Native C compiler: gcc (gcc 7.3.1 "gcc (SUSE Linux) 7.3.1 20180323 [gcc-7-branch revision 258812]")
Build machine cpu family: x86_64
Build machine cpu: x86_64
Program ../buildtools/symlink-drivers-solibs.sh found: YES (/bin/sh /tmp/SUSE15-64_K4.12.14_GCC7.3.1/x86_64-native-linuxapp-gcc/f54e1db45cd243e78997de60e0477310/dpdk/config/../buildtools/symlink-drivers-solibs.sh)
Checking for size of "void *" : 8
Library libm found: YES
Library numa found: YES
Has header "numaif.h" : YES
Found pkg-config: /usr/bin/pkg-config (0.29.2)
Did not find CMake 'cmake'
Found CMake: NO
Dependency libbsd found: NO (tried pkgconfig and cmake)
Compiler for C supports arguments -Wunused-parameter: YES
Compiler for C supports arguments -Wsign-compare: YES
Compiler for C supports arguments -Wcast-qual: YES
Compiler for C supports arguments -Wno-address-of-packed-member -Waddress-of-packed-member: NO
Fetching value of define "__SSE4_2__" : 1
Fetching value of define "__AES__" : 1
Fetching value of define "__PCLMUL__" : 1
Fetching value of define "__AVX__" : 1
Fetching value of define "__AVX2__" : 1
Fetching value of define "__AVX512F__" : 
Fetching value of define "__RDRND__" : 1
Fetching value of define "__RDSEED__" : 1
Program gen-pmdinfo-cfile.sh found: YES (/tmp/SUSE15-64_K4.12.14_GCC7.3.1/x86_64-native-linuxapp-gcc/f54e1db45cd243e78997de60e0477310/dpdk/buildtools/gen-pmdinfo-cfile.sh)
Using meson's python ['/usr/bin/python3']
Compiler for C supports arguments -Wno-format-truncation -Wformat-truncation: YES
Checking for function "getentropy" : YES
Has header "linux/userfaultfd.h" : YES
Dependency libelf found: YES (cached)
Dependency jansson found: NO (tried pkgconfig and cmake)
Compiler for C supports arguments -Wno-format-truncation -Wformat-truncation: YES
Library libmusdk found: NO
Compiler for C supports arguments -Wno-cast-qual -Wcast-qual: YES
Dependency libbpf found: NO (tried pkgconfig and cmake)
Library bpf found: NO
Dependency zlib found: YES (cached)
Compiler for C supports arguments -Wno-uninitialized -Wuninitialized: YES
Compiler for C supports arguments -Wno-unused-parameter -Wunused-parameter: YES
Compiler for C supports arguments -Wno-unused-variable -Wunused-variable: YES
Compiler for C supports arguments -Wno-misleading-indentation -Wmisleading-indentation: YES
Compiler for C supports arguments -Wno-implicit-fallthrough -Wimplicit-fallthrough: YES
Compiler for C supports arguments -Wno-unused-parameter -Wunused-parameter: YES
Compiler for C supports arguments -Wno-unused-value -Wunused-value: YES
Compiler for C supports arguments -Wno-strict-aliasing -Wstrict-aliasing: YES
Compiler for C supports arguments -Wno-format-extra-args -Wformat-extra-args: YES
Compiler for C supports arguments -Wno-unused-variable -Wunused-variable: YES
Compiler for C supports arguments -Wno-missing-field-initializers -Wmissing-field-initializers: YES
Compiler for C supports arguments -Wno-sign-compare -Wsign-compare: YES
Compiler for C supports arguments -Wno-unused-value -Wunused-value: YES
Compiler for C supports arguments -Wno-format -Wformat: YES
Compiler for C supports arguments -Wno-error=format-security -Werror=format-security: NO
Compiler for C supports arguments -Wno-strict-aliasing -Wstrict-aliasing: YES
Compiler for C supports arguments -Wno-unused-but-set-variable -Wunused-but-set-variable: YES
Compiler for C supports arguments -Wno-unused-parameter -Wunused-parameter: YES
Compiler for C supports arguments -Wno-pointer-to-int-cast -Wpointer-to-int-cast: YES
Compiler for C supports arguments -Wno-unused-value -Wunused-value: YES
Compiler for C supports arguments -Wno-unused-but-set-variable -Wunused-but-set-variable: YES
Compiler for C supports arguments -Wno-unused-variable -Wunused-variable: YES
Compiler for C supports arguments -Wno-unused-parameter -Wunused-parameter: YES
Compiler for C supports arguments -Wno-unused-value -Wunused-value: YES
Compiler for C supports arguments -Wno-unused-but-set-variable -Wunused-but-set-variable: YES
Compiler for C supports arguments -Wno-unused-parameter -Wunused-parameter: YES
Dependency libmnl found: NO (tried pkgconfig and cmake)
Library mnl found: NO
Dependency libmlx4 found: NO (tried pkgconfig and cmake)
Library mlx4 found: NO
Dependency libibverbs found: NO (tried pkgconfig and cmake)
Library ibverbs found: NO
Dependency libmlx5 found: NO (tried pkgconfig and cmake)
Library mlx5 found: NO
Dependency libibverbs found: NO (tried pkgconfig and cmake)
Library ibverbs found: NO
Library libmusdk found: NO
Library libmusdk found: NO
Library nfb found: NO
Dependency netcope-common found: NO (tried pkgconfig and cmake)
Dependency pcap found: YES (cached)
Compiler for C supports arguments -Wno-strict-aliasing -Wstrict-aliasing: YES
Compiler for C supports arguments -Wextra: YES
Compiler for C supports arguments -Wdisabled-optimization: YES
Compiler for C supports arguments -Waggregate-return: YES
Compiler for C supports arguments -Wnested-externs: YES
Compiler for C supports arguments -Wbad-function-cast: YES
Compiler for C supports arguments -Wno-sign-compare -Wsign-compare: YES
Compiler for C supports arguments -Wno-unused-parameter -Wunused-parameter: YES
Compiler for C supports arguments -Wno-unused-variable -Wunused-variable: YES
Compiler for C supports arguments -Wno-empty-body -Wempty-body: YES
Compiler for C supports arguments -Wno-unused-but-set-variable -Wunused-but-set-variable: YES
Library sze2 found: NO
Header <linux/pkt_cls.h> has symbol "TCA_FLOWER_UNSPEC" : YES
Header <linux/pkt_cls.h> has symbol "TCA_FLOWER_KEY_VLAN_PRIO" : YES
Header <linux/pkt_cls.h> has symbol "TCA_BPF_UNSPEC" : YES
Header <linux/pkt_cls.h> has symbol "TCA_BPF_FD" : YES
Header <linux/tc_act/tc_bpf.h> has symbol "TCA_ACT_BPF_UNSPEC" : YES
Header <linux/tc_act/tc_bpf.h> has symbol "TCA_ACT_BPF_FD" : YES
Configuring tap_autoconf.h using configuration
Compiler for C supports arguments -fno-prefetch-loop-arrays: YES
Compiler for C supports arguments -Wno-maybe-uninitialized -Wmaybe-uninitialized: YES
Compiler for C supports arguments -Wall: YES
Compiler for C supports arguments -Wextra: YES
Compiler for C supports arguments -D_BSD_SOURCE: YES
Compiler for C supports arguments -D_DEFAULT_SOURCE: YES
Compiler for C supports arguments -D_XOPEN_SOURCE=600: YES
Compiler for C supports arguments -Wno-unused-parameter -Wunused-parameter: YES
Compiler for C supports arguments -Wno-unused-value -Wunused-value: YES
Compiler for C supports arguments -Wno-strict-aliasing -Wstrict-aliasing: YES
Compiler for C supports arguments -Wno-format-extra-args -Wformat-extra-args: YES
Library IPSec_MB found: YES
Fetching value of define "IMB_VERSION_STR" : "0.52.0"
Library IPSec_MB found: YES
Fetching value of define "IMB_VERSION_STR" : "0.52.0"
Dependency libcrypto found: YES (cached)
Library sso_kasumi found: NO
Library libmusdk found: NO
Dependency libcrypto found: YES (cached)
Dependency libcrypto found: YES (cached)
Library sso_snow3g found: NO
Library sso_zuc found: NO
Dependency libisal found: NO (tried pkgconfig and cmake)
Dependency zlib found: YES (cached)
Compiler for C supports arguments -Wno-sign-compare -Wsign-compare: YES
Compiler for C supports arguments -Wno-unused-value -Wunused-value: YES
Compiler for C supports arguments -Wno-format -Wformat: YES
Compiler for C supports arguments -Wno-error=format-security -Werror=format-security: NO
Compiler for C supports arguments -Wno-strict-aliasing -Wstrict-aliasing: YES
Compiler for C supports arguments -Wno-unused-but-set-variable -Wunused-but-set-variable: YES
Dependency libfdt found: NO (tried pkgconfig and cmake)
Library execinfo found: NO
Compiler for C supports arguments -Wno-format-truncation -Wformat-truncation: YES
Dependency zlib found: YES (cached)
Library execinfo found: NO
Program doxygen found: NO
Program sphinx-build found: NO
Library execinfo found: NO
Compiler for C supports arguments -Wno-format-truncation -Wformat-truncation: YES
Message: Skipping example "bpf"
Message: Skipping example "ethtool"
Has header "sys/epoll.h" : YES
Library pqos found: NO
Message: Skipping example "l2fwd-cat"
Library rt found: YES
Message: Skipping example "netmap_compat"
Message: Skipping example "performance-thread"
Message: Skipping example "quota_watermark"
Message: Skipping example "server_node_efd"
Has header "linux/virtio_scsi.h" : YES
Library virt found: NO
Dependency jansson found: NO (tried pkgconfig and cmake)
Message: Skipping example "vm_power_manager"
WARNING: Project targetting '>= 0.47.1' but tried to use feature introduced in '0.48.0': console arg in custom_target
Configuring rte_build_config.h using configuration
Message: 
=================
Libraries Enabled
=================

libs:
	kvargs, eal, ring, mempool, mbuf, net, meter, ethdev, 
	pci, cmdline, metrics, hash, timer, acl, bbdev, bitratestats, 
	cfgfile, compressdev, cryptodev, distributor, efd, eventdev, gro, gso, 
	ip_frag, jobstats, kni, latencystats, lpm, member, power, pdump, 
	rawdev, rcu, reorder, sched, security, stack, vhost, ipsec, 
	port, table, pipeline, flow_classify, bpf, 

Message: 
===============
Drivers Enabled
===============

common:
	cpt, dpaax, octeontx, octeontx2, 
bus:
	dpaa, fslmc, ifpga, pci, vdev, vmbus, 
mempool:
	bucket, dpaa, dpaa2, octeontx, octeontx2, ring, stack, 
net:
	af_packet, ark, atlantic, avp, axgbe, bond, bnx2x, bnxt, 
	cxgbe, dpaa, dpaa2, e1000, ena, enetc, enic, failsafe, 
	fm10k, i40e, hinic, iavf, ice, ifc, ipn3ke, ixgbe, 
	kni, liquidio, memif, netvsc, nfp, null, octeontx, octeontx2, 
	pcap, ring, sfc, softnic, tap, thunderx, vdev_netvsc, vhost, 
	virtio, vmxnet3, 
crypto:
	aesni_gcm, aesni_mb, caam_jr, ccp, dpaa_sec, dpaa2_sec, null_crypto, octeontx_crypto, 
	openssl, crypto_scheduler, virtio_crypto, 
compress:
	octeontx_compress, qat, zlib, 
event:
	dpaa, dpaa2, octeontx2, opdl, skeleton, sw, dsw, octeontx, 
	
baseband:
	bbdev_null, bbdev_turbo_sw, bbdev_fpga_lte_fec, 
raw:
	dpaa2_cmdif, dpaa2_qdma, ioat, ntb, octeontx2_dma, skeleton, 

Message: 
=================
Content Skipped
=================

libs:
	telemetry:	missing dependency "jansson"
	
drivers:
	common/mvep:	missing dependency, "libmusdk"
	net/af_xdp:	missing dependency, "libbpf"
	net/mlx4:	missing dependency, "ibverbs"
	net/mlx5:	missing dependency, "ibverbs"
	net/mvneta:	missing dependency, "libmusdk"
	net/mvpp2:	missing dependency, "libmusdk"
	net/nfb:	missing dependency, "libnfb"
	net/szedata2:	missing dependency, "libsze2"
	crypto/kasumi:	missing dependency, "libsso_kasumi"
	crypto/mvsam:	missing dependency, "libmusdk"
	crypto/snow3g:	missing dependency, "libsso_snow3g"
	crypto/zuc:	missing dependency, "libsso_zuc"
	compress/isal:	missing dependency, "libisal"
	raw/ifpga:	missing dependency, "libfdt"
	

Build targets in project: 570
WARNING: Project specifies a minimum meson_version '>= 0.47.1' but uses features which were added in newer versions:
 * 0.48.0: {'console arg in custom_target'}
Option default_library is: shared [default: static]
Found ninja-1.9.0.git.kitware.dyndep-1.jobserver-1 at /usr/bin/ninja
[1/848] Compiling C object 'lib/76b5a35@@rte_ethdev at sta/librte_ethdev_ethdev_profile.c.o'.
[2/848] Compiling C object 'lib/76b5a35@@rte_ethdev at sta/librte_ethdev_rte_class_eth.c.o'.
[3/848] Compiling C object 'lib/76b5a35@@rte_ethdev at sta/librte_ethdev_ethdev_private.c.o'.
[4/848] Compiling C object 'lib/76b5a35@@rte_bitratestats at sta/librte_bitratestats_rte_bitrate.c.o'.
[5/848] Linking static target lib/librte_bitratestats.a.
[6/848] Compiling C object 'lib/76b5a35@@rte_ethdev at sta/librte_ethdev_rte_tm.c.o'.
[7/848] Compiling C object 'lib/76b5a35@@rte_ethdev at sta/librte_ethdev_rte_mtr.c.o'.
[8/848] Compiling C object 'lib/76b5a35@@rte_gro at sta/librte_gro_rte_gro.c.o'.
[9/848] Compiling C object 'lib/76b5a35@@rte_gro at sta/librte_gro_gro_vxlan_tcp4.c.o'.
[10/848] Compiling C object 'lib/76b5a35@@rte_eventdev at sta/librte_eventdev_rte_event_eth_tx_adapter.c.o'.
[11/848] Compiling C object 'lib/76b5a35@@rte_gro at sta/librte_gro_gro_tcp4.c.o'.
[12/848] Linking static target lib/librte_gro.a.
[13/848] Compiling C object 'lib/76b5a35@@rte_eventdev at sta/librte_eventdev_rte_eventdev.c.o'.
[14/848] Compiling C object 'lib/76b5a35@@rte_gso at sta/librte_gso_rte_gso.c.o'.
[15/848] Linking static target lib/librte_gso.a.
[16/848] Compiling C object 'lib/76b5a35@@rte_ethdev at sta/librte_ethdev_rte_flow.c.o'.
[17/848] Compiling C object 'lib/76b5a35@@rte_latencystats at sta/librte_latencystats_rte_latencystats.c.o'.
[18/848] Linking static target lib/librte_latencystats.a.
[19/848] Compiling C object 'lib/76b5a35@@rte_vhost at sta/librte_vhost_socket.c.o'.
[20/848] Compiling C object 'lib/76b5a35@@rte_vhost at sta/librte_vhost_vdpa.c.o'.
[21/848] Compiling C object 'lib/76b5a35@@rte_eventdev at sta/librte_eventdev_rte_event_eth_rx_adapter.c.o'.
[22/848] Linking static target lib/librte_eventdev.a.
[23/848] Compiling C object 'lib/76b5a35@@rte_vhost at sta/librte_vhost_iotlb.c.o'.
[24/848] Generating vhost_def with a custom command.
[25/848] Compiling C object 'lib/76b5a35@@rte_kni at sta/librte_kni_rte_kni.c.o'.
[26/848] Linking static target lib/librte_kni.a.
[27/848] Compiling C object 'lib/76b5a35@@rte_ethdev at sta/librte_ethdev_rte_ethdev.c.o'.
[28/848] Linking static target lib/librte_ethdev.a.
[29/848] Linking target lib/librte_ethdev.so.12.1.
[30/848] Compiling C object 'lib/76b5a35@@rte_pdump at sta/librte_pdump_rte_pdump.c.o'.
[31/848] Linking static target lib/librte_pdump.a.
[32/848] Compiling C object 'lib/76b5a35@@rte_vhost at sta/librte_vhost_vhost.c.o'.
[33/848] Compiling C object 'lib/76b5a35@@rte_flow_classify at sta/librte_flow_classify_rte_flow_classify.c.o'.
[34/848] Compiling C object 'lib/76b5a35@@rte_flow_classify at sta/librte_flow_classify_rte_flow_classify_parse.c.o'.
[35/848] Linking static target lib/librte_flow_classify.a.
[36/848] Compiling C object 'lib/76b5a35@@rte_vhost at sta/librte_vhost_vhost_user.c.o'.
[37/848] Generating symbol file 'lib/76b5a35@@rte_ethdev at sha/librte_ethdev.so.12.1.symbols'.
[38/834] Linking target lib/librte_bitratestats.so.2.1.
[39/834] Compiling C object 'drivers/a715181@@tmp_rte_bus_dpaa at sta/bus_dpaa_base_fman_fman.c.o'.
[40/834] Compiling C object 'drivers/a715181@@tmp_rte_bus_dpaa at sta/bus_dpaa_base_fman_fman_hw.c.o'.
[41/834] Compiling C object 'lib/76b5a35@@rte_bpf at sta/librte_bpf_bpf_pkt.c.o'.
[42/834] Compiling C object 'drivers/a715181@@tmp_rte_bus_dpaa at sta/bus_dpaa_base_fman_netcfg_layer.c.o'.
[43/834] Linking target lib/librte_gro.so.1.1.
[44/834] Linking target lib/librte_eventdev.so.7.1.
[45/834] Linking target lib/librte_kni.so.2.1.
[46/834] Linking target lib/librte_gso.so.1.1.
[47/834] Compiling C object 'lib/76b5a35@@rte_port at sta/librte_port_rte_port_ethdev.c.o'.
[48/834] Linking target lib/librte_latencystats.so.1.1.
[49/834] Compiling C object 'lib/76b5a35@@rte_vhost at sta/librte_vhost_vhost_crypto.c.o'.
[50/834] Generating symbol file 'lib/76b5a35@@rte_bitratestats at sha/librte_bitratestats.so.2.1.symbols'.
[51/834] Linking target lib/librte_pdump.so.3.1.
[52/834] Linking static target lib/librte_port.a.
[53/834] Linking static target lib/librte_bpf.a.
[54/834] Linking target lib/librte_bpf.so.1.1.
[55/834] Generating symbol file 'lib/76b5a35@@rte_kni at sha/librte_kni.so.2.1.symbols'.
[56/834] Generating symbol file 'lib/76b5a35@@rte_eventdev at sha/librte_eventdev.so.7.1.symbols'.
[57/831] Generating symbol file 'lib/76b5a35@@rte_gso at sha/librte_gso.so.1.1.symbols'.
[58/831] Generating symbol file 'lib/76b5a35@@rte_gro at sha/librte_gro.so.1.1.symbols'.
[59/831] Linking target lib/librte_port.so.3.1.
[60/831] Generating symbol file 'lib/76b5a35@@rte_latencystats at sha/librte_latencystats.so.1.1.symbols'.
[61/831] Generating symbol file 'lib/76b5a35@@rte_pdump at sha/librte_pdump.so.3.1.symbols'.
[62/831] Generating symbol file 'lib/76b5a35@@rte_bpf at sha/librte_bpf.so.1.1.symbols'.
[63/831] Compiling C object 'drivers/a715181@@tmp_rte_bus_fslmc at sta/bus_fslmc_fslmc_vfio.c.o'.
[64/831] Compiling C object 'drivers/a715181@@tmp_rte_bus_dpaa at sta/bus_dpaa_dpaa_bus.c.o'.
[65/831] Generating symbol file 'lib/76b5a35@@rte_port at sha/librte_port.so.3.1.symbols'.
[66/827] Linking target lib/librte_flow_classify.so.1.1.
[67/827] Compiling C object 'drivers/a715181@@tmp_rte_bus_fslmc at sta/bus_fslmc_portal_dpaa2_hw_dpbp.c.o'.
[68/827] Compiling C object 'drivers/a715181@@tmp_rte_bus_fslmc at sta/bus_fslmc_portal_dpaa2_hw_dpci.c.o'.
[69/827] Compiling C object 'drivers/a715181@@tmp_rte_bus_fslmc at sta/bus_fslmc_fslmc_bus.c.o'.
[70/827] Compiling C object 'lib/76b5a35@@rte_vhost at sta/librte_vhost_virtio_net.c.o'.
[71/827] Linking static target lib/librte_vhost.a.
[72/827] Linking target lib/librte_vhost.so.4.1.
[73/827] Compiling C object 'drivers/a715181@@tmp_rte_bus_fslmc at sta/bus_fslmc_portal_dpaa2_hw_dpio.c.o'.
[74/827] Linking static target drivers/libtmp_rte_bus_fslmc.a.
[75/827] Generating rte_bus_fslmc.pmd.c with a custom command.
[76/827] Compiling C object 'drivers/a715181@@tmp_rte_mempool_dpaa at sta/mempool_dpaa_dpaa_mempool.c.o'.
[77/827] Compiling C object 'drivers/a715181@@rte_bus_fslmc at sta/meson-generated_.._rte_bus_fslmc.pmd.c.o'.
[78/827] Compiling C object 'drivers/a715181@@rte_bus_fslmc at sha/meson-generated_.._rte_bus_fslmc.pmd.c.o'.
[79/827] Generating symbol file 'lib/76b5a35@@rte_flow_classify at sha/librte_flow_classify.so.1.1.symbols'.
[80/827] Linking static target drivers/libtmp_rte_mempool_dpaa.a.
[81/827] Linking static target drivers/librte_bus_fslmc.a.
[82/827] Compiling C object 'drivers/a715181@@tmp_rte_mempool_dpaa2 at sta/mempool_dpaa2_dpaa2_hw_mempool.c.o'.
[83/827] Generating rte_mempool_dpaa.pmd.c with a custom command.
[84/827] Linking static target drivers/libtmp_rte_mempool_dpaa2.a.
[85/827] Generating rte_mempool_dpaa2.pmd.c with a custom command.
[86/827] Compiling C object 'drivers/a715181@@rte_mempool_dpaa at sta/meson-generated_.._rte_mempool_dpaa.pmd.c.o'.
[87/827] Linking target drivers/librte_bus_fslmc.so.2.1.
[88/827] Compiling C object 'drivers/a715181@@rte_mempool_dpaa2 at sta/meson-generated_.._rte_mempool_dpaa2.pmd.c.o'.
[89/827] Compiling C object 'drivers/a715181@@rte_mempool_dpaa at sha/meson-generated_.._rte_mempool_dpaa.pmd.c.o'.
[90/827] Generating symbol file 'lib/76b5a35@@rte_vhost at sha/librte_vhost.so.4.1.symbols'.
[91/827] Linking static target drivers/librte_mempool_dpaa.a.
[92/827] Compiling C object 'drivers/a715181@@tmp_rte_pmd_memif at sta/net_memif_rte_eth_memif.c.o'.
[93/827] Linking static target drivers/librte_mempool_dpaa2.a.
[94/827] Compiling C object 'drivers/a715181@@rte_mempool_dpaa2 at sha/meson-generated_.._rte_mempool_dpaa2.pmd.c.o'.
[95/827] Compiling C object 'drivers/a715181@@tmp_rte_bus_dpaa at sta/bus_dpaa_base_qbman_qman.c.o'.
[96/827] Linking static target drivers/libtmp_rte_bus_dpaa.a.
[97/827] Generating rte_bus_dpaa.pmd.c with a custom command.
[98/827] Compiling C object 'drivers/a715181@@tmp_rte_pmd_octeontx2 at sta/net_octeontx2_otx2_rss.c.o'.
[99/827] Generating symbol file 'drivers/a715181@@rte_bus_fslmc at sha/librte_bus_fslmc.so.2.1.symbols'.
[100/827] Compiling C object 'drivers/a715181@@rte_bus_dpaa at sta/meson-generated_.._rte_bus_dpaa.pmd.c.o'.
[101/827] Compiling C object 'drivers/a715181@@rte_bus_dpaa at sha/meson-generated_.._rte_bus_dpaa.pmd.c.o'.
[102/827] Linking static target drivers/librte_bus_dpaa.a.
[103/827] Compiling C object 'drivers/a715181@@tmp_rte_pmd_octeontx2 at sta/net_octeontx2_otx2_ethdev_devargs.c.o'.
[104/827] Linking target drivers/librte_mempool_dpaa2.so.2.1.
[105/827] Compiling C object 'drivers/a715181@@tmp_rte_pmd_ark at sta/net_ark_ark_ethdev.c.o'.
[106/827] Linking target drivers/librte_bus_dpaa.so.2.1.
[107/827] Compiling C object 'drivers/a715181@@tmp_rte_pmd_af_packet at sta/net_af_packet_rte_eth_af_packet.c.o'.
[108/827] Linking static target drivers/libtmp_rte_pmd_af_packet.a.
[109/827] Generating symbol file 'drivers/a715181@@rte_mempool_dpaa2 at sha/librte_mempool_dpaa2.so.2.1.symbols'.
[110/823] Compiling C object 'drivers/a715181@@tmp_rte_pmd_ark at sta/net_ark_ark_pktchkr.c.o'.
[111/823] Generating rte_pmd_af_packet.pmd.c with a custom command.
[112/823] Compiling C object 'drivers/a715181@@tmp_rte_pmd_ark at sta/net_ark_ark_ethdev_tx.c.o'.
[113/823] Compiling C object 'drivers/a715181@@rte_pmd_af_packet at sta/meson-generated_.._rte_pmd_af_packet.pmd.c.o'.
[114/823] Compiling C object 'drivers/a715181@@rte_pmd_af_packet at sha/meson-generated_.._rte_pmd_af_packet.pmd.c.o'.
[115/823] Linking static target drivers/librte_pmd_af_packet.a.
[116/823] Generating symbol file 'drivers/a715181@@rte_bus_dpaa at sha/librte_bus_dpaa.so.2.1.symbols'.
[117/822] Linking target drivers/librte_pmd_af_packet.so.1.1.
[118/822] Linking target drivers/librte_mempool_dpaa.so.1.1.
[119/822] Compiling C object 'drivers/a715181@@tmp_rte_pmd_ark at sta/net_ark_ark_ethdev_rx.c.o'.
[120/822] Compiling C object 'drivers/a715181@@tmp_rte_pmd_ark at sta/net_ark_ark_pktdir.c.o'.
[121/822] Compiling C object 'drivers/a715181@@tmp_rte_pmd_ark at sta/net_ark_ark_pktgen.c.o'.
[122/822] Linking static target drivers/libtmp_rte_pmd_ark.a.
[123/822] Generating rte_pmd_ark.pmd.c with a custom command.
[124/822] Compiling C object 'drivers/a715181@@rte_pmd_ark at sta/meson-generated_.._rte_pmd_ark.pmd.c.o'.
[125/822] Linking static target drivers/librte_pmd_ark.a.
[126/822] Compiling C object 'drivers/a715181@@tmp_rte_pmd_octeontx2 at sta/net_octeontx2_otx2_tx.c.o'.
[127/822] Generating symbol file 'drivers/a715181@@rte_mempool_dpaa at sha/librte_mempool_dpaa.so.1.1.symbols'.
[128/822] Compiling C object 'drivers/a715181@@tmp_rte_pmd_atlantic at sta/net_atlantic_rte_pmd_atlantic.c.o'.
[129/822] Compiling C object 'drivers/a715181@@rte_pmd_ark at sha/meson-generated_.._rte_pmd_ark.pmd.c.o'.
[130/822] Linking target drivers/librte_pmd_ark.so.1.1.
[131/822] Compiling C object 'drivers/a715181@@tmp_rte_pmd_atlantic at sta/net_atlantic_atl_ethdev.c.o'.
[132/822] Compiling C object 'drivers/a715181@@tmp_rte_pmd_atlantic at sta/net_atlantic_atl_rxtx.c.o'.
[133/822] Linking static target drivers/libtmp_rte_pmd_atlantic.a.
[134/822] Generating rte_pmd_atlantic.pmd.c with a custom command.
[135/822] Compiling C object 'drivers/a715181@@rte_pmd_atlantic at sta/meson-generated_.._rte_pmd_atlantic.pmd.c.o'.
[136/822] Compiling C object 'drivers/a715181@@tmp_rte_pmd_axgbe at sta/net_axgbe_axgbe_i2c.c.o'.
[137/822] Linking static target drivers/librte_pmd_atlantic.a.
[138/822] Compiling C object 'drivers/a715181@@rte_pmd_atlantic at sha/meson-generated_.._rte_pmd_atlantic.pmd.c.o'.
[139/822] Compiling C object 'drivers/a715181@@tmp_rte_pmd_axgbe at sta/net_axgbe_axgbe_mdio.c.o'.
[140/822] Compiling C object 'drivers/a715181@@tmp_rte_pmd_axgbe at sta/net_axgbe_axgbe_ethdev.c.o'.
[141/822] Linking target drivers/librte_pmd_atlantic.so.1.1.
[142/822] Compiling C object 'drivers/a715181@@tmp_rte_pmd_axgbe at sta/net_axgbe_axgbe_dev.c.o'.
[143/822] Compiling C object 'drivers/a715181@@tmp_rte_pmd_octeontx2 at sta/net_octeontx2_otx2_rx.c.o'.
[144/822] Compiling C object 'drivers/a715181@@tmp_rte_pmd_axgbe at sta/net_axgbe_axgbe_rxtx_vec_sse.c.o'.
[145/822] Compiling C object 'drivers/a715181@@tmp_rte_pmd_axgbe at sta/net_axgbe_axgbe_phy_impl.c.o'.
[146/822] Compiling C object 'drivers/a715181@@tmp_rte_pmd_bond at sta/net_bonding_rte_eth_bond_flow.c.o'.
[147/822] Compiling C object 'drivers/a715181@@tmp_rte_pmd_bond at sta/net_bonding_rte_eth_bond_api.c.o'.
[148/822] Compiling C object 'drivers/a715181@@tmp_rte_pmd_avp at sta/net_avp_avp_ethdev.c.o'.
[149/822] Linking static target drivers/libtmp_rte_pmd_avp.a.
[150/822] Generating rte_pmd_avp.pmd.c with a custom command.
[151/822] Compiling C object 'drivers/a715181@@rte_pmd_avp at sta/meson-generated_.._rte_pmd_avp.pmd.c.o'.
[152/822] Linking static target drivers/librte_pmd_avp.a.
[153/822] Compiling C object 'drivers/a715181@@tmp_rte_pmd_bond at sta/net_bonding_rte_eth_bond_args.c.o'.
[154/822] Compiling C object 'drivers/a715181@@tmp_rte_pmd_bond at sta/net_bonding_rte_eth_bond_alb.c.o'.
[155/822] Compiling C object 'drivers/a715181@@rte_pmd_avp at sha/meson-generated_.._rte_pmd_avp.pmd.c.o'.
[156/822] Compiling C object 'drivers/a715181@@tmp_rte_pmd_axgbe at sta/net_axgbe_axgbe_rxtx.c.o'.
[157/822] Linking static target drivers/libtmp_rte_pmd_axgbe.a.
[158/822] Linking target drivers/librte_pmd_avp.so.1.1.
[159/822] Generating rte_pmd_axgbe.pmd.c with a custom command.
[160/822] Compiling C object 'drivers/a715181@@rte_pmd_axgbe at sta/meson-generated_.._rte_pmd_axgbe.pmd.c.o'.
[161/822] Compiling C object 'drivers/a715181@@rte_pmd_axgbe at sha/meson-generated_.._rte_pmd_axgbe.pmd.c.o'.
[162/822] Linking static target drivers/librte_pmd_axgbe.a.
[163/822] Compiling C object 'drivers/a715181@@tmp_rte_pmd_bnx2x at sta/net_bnx2x_bnx2x_ethdev.c.o'.
[164/822] Linking target drivers/librte_pmd_axgbe.so.1.1.
[165/822] Compiling C object 'drivers/a715181@@tmp_rte_pmd_bnx2x at sta/net_bnx2x_bnx2x_vfpf.c.o'.
[166/822] Compiling C object 'drivers/a715181@@tmp_rte_pmd_bnx2x at sta/net_bnx2x_bnx2x_rxtx.c.o'.
[167/822] Compiling C object 'drivers/a715181@@tmp_rte_pmd_bond at sta/net_bonding_rte_eth_bond_8023ad.c.o'.
[168/822] Compiling C object 'drivers/a715181@@tmp_rte_pmd_bond at sta/net_bonding_rte_eth_bond_pmd.c.o'.
[169/822] Linking static target drivers/libtmp_rte_pmd_bond.a.
[170/822] Compiling C object 'drivers/a715181@@tmp_rte_pmd_bnxt at sta/net_bnxt_bnxt_filter.c.o'.
[171/822] Generating rte_pmd_bond.pmd.c with a custom command.
[172/822] Compiling C object 'drivers/a715181@@rte_pmd_bond at sta/meson-generated_.._rte_pmd_bond.pmd.c.o'.
[173/822] Compiling C object 'drivers/a715181@@rte_pmd_bond at sha/meson-generated_.._rte_pmd_bond.pmd.c.o'.
[174/822] Compiling C object 'drivers/a715181@@tmp_rte_pmd_bnxt at sta/net_bnxt_bnxt_cpr.c.o'.
[175/822] Linking static target drivers/librte_pmd_bond.a.
[176/822] Linking target drivers/librte_pmd_bond.so.2.1.
[177/822] Generating symbol file 'drivers/a715181@@rte_pmd_bond at sha/librte_pmd_bond.so.2.1.symbols'.
[178/822] Compiling C object 'drivers/a715181@@tmp_rte_pmd_bnxt at sta/net_bnxt_bnxt_flow.c.o'.
[179/822] Compiling C object 'drivers/a715181@@tmp_rte_pmd_bnx2x at sta/net_bnx2x_ecore_sp.c.o'.
[180/822] Compiling C object 'drivers/a715181@@tmp_rte_pmd_bnxt at sta/net_bnxt_bnxt_ethdev.c.o'.
[181/822] Compiling C object 'drivers/a715181@@tmp_rte_pmd_bnx2x at sta/net_bnx2x_bnx2x_stats.c.o'.
[182/822] Compiling C object 'drivers/a715181@@tmp_rte_pmd_bnxt at sta/net_bnxt_bnxt_irq.c.o'.
[183/822] Compiling C object 'drivers/a715181@@tmp_rte_pmd_bnxt at sta/net_bnxt_bnxt_rxr.c.o'.
[184/822] Compiling C object 'drivers/a715181@@tmp_rte_pmd_bnxt at sta/net_bnxt_bnxt_ring.c.o'.
[185/822] Compiling C object 'drivers/a715181@@tmp_rte_pmd_bnxt at sta/net_bnxt_bnxt_txq.c.o'.
[186/822] Compiling C object 'drivers/a715181@@tmp_rte_pmd_bnxt at sta/net_bnxt_bnxt_rxq.c.o'.
[187/822] Compiling C object 'drivers/a715181@@tmp_rte_pmd_bnxt at sta/net_bnxt_bnxt_stats.c.o'.
[188/822] Compiling C object 'drivers/a715181@@tmp_rte_pmd_bnxt at sta/net_bnxt_bnxt_vnic.c.o'.
[189/822] Compiling C object 'drivers/a715181@@tmp_rte_pmd_bnxt at sta/net_bnxt_rte_pmd_bnxt.c.o'.
[190/822] Compiling C object 'drivers/a715181@@tmp_rte_pmd_bnxt at sta/net_bnxt_bnxt_hwrm.c.o'.
[191/822] Compiling C object 'drivers/a715181@@tmp_rte_pmd_bnxt at sta/net_bnxt_bnxt_txr.c.o'.
[192/822] Compiling C object 'drivers/a715181@@tmp_rte_pmd_cxgbe at sta/net_cxgbe_cxgbevf_ethdev.c.o'.
[193/822] Compiling C object 'drivers/a715181@@tmp_rte_pmd_bnxt at sta/net_bnxt_bnxt_rxtx_vec_sse.c.o'.
[194/822] Compiling C object 'drivers/a715181@@tmp_rte_pmd_cxgbe at sta/net_cxgbe_cxgbevf_main.c.o'.
[195/822] Compiling C object 'drivers/a715181@@tmp_rte_pmd_bnx2x at sta/net_bnx2x_bnx2x.c.o'.
[196/822] Linking static target drivers/libtmp_rte_pmd_bnxt.a.
[197/822] Compiling C object 'drivers/a715181@@tmp_rte_pmd_cxgbe at sta/net_cxgbe_cxgbe_ethdev.c.o'.
[198/822] Generating rte_pmd_bnxt.pmd.c with a custom command.
[199/822] Compiling C object 'drivers/a715181@@rte_pmd_bnxt at sha/meson-generated_.._rte_pmd_bnxt.pmd.c.o'.
[200/822] Compiling C object 'drivers/a715181@@rte_pmd_bnxt at sta/meson-generated_.._rte_pmd_bnxt.pmd.c.o'.
[201/822] Compiling C object 'drivers/a715181@@tmp_rte_pmd_cxgbe at sta/net_cxgbe_clip_tbl.c.o'.
[202/822] Linking static target drivers/librte_pmd_bnxt.a.
[203/822] Linking target drivers/librte_pmd_bnxt.so.2.1.
[204/822] Compiling C object 'drivers/a715181@@tmp_rte_pmd_cxgbe at sta/net_cxgbe_cxgbe_flow.c.o'.
[205/822] Compiling C object 'drivers/a715181@@tmp_rte_pmd_bnx2x at sta/net_bnx2x_elink.c.o'.
[206/822] Linking static target drivers/libtmp_rte_pmd_bnx2x.a.
[207/822] Compiling C object 'drivers/a715181@@tmp_rte_pmd_cxgbe at sta/net_cxgbe_cxgbe_filter.c.o'.
[208/822] Compiling C object 'drivers/a715181@@tmp_rte_pmd_cxgbe at sta/net_cxgbe_mps_tcam.c.o'.
[209/822] Generating rte_pmd_bnx2x.pmd.c with a custom command.
[210/822] Compiling C object 'drivers/a715181@@rte_pmd_bnx2x at sta/meson-generated_.._rte_pmd_bnx2x.pmd.c.o'.
[211/822] Compiling C object 'drivers/a715181@@rte_pmd_bnx2x at sha/meson-generated_.._rte_pmd_bnx2x.pmd.c.o'.
[212/822] Compiling C object 'drivers/a715181@@tmp_rte_pmd_cxgbe at sta/net_cxgbe_l2t.c.o'.
[213/822] Linking static target drivers/librte_pmd_bnx2x.a.
[214/822] Linking target drivers/librte_pmd_bnx2x.so.1.1.
[215/822] Compiling C object 'drivers/a715181@@tmp_rte_pmd_cxgbe at sta/net_cxgbe_cxgbe_main.c.o'.
[216/822] Generating symbol file 'drivers/a715181@@rte_pmd_bnxt at sha/librte_pmd_bnxt.so.2.1.symbols'.
[217/822] Compiling C object 'drivers/a715181@@tmp_rte_pmd_dpaa2 at sta/net_dpaa2_base_dpaa2_hw_dpni.c.o'.
[218/822] Compiling C object 'drivers/a715181@@tmp_rte_pmd_cxgbe at sta/net_cxgbe_base_t4vf_hw.c.o'.
[219/822] Compiling C object 'drivers/a715181@@tmp_rte_pmd_dpaa2 at sta/net_dpaa2_dpaa2_ethdev.c.o'.
[220/822] Compiling C object 'drivers/a715181@@tmp_rte_pmd_cxgbe at sta/net_cxgbe_sge.c.o'.
[221/822] Compiling C object 'drivers/a715181@@tmp_rte_pmd_dpaa2 at sta/net_dpaa2_dpaa2_mux.c.o'.
[222/822] Compiling C object 'drivers/a715181@@tmp_rte_pmd_dpaa at sta/net_dpaa_dpaa_ethdev.c.o'.
[223/822] Compiling C object 'drivers/a715181@@tmp_rte_pmd_dpaa2 at sta/net_dpaa2_dpaa2_flow.c.o'.
[224/822] Compiling C object 'drivers/a715181@@tmp_rte_pmd_cxgbe at sta/net_cxgbe_base_t4_hw.c.o'.
[225/822] Linking static target drivers/libtmp_rte_pmd_cxgbe.a.
[226/822] Compiling C object 'drivers/a715181@@tmp_rte_pmd_dpaa at sta/net_dpaa_dpaa_rxtx.c.o'.
[227/822] Linking static target drivers/libtmp_rte_pmd_dpaa.a.
[228/822] Generating rte_pmd_cxgbe.pmd.c with a custom command.
[229/822] Generating rte_pmd_dpaa.pmd.c with a custom command.
[230/822] Compiling C object 'drivers/a715181@@rte_pmd_cxgbe at sta/meson-generated_.._rte_pmd_cxgbe.pmd.c.o'.
[231/822] Compiling C object 'drivers/a715181@@tmp_rte_pmd_e1000 at sta/net_e1000_igb_pf.c.o'.
[232/822] Compiling C object 'drivers/a715181@@rte_pmd_dpaa at sha/meson-generated_.._rte_pmd_dpaa.pmd.c.o'.
[233/822] Compiling C object 'drivers/a715181@@tmp_rte_pmd_e1000 at sta/net_e1000_em_ethdev.c.o'.
[234/822] Linking static target drivers/librte_pmd_cxgbe.a.
[235/822] Compiling C object 'drivers/a715181@@rte_pmd_cxgbe at sha/meson-generated_.._rte_pmd_cxgbe.pmd.c.o'.
[236/822] Compiling C object 'drivers/a715181@@rte_pmd_dpaa at sta/meson-generated_.._rte_pmd_dpaa.pmd.c.o'.
[237/822] Linking target drivers/librte_pmd_dpaa.so.1.1.
[238/822] Linking static target drivers/librte_pmd_dpaa.a.
[239/822] Linking target drivers/librte_pmd_cxgbe.so.1.1.
[240/822] Compiling C object 'drivers/a715181@@tmp_rte_pmd_e1000 at sta/net_e1000_igb_flow.c.o'.
[241/822] Compiling C object 'drivers/a715181@@tmp_rte_pmd_dpaa2 at sta/net_dpaa2_dpaa2_rxtx.c.o'.
[242/822] Linking static target drivers/libtmp_rte_pmd_dpaa2.a.
[243/822] Compiling C object 'drivers/a715181@@tmp_rte_pmd_ena at sta/net_ena_base_ena_eth_com.c.o'.
[244/822] Compiling C object 'drivers/a715181@@tmp_rte_pmd_e1000 at sta/net_e1000_em_rxtx.c.o'.
[245/822] Generating rte_pmd_dpaa2.pmd.c with a custom command.
[246/822] Compiling C object 'drivers/a715181@@rte_pmd_dpaa2 at sha/meson-generated_.._rte_pmd_dpaa2.pmd.c.o'.
[247/822] Compiling C object 'drivers/a715181@@rte_pmd_dpaa2 at sta/meson-generated_.._rte_pmd_dpaa2.pmd.c.o'.
[248/822] Linking static target drivers/librte_pmd_dpaa2.a.
[249/822] Compiling C object 'drivers/a715181@@tmp_rte_pmd_enetc at sta/net_enetc_enetc_rxtx.c.o'.
[250/822] Linking target drivers/librte_pmd_dpaa2.so.2.1.
[251/822] Generating symbol file 'drivers/a715181@@rte_pmd_dpaa at sha/librte_pmd_dpaa.so.1.1.symbols'.
[252/822] Compiling C object 'drivers/a715181@@tmp_rte_pmd_ena at sta/net_ena_base_ena_com.c.o'.
[253/822] Compiling C object 'drivers/a715181@@tmp_rte_pmd_e1000 at sta/net_e1000_igb_rxtx.c.o'.
[254/822] Compiling C object 'drivers/a715181@@tmp_rte_pmd_enic at sta/net_enic_enic_clsf.c.o'.
[255/822] Compiling C object 'drivers/a715181@@tmp_rte_pmd_enic at sta/net_enic_enic_res.c.o'.
[256/822] Compiling C object 'drivers/a715181@@tmp_rte_pmd_enetc at sta/net_enetc_enetc_ethdev.c.o'.
[257/822] Linking static target drivers/libtmp_rte_pmd_enetc.a.
[258/822] Generating rte_pmd_enetc.pmd.c with a custom command.
[259/822] Generating symbol file 'drivers/a715181@@rte_pmd_dpaa2 at sha/librte_pmd_dpaa2.so.2.1.symbols'.
[260/822] Compiling C object 'drivers/a715181@@rte_pmd_enetc at sta/meson-generated_.._rte_pmd_enetc.pmd.c.o'.
[261/822] Compiling C object 'drivers/a715181@@rte_pmd_enetc at sha/meson-generated_.._rte_pmd_enetc.pmd.c.o'.
[262/822] Linking static target drivers/librte_pmd_enetc.a.
[263/822] Compiling C object 'drivers/a715181@@tmp_rte_pmd_enic at sta/net_enic_enic_flow.c.o'.
[264/822] Linking target drivers/librte_pmd_enetc.so.1.1.
[265/822] Compiling C object 'drivers/a715181@@tmp_rte_pmd_enic at sta/net_enic_enic_ethdev.c.o'.
[266/822] Compiling C object 'drivers/a715181@@tmp_rte_pmd_e1000 at sta/net_e1000_igb_ethdev.c.o'.
[267/822] Linking static target drivers/libtmp_rte_pmd_e1000.a.
[268/822] Generating rte_pmd_e1000.pmd.c with a custom command.
[269/822] Compiling C object 'drivers/a715181@@rte_pmd_e1000 at sta/meson-generated_.._rte_pmd_e1000.pmd.c.o'.
[270/822] Compiling C object 'drivers/a715181@@rte_pmd_e1000 at sha/meson-generated_.._rte_pmd_e1000.pmd.c.o'.
[271/822] Linking static target drivers/librte_pmd_e1000.a.
[272/822] Linking target drivers/librte_pmd_e1000.so.1.1.
[273/822] Compiling C object 'drivers/a715181@@tmp_rte_pmd_enic at sta/net_enic_enic_main.c.o'.
[274/822] Compiling C object 'drivers/a715181@@tmp_rte_pmd_failsafe at sta/net_failsafe_failsafe.c.o'.
[275/822] Compiling C object 'drivers/a715181@@tmp_rte_pmd_failsafe at sta/net_failsafe_failsafe_eal.c.o'.
[276/822] Compiling C object 'drivers/a715181@@tmp_rte_pmd_enic at sta/net_enic_enic_rxtx_vec_avx2.c.o'.
[277/822] Compiling C object 'drivers/a715181@@tmp_rte_pmd_failsafe at sta/net_failsafe_failsafe_args.c.o'.
[278/822] Compiling C object 'drivers/a715181@@tmp_rte_pmd_ena at sta/net_ena_ena_ethdev.c.o'.
[279/822] Compiling C object 'drivers/a715181@@tmp_rte_pmd_enic at sta/net_enic_enic_rxtx.c.o'.
[280/822] Linking static target drivers/libtmp_rte_pmd_enic.a.
[281/822] Linking static target drivers/libtmp_rte_pmd_ena.a.
[282/822] Generating rte_pmd_ena.pmd.c with a custom command.
[283/822] Compiling C object 'drivers/a715181@@rte_pmd_ena at sta/meson-generated_.._rte_pmd_ena.pmd.c.o'.
[284/822] Compiling C object 'drivers/a715181@@tmp_rte_pmd_failsafe at sta/net_failsafe_failsafe_flow.c.o'.
[285/822] Compiling C object 'drivers/a715181@@rte_pmd_ena at sha/meson-generated_.._rte_pmd_ena.pmd.c.o'.
[286/822] Linking static target drivers/librte_pmd_ena.a.
[287/822] Generating rte_pmd_enic.pmd.c with a custom command.
[288/822] Compiling C object 'drivers/a715181@@tmp_rte_pmd_failsafe at sta/net_failsafe_failsafe_rxtx.c.o'.
[289/822] Linking target drivers/librte_pmd_ena.so.1.1.
[290/822] Compiling C object 'drivers/a715181@@rte_pmd_enic at sha/meson-generated_.._rte_pmd_enic.pmd.c.o'.
[291/822] Compiling C object 'drivers/a715181@@rte_pmd_enic at sta/meson-generated_.._rte_pmd_enic.pmd.c.o'.
[292/822] Linking target drivers/librte_pmd_enic.so.1.1.
[293/822] Linking static target drivers/librte_pmd_enic.a.
[294/822] Compiling C object 'drivers/a715181@@tmp_rte_pmd_failsafe at sta/net_failsafe_failsafe_ether.c.o'.
[295/822] Compiling C object 'drivers/a715181@@tmp_rte_pmd_failsafe at sta/net_failsafe_failsafe_intr.c.o'.
[296/822] Compiling C object 'drivers/a715181@@tmp_rte_pmd_fm10k at sta/net_fm10k_fm10k_rxtx.c.o'.
[297/822] Compiling C object 'drivers/a715181@@tmp_rte_pmd_fm10k at sta/net_fm10k_fm10k_rxtx_vec.c.o'.
[298/822] Compiling C object 'drivers/a715181@@tmp_rte_pmd_failsafe at sta/net_failsafe_failsafe_ops.c.o'.
[299/822] Linking static target drivers/libtmp_rte_pmd_failsafe.a.
[300/822] Generating rte_pmd_failsafe.pmd.c with a custom command.
[301/822] Compiling C object 'drivers/a715181@@rte_pmd_failsafe at sta/meson-generated_.._rte_pmd_failsafe.pmd.c.o'.
[302/822] Compiling C object 'drivers/a715181@@rte_pmd_failsafe at sha/meson-generated_.._rte_pmd_failsafe.pmd.c.o'.
[303/822] Compiling C object 'drivers/a715181@@tmp_rte_pmd_i40e at sta/net_i40e_i40e_pf.c.o'.
[304/822] Linking static target drivers/librte_pmd_failsafe.a.
[305/822] Linking target drivers/librte_pmd_failsafe.so.1.1.
[306/822] Compiling C object 'drivers/a715181@@tmp_rte_pmd_i40e at sta/net_i40e_i40e_fdir.c.o'.
[307/822] Compiling C object 'drivers/a715181@@tmp_rte_pmd_fm10k at sta/net_fm10k_fm10k_ethdev.c.o'.
[308/822] Linking static target drivers/libtmp_rte_pmd_fm10k.a.
[309/822] Generating rte_pmd_fm10k.pmd.c with a custom command.
[310/822] Compiling C object 'drivers/a715181@@tmp_rte_pmd_i40e at sta/net_i40e_i40e_ethdev_vf.c.o'.
[311/822] Compiling C object 'drivers/a715181@@rte_pmd_fm10k at sta/meson-generated_.._rte_pmd_fm10k.pmd.c.o'.
[312/822] Linking static target drivers/librte_pmd_fm10k.a.
[313/822] Compiling C object 'drivers/a715181@@rte_pmd_fm10k at sha/meson-generated_.._rte_pmd_fm10k.pmd.c.o'.
[314/822] Linking target drivers/librte_pmd_fm10k.so.1.1.
[315/822] Compiling C object 'drivers/a715181@@tmp_rte_pmd_i40e at sta/net_i40e_i40e_tm.c.o'.
[316/822] Compiling C object 'drivers/a715181@@tmp_rte_pmd_i40e at sta/net_i40e_i40e_rxtx.c.o'.
[317/822] Compiling C object 'drivers/a715181@@tmp_rte_pmd_i40e at sta/net_i40e_i40e_flow.c.o'.
[318/822] Compiling C object 'drivers/a715181@@tmp_rte_pmd_i40e at sta/net_i40e_i40e_vf_representor.c.o'.
[319/822] Compiling C object 'drivers/net/hinic/base/12a4447@@hinic_base at sta/hinic_pmd_hwdev.c.o'.
[320/822] Linking static target drivers/net/hinic/base/libhinic_base.a.
[321/822] Compiling C object 'drivers/a715181@@tmp_rte_pmd_hinic at sta/net_hinic_hinic_pmd_rx.c.o'.
[322/822] Compiling C object 'drivers/a715181@@tmp_rte_pmd_i40e at sta/net_i40e_rte_pmd_i40e.c.o'.
[323/822] Compiling C object 'drivers/a715181@@tmp_rte_pmd_hinic at sta/net_hinic_hinic_pmd_ethdev.c.o'.
[324/822] Compiling C object 'drivers/a715181@@tmp_rte_pmd_i40e at sta/net_i40e_i40e_rxtx_vec_sse.c.o'.
[325/822] Compiling C object 'drivers/a715181@@tmp_rte_pmd_i40e at sta/net_i40e_i40e_rxtx_vec_avx2.c.o'.
[326/822] Compiling C object 'drivers/a715181@@tmp_rte_pmd_hinic at sta/net_hinic_hinic_pmd_tx.c.o'.
[327/822] Linking static target drivers/libtmp_rte_pmd_hinic.a.
[328/822] Generating rte_pmd_hinic.pmd.c with a custom command.
[329/822] Compiling C object 'drivers/a715181@@rte_pmd_hinic at sta/meson-generated_.._rte_pmd_hinic.pmd.c.o'.
[330/822] Compiling C object 'drivers/a715181@@rte_pmd_hinic at sha/meson-generated_.._rte_pmd_hinic.pmd.c.o'.
[331/822] Linking static target drivers/librte_pmd_hinic.a.
[332/822] Compiling C object 'drivers/a715181@@tmp_rte_pmd_iavf at sta/net_iavf_iavf_vchnl.c.o'.
[333/822] Linking target drivers/librte_pmd_hinic.so.1.1.
[334/822] Compiling C object 'drivers/a715181@@tmp_rte_pmd_iavf at sta/net_iavf_iavf_ethdev.c.o'.
[335/822] Compiling C object 'drivers/a715181@@tmp_rte_pmd_ice at sta/net_ice_ice_ethdev.c.o'.
[336/822] Compiling C object 'drivers/a715181@@tmp_rte_pmd_iavf at sta/net_iavf_iavf_rxtx_vec_sse.c.o'.
[337/822] Compiling C object 'drivers/a715181@@tmp_rte_pmd_ice at sta/net_ice_ice_switch_filter.c.o'.
[338/822] Compiling C object 'drivers/a715181@@tmp_rte_pmd_ice at sta/net_ice_ice_generic_flow.c.o'.
[339/822] Compiling C object 'drivers/a715181@@tmp_rte_pmd_iavf at sta/net_iavf_iavf_rxtx.c.o'.
[340/822] Linking static target drivers/libtmp_rte_pmd_iavf.a.
[341/822] Generating rte_pmd_iavf.pmd.c with a custom command.
[342/822] Compiling C object 'drivers/a715181@@rte_pmd_iavf at sha/meson-generated_.._rte_pmd_iavf.pmd.c.o'.
[343/822] Compiling C object 'drivers/a715181@@tmp_rte_pmd_ipn3ke at sta/net_ipn3ke_ipn3ke_ethdev.c.o'.
[344/822] Compiling C object 'drivers/a715181@@rte_pmd_iavf at sta/meson-generated_.._rte_pmd_iavf.pmd.c.o'.
[345/822] Linking target drivers/librte_pmd_iavf.so.1.1.
[346/822] Linking static target drivers/librte_pmd_iavf.a.
[347/822] Compiling C object 'drivers/a715181@@tmp_rte_pmd_i40e at sta/net_i40e_i40e_ethdev.c.o'.
[348/822] Linking static target drivers/libtmp_rte_pmd_i40e.a.
[349/822] Compiling C object 'drivers/a715181@@tmp_rte_pmd_ifc at sta/net_ifc_ifcvf_vdpa.c.o'.
[350/822] Linking static target drivers/libtmp_rte_pmd_ifc.a.
[351/822] Generating rte_pmd_i40e.pmd.c with a custom command.
[352/822] Generating rte_pmd_ifc.pmd.c with a custom command.
[353/822] Compiling C object 'drivers/a715181@@tmp_rte_pmd_ipn3ke at sta/net_ipn3ke_ipn3ke_tm.c.o'.
[354/822] Compiling C object 'drivers/a715181@@tmp_rte_pmd_ice at sta/net_ice_ice_rxtx.c.o'.
[355/822] Compiling C object 'drivers/a715181@@rte_pmd_i40e at sta/meson-generated_.._rte_pmd_i40e.pmd.c.o'.
[356/822] Compiling C object 'drivers/a715181@@rte_pmd_ifc at sta/meson-generated_.._rte_pmd_ifc.pmd.c.o'.
[357/822] Compiling C object 'drivers/a715181@@rte_pmd_i40e at sha/meson-generated_.._rte_pmd_i40e.pmd.c.o'.
[358/822] Compiling C object 'drivers/a715181@@rte_pmd_ifc at sha/meson-generated_.._rte_pmd_ifc.pmd.c.o'.
[359/822] Linking static target drivers/librte_pmd_i40e.a.
[360/822] Linking static target drivers/librte_pmd_ifc.a.
[361/822] Compiling C object 'drivers/a715181@@tmp_rte_pmd_ice at sta/net_ice_ice_rxtx_vec_avx2.c.o'.
[362/822] Linking target drivers/librte_pmd_ifc.so.1.1.
[363/822] Linking target drivers/librte_pmd_i40e.so.2.1.
[364/822] Compiling C object 'drivers/a715181@@tmp_rte_pmd_ice at sta/net_ice_ice_rxtx_vec_sse.c.o'.
[365/822] Linking static target drivers/libtmp_rte_pmd_ice.a.
[366/822] Generating rte_pmd_ice.pmd.c with a custom command.
[367/822] Compiling C object 'drivers/a715181@@rte_pmd_ice at sta/meson-generated_.._rte_pmd_ice.pmd.c.o'.
[368/822] Compiling C object 'drivers/a715181@@rte_pmd_ice at sha/meson-generated_.._rte_pmd_ice.pmd.c.o'.
[369/822] Compiling C object 'drivers/a715181@@tmp_rte_pmd_ipn3ke at sta/net_ipn3ke_ipn3ke_flow.c.o'.
[370/822] Linking static target drivers/librte_pmd_ice.a.
[371/822] Compiling C object 'drivers/a715181@@tmp_rte_pmd_ixgbe at sta/net_ixgbe_ixgbe_bypass.c.o'.
[372/822] Linking target drivers/librte_pmd_ice.so.1.1.
[373/822] Generating symbol file 'drivers/a715181@@rte_pmd_i40e at sha/librte_pmd_i40e.so.2.1.symbols'.
[374/822] Compiling C object 'drivers/a715181@@tmp_rte_pmd_ipn3ke at sta/net_ipn3ke_ipn3ke_representor.c.o'.
[375/822] Linking static target drivers/libtmp_rte_pmd_ipn3ke.a.
[376/822] Compiling C object 'drivers/a715181@@tmp_rte_pmd_ixgbe at sta/net_ixgbe_ixgbe_pf.c.o'.
[377/822] Generating rte_pmd_ipn3ke.pmd.c with a custom command.
[378/822] Compiling C object 'drivers/a715181@@tmp_rte_pmd_ixgbe at sta/net_ixgbe_ixgbe_fdir.c.o'.
[379/822] Compiling C object 'drivers/a715181@@rte_pmd_ipn3ke at sta/meson-generated_.._rte_pmd_ipn3ke.pmd.c.o'.
[380/822] Compiling C object 'drivers/a715181@@rte_pmd_ipn3ke at sha/meson-generated_.._rte_pmd_ipn3ke.pmd.c.o'.
[381/822] Linking static target drivers/librte_pmd_ipn3ke.a.
[382/822] Linking target drivers/librte_pmd_ipn3ke.so.1.1.
[383/822] Compiling C object 'drivers/a715181@@tmp_rte_pmd_ixgbe at sta/net_ixgbe_ixgbe_vf_representor.c.o'.
[384/822] Compiling C object 'drivers/a715181@@tmp_rte_pmd_ixgbe at sta/net_ixgbe_ixgbe_ipsec.c.o'.
[385/822] Compiling C object 'drivers/a715181@@tmp_rte_pmd_ixgbe at sta/net_ixgbe_ixgbe_tm.c.o'.
[386/822] Compiling C object 'drivers/a715181@@tmp_rte_pmd_liquidio at sta/net_liquidio_base_lio_23xx_vf.c.o'.
[387/822] Compiling C object 'drivers/a715181@@tmp_rte_pmd_liquidio at sta/net_liquidio_base_lio_mbox.c.o'.
[388/822] Compiling C object 'drivers/a715181@@tmp_rte_pmd_kni at sta/net_kni_rte_eth_kni.c.o'.
[389/822] Linking static target drivers/libtmp_rte_pmd_kni.a.
[390/822] Compiling C object 'drivers/a715181@@tmp_rte_pmd_ixgbe at sta/net_ixgbe_ixgbe_flow.c.o'.
[391/822] Generating rte_pmd_kni.pmd.c with a custom command.
[392/822] Compiling C object 'drivers/a715181@@tmp_rte_pmd_ixgbe at sta/net_ixgbe_rte_pmd_ixgbe.c.o'.
[393/822] Compiling C object 'drivers/a715181@@rte_pmd_kni at sta/meson-generated_.._rte_pmd_kni.pmd.c.o'.
[394/822] Compiling C object 'drivers/a715181@@rte_pmd_kni at sha/meson-generated_.._rte_pmd_kni.pmd.c.o'.
[395/822] Linking static target drivers/librte_pmd_kni.a.
[396/822] Linking target drivers/librte_pmd_kni.so.1.1.
[397/822] Compiling C object 'drivers/a715181@@tmp_rte_pmd_liquidio at sta/net_liquidio_lio_ethdev.c.o'.
[398/822] Compiling C object 'drivers/a715181@@tmp_rte_pmd_ixgbe at sta/net_ixgbe_ixgbe_ethdev.c.o'.
[399/822] Compiling C object 'drivers/a715181@@tmp_rte_pmd_ixgbe at sta/net_ixgbe_ixgbe_rxtx_vec_sse.c.o'.
[400/822] Compiling C object 'examples/c590b3c@@dpdk-vmdq_dcb at exe/vmdq_dcb_main.c.o'.
[401/822] Compiling C object 'drivers/a715181@@tmp_rte_pmd_memif at sta/net_memif_memif_socket.c.o'.
[402/822] Linking static target drivers/libtmp_rte_pmd_memif.a.
[403/822] Generating rte_pmd_memif.pmd.c with a custom command.
[404/822] Linking target examples/dpdk-vmdq_dcb.
[405/822] Compiling C object 'drivers/a715181@@rte_pmd_memif at sta/meson-generated_.._rte_pmd_memif.pmd.c.o'.
[406/822] Compiling C object 'drivers/a715181@@rte_pmd_memif at sha/meson-generated_.._rte_pmd_memif.pmd.c.o'.
[407/822] Linking static target drivers/librte_pmd_memif.a.
[408/822] Compiling C object 'examples/c590b3c@@dpdk-vmdq at exe/vmdq_main.c.o'.
[409/822] Compiling C object 'drivers/a715181@@tmp_rte_pmd_netvsc at sta/net_netvsc_hn_ethdev.c.o'.
[410/822] Linking target drivers/librte_pmd_memif.so.1.1.
[411/822] Linking target examples/dpdk-vmdq.
[412/822] Compiling C object 'drivers/a715181@@tmp_rte_pmd_liquidio at sta/net_liquidio_lio_rxtx.c.o'.
[413/822] Linking static target drivers/libtmp_rte_pmd_liquidio.a.
[414/822] Generating rte_pmd_liquidio.pmd.c with a custom command.
[415/822] Compiling C object 'drivers/a715181@@rte_pmd_liquidio at sta/meson-generated_.._rte_pmd_liquidio.pmd.c.o'.
[416/822] Compiling C object 'drivers/a715181@@tmp_rte_pmd_netvsc at sta/net_netvsc_hn_nvs.c.o'.
[417/822] Linking static target drivers/librte_pmd_liquidio.a.
[418/822] Compiling C object 'drivers/a715181@@rte_pmd_liquidio at sha/meson-generated_.._rte_pmd_liquidio.pmd.c.o'.
[419/822] Compiling C object 'drivers/a715181@@tmp_rte_pmd_ixgbe at sta/net_ixgbe_ixgbe_rxtx.c.o'.
[420/822] Linking target drivers/librte_pmd_liquidio.so.1.1.
[421/822] Linking static target drivers/libtmp_rte_pmd_ixgbe.a.
[422/822] Compiling C object 'drivers/a715181@@tmp_rte_pmd_netvsc at sta/net_netvsc_hn_rndis.c.o'.
[423/822] Compiling C object 'drivers/a715181@@tmp_rte_pmd_nfp at sta/net_nfp_nfpcore_nfp_cpp_pcie_ops.c.o'.
[424/822] Compiling C object 'drivers/a715181@@tmp_rte_pmd_netvsc at sta/net_netvsc_hn_rxtx.c.o'.
[425/822] Generating rte_pmd_ixgbe.pmd.c with a custom command.
[426/822] Compiling C object 'drivers/a715181@@rte_pmd_ixgbe at sta/meson-generated_.._rte_pmd_ixgbe.pmd.c.o'.
[427/822] Compiling C object 'drivers/a715181@@tmp_rte_pmd_nfp at sta/net_nfp_nfpcore_nfp_nsp.c.o'.
[428/822] Compiling C object 'drivers/a715181@@rte_pmd_ixgbe at sha/meson-generated_.._rte_pmd_ixgbe.pmd.c.o'.
[429/822] Compiling C object 'drivers/a715181@@tmp_rte_pmd_netvsc at sta/net_netvsc_hn_vf.c.o'.
[430/822] Compiling C object 'drivers/a715181@@tmp_rte_pmd_nfp at sta/net_nfp_nfpcore_nfp_mip.c.o'.
[431/822] Linking static target drivers/libtmp_rte_pmd_netvsc.a.
[432/822] Linking static target drivers/librte_pmd_ixgbe.a.
[433/822] Generating rte_pmd_netvsc.pmd.c with a custom command.
[434/822] Compiling C object 'drivers/a715181@@rte_pmd_netvsc at sha/meson-generated_.._rte_pmd_netvsc.pmd.c.o'.
[435/822] Compiling C object 'drivers/a715181@@rte_pmd_netvsc at sta/meson-generated_.._rte_pmd_netvsc.pmd.c.o'.
[436/822] Linking target drivers/librte_pmd_ixgbe.so.2.1.
[437/822] Linking static target drivers/librte_pmd_netvsc.a.
[438/822] Compiling C object 'drivers/a715181@@tmp_rte_pmd_nfp at sta/net_nfp_nfpcore_nfp_resource.c.o'.
[439/822] Compiling C object 'drivers/a715181@@tmp_rte_pmd_nfp at sta/net_nfp_nfpcore_nfp_nffw.c.o'.
[440/822] Linking target drivers/librte_pmd_netvsc.so.2.1.
[441/822] Compiling C object 'drivers/a715181@@tmp_rte_pmd_nfp at sta/net_nfp_nfpcore_nfp_cppcore.c.o'.
[442/822] Compiling C object 'drivers/a715181@@tmp_rte_pmd_nfp at sta/net_nfp_nfpcore_nfp_rtsym.c.o'.
[443/822] Compiling C object 'drivers/a715181@@tmp_rte_pmd_nfp at sta/net_nfp_nfpcore_nfp_nsp_cmds.c.o'.
[444/822] Compiling C object 'drivers/a715181@@tmp_rte_pmd_nfp at sta/net_nfp_nfpcore_nfp_nsp_eth.c.o'.
[445/822] Compiling C object 'drivers/a715181@@tmp_rte_pmd_nfp at sta/net_nfp_nfpcore_nfp_hwinfo.c.o'.
[446/822] Compiling C object 'drivers/a715181@@tmp_rte_pmd_octeontx at sta/net_octeontx_octeontx_ethdev.c.o'.
[447/822] Generating symbol file 'drivers/a715181@@rte_pmd_ixgbe at sha/librte_pmd_ixgbe.so.2.1.symbols'.
[448/822] Compiling C object 'drivers/a715181@@tmp_rte_pmd_nfp at sta/net_nfp_nfpcore_nfp_mutex.c.o'.
[449/822] Compiling C object 'drivers/a715181@@tmp_rte_pmd_null at sta/net_null_rte_eth_null.c.o'.
[450/822] Linking static target drivers/libtmp_rte_pmd_null.a.
[451/822] Generating rte_pmd_null.pmd.c with a custom command.
[452/822] Compiling C object 'drivers/a715181@@tmp_rte_pmd_octeontx at sta/net_octeontx_octeontx_rxtx.c.o'.
[453/822] Compiling C object 'drivers/a715181@@rte_pmd_null at sta/meson-generated_.._rte_pmd_null.pmd.c.o'.
[454/822] Compiling C object 'drivers/a715181@@rte_pmd_null at sha/meson-generated_.._rte_pmd_null.pmd.c.o'.
[455/822] Linking static target drivers/librte_pmd_null.a.
[456/822] Linking static target drivers/libtmp_rte_pmd_octeontx.a.
[457/822] Generating rte_pmd_octeontx.pmd.c with a custom command.
[458/822] Linking target drivers/librte_pmd_null.so.2.1.
[459/822] Compiling C object 'drivers/a715181@@rte_pmd_octeontx at sha/meson-generated_.._rte_pmd_octeontx.pmd.c.o'.
[460/822] Compiling C object 'drivers/a715181@@rte_pmd_octeontx at sta/meson-generated_.._rte_pmd_octeontx.pmd.c.o'.
[461/822] Compiling C object 'drivers/a715181@@tmp_rte_pmd_octeontx2 at sta/net_octeontx2_otx2_mac.c.o'.
[462/822] Compiling C object 'drivers/a715181@@tmp_rte_pmd_octeontx2 at sta/net_octeontx2_otx2_link.c.o'.
[463/822] Linking static target drivers/librte_pmd_octeontx.a.
[464/822] Linking target drivers/librte_pmd_octeontx.so.1.1.
[465/822] Compiling C object 'drivers/a715181@@tmp_rte_pmd_octeontx2 at sta/net_octeontx2_otx2_ptp.c.o'.
[466/822] Compiling C object 'drivers/a715181@@tmp_rte_pmd_nfp at sta/net_nfp_nfp_net.c.o'.
[467/822] Linking static target drivers/libtmp_rte_pmd_nfp.a.
[468/822] Compiling C object 'drivers/a715181@@tmp_rte_pmd_octeontx2 at sta/net_octeontx2_otx2_lookup.c.o'.
[469/822] Generating rte_pmd_nfp.pmd.c with a custom command.
[470/822] Compiling C object 'drivers/a715181@@rte_pmd_nfp at sta/meson-generated_.._rte_pmd_nfp.pmd.c.o'.
[471/822] Compiling C object 'drivers/a715181@@tmp_rte_pmd_octeontx2 at sta/net_octeontx2_otx2_tm.c.o'.
[472/822] Compiling C object 'drivers/a715181@@rte_pmd_nfp at sha/meson-generated_.._rte_pmd_nfp.pmd.c.o'.
[473/822] Linking static target drivers/librte_pmd_nfp.a.
[474/822] Compiling C object 'drivers/a715181@@tmp_rte_pmd_octeontx2 at sta/net_octeontx2_otx2_flow_ctrl.c.o'.
[475/822] Compiling C object 'drivers/a715181@@tmp_rte_pmd_octeontx2 at sta/net_octeontx2_otx2_stats.c.o'.
[476/822] Linking target drivers/librte_pmd_nfp.so.1.1.
[477/822] Compiling C object 'drivers/a715181@@tmp_rte_pmd_octeontx2 at sta/net_octeontx2_otx2_flow.c.o'.
[478/822] Generating symbol file 'drivers/a715181@@rte_pmd_octeontx at sha/librte_pmd_octeontx.so.1.1.symbols'.
[479/822] Compiling C object 'drivers/a715181@@tmp_rte_pmd_octeontx2 at sta/net_octeontx2_otx2_vlan.c.o'.
[480/822] Compiling C object 'drivers/a715181@@tmp_rte_pmd_octeontx2 at sta/net_octeontx2_otx2_ethdev.c.o'.
[481/822] Compiling C object 'drivers/a715181@@tmp_rte_pmd_octeontx2 at sta/net_octeontx2_otx2_flow_parse.c.o'.
[482/822] Compiling C object 'drivers/a715181@@tmp_rte_pmd_octeontx2 at sta/net_octeontx2_otx2_ethdev_debug.c.o'.
[483/822] Compiling C object 'drivers/a715181@@tmp_rte_pmd_octeontx2 at sta/net_octeontx2_otx2_ethdev_ops.c.o'.
[484/822] Compiling C object 'drivers/a715181@@tmp_rte_pmd_octeontx2 at sta/net_octeontx2_otx2_ethdev_irq.c.o'.
[485/822] Compiling C object 'drivers/a715181@@tmp_rte_pmd_octeontx2 at sta/net_octeontx2_otx2_flow_utils.c.o'.
[486/822] Linking static target drivers/libtmp_rte_pmd_octeontx2.a.
[487/822] Compiling C object 'drivers/a715181@@tmp_rte_pmd_ring at sta/net_ring_rte_eth_ring.c.o'.
[488/822] Compiling C object 'drivers/a715181@@tmp_rte_pmd_sfc at sta/net_sfc_sfc_mcdi.c.o'.
[489/822] Linking static target drivers/libtmp_rte_pmd_ring.a.
[490/822] Generating rte_pmd_ring.pmd.c with a custom command.
[491/822] Compiling C object 'drivers/a715181@@tmp_rte_pmd_sfc at sta/net_sfc_sfc_intr.c.o'.
[492/822] Compiling C object 'drivers/a715181@@rte_pmd_ring at sta/meson-generated_.._rte_pmd_ring.pmd.c.o'.
[493/822] Linking static target drivers/librte_pmd_ring.a.
[494/822] Compiling C object 'drivers/a715181@@tmp_rte_pmd_sfc at sta/net_sfc_sfc_kvargs.c.o'.
[495/822] Compiling C object 'drivers/a715181@@rte_pmd_ring at sha/meson-generated_.._rte_pmd_ring.pmd.c.o'.
[496/822] Generating rte_pmd_octeontx2.pmd.c with a custom command.
[497/822] Compiling C object 'drivers/a715181@@tmp_rte_pmd_sfc at sta/net_sfc_sfc_ethdev.c.o'.
[498/822] Compiling C object 'drivers/a715181@@rte_pmd_octeontx2 at sta/meson-generated_.._rte_pmd_octeontx2.pmd.c.o'.
[499/822] Compiling C object 'drivers/a715181@@rte_pmd_octeontx2 at sha/meson-generated_.._rte_pmd_octeontx2.pmd.c.o'.
[500/822] Linking static target drivers/librte_pmd_octeontx2.a.
[501/822] Linking target drivers/librte_pmd_ring.so.2.1.
[502/822] Linking target drivers/librte_pmd_octeontx2.so.1.1.
[503/822] Compiling C object 'drivers/a715181@@tmp_rte_pmd_sfc at sta/net_sfc_sfc_port.c.o'.
[504/822] Compiling C object 'drivers/a715181@@tmp_rte_pmd_sfc at sta/net_sfc_sfc.c.o'.
[505/822] Compiling C object 'drivers/a715181@@tmp_rte_pmd_sfc at sta/net_sfc_sfc_ev.c.o'.
[506/822] Generating symbol file 'drivers/a715181@@rte_pmd_ring at sha/librte_pmd_ring.so.2.1.symbols'.
[507/822] Compiling C object 'drivers/a715181@@tmp_rte_pmd_sfc at sta/net_sfc_sfc_filter.c.o'.
[508/822] Compiling C object 'drivers/a715181@@tmp_rte_pmd_sfc at sta/net_sfc_sfc_tso.c.o'.
[509/822] Compiling C object 'drivers/a715181@@tmp_rte_pmd_pcap at sta/net_pcap_rte_eth_pcap.c.o'.
[510/822] Linking static target drivers/libtmp_rte_pmd_pcap.a.
[511/822] Generating rte_pmd_pcap.pmd.c with a custom command.
[512/822] Compiling C object 'drivers/a715181@@tmp_rte_pmd_sfc at sta/net_sfc_sfc_tx.c.o'.
[513/822] Compiling C object 'drivers/a715181@@rte_pmd_pcap at sta/meson-generated_.._rte_pmd_pcap.pmd.c.o'.
[514/822] Compiling C object 'drivers/a715181@@rte_pmd_pcap at sha/meson-generated_.._rte_pmd_pcap.pmd.c.o'.
[515/822] Generating symbol file 'drivers/a715181@@rte_pmd_octeontx2 at sha/librte_pmd_octeontx2.so.1.1.symbols'.
[516/822] Linking static target drivers/librte_pmd_pcap.a.
[517/822] Linking target drivers/librte_pmd_pcap.so.1.1.
[518/822] Compiling C object 'drivers/a715181@@tmp_rte_pmd_sfc at sta/net_sfc_sfc_ef10_rx.c.o'.
[519/822] Compiling C object 'drivers/a715181@@tmp_rte_pmd_sfc at sta/net_sfc_sfc_rx.c.o'.
[520/822] Compiling C object 'drivers/a715181@@tmp_rte_pmd_sfc at sta/net_sfc_sfc_ef10_tx.c.o'.
[521/822] Compiling C object 'drivers/a715181@@tmp_rte_pmd_softnic at sta/net_softnic_rte_eth_softnic_tap.c.o'.
[522/822] Compiling C object 'drivers/a715181@@tmp_rte_pmd_softnic at sta/net_softnic_rte_eth_softnic_mempool.c.o'.
[523/822] Compiling C object 'drivers/a715181@@tmp_rte_pmd_softnic at sta/net_softnic_rte_eth_softnic_pipeline.c.o'.
[524/822] Compiling C object 'drivers/a715181@@tmp_rte_pmd_sfc at sta/net_sfc_sfc_ef10_essb_rx.c.o'.
[525/822] Compiling C object 'drivers/a715181@@tmp_rte_pmd_sfc at sta/net_sfc_sfc_flow.c.o'.
[526/822] Linking static target drivers/libtmp_rte_pmd_sfc.a.
[527/822] Compiling C object 'drivers/a715181@@tmp_rte_pmd_softnic at sta/net_softnic_rte_eth_softnic_action.c.o'.
[528/822] Compiling C object 'drivers/a715181@@tmp_rte_pmd_softnic at sta/net_softnic_rte_eth_softnic_cryptodev.c.o'.
[529/822] Compiling C object 'drivers/a715181@@tmp_rte_pmd_softnic at sta/net_softnic_rte_eth_softnic.c.o'.
[530/822] Generating rte_pmd_sfc.pmd.c with a custom command.
[531/822] Compiling C object 'drivers/a715181@@rte_pmd_sfc at sha/meson-generated_.._rte_pmd_sfc.pmd.c.o'.
[532/822] Compiling C object 'drivers/a715181@@rte_pmd_sfc at sta/meson-generated_.._rte_pmd_sfc.pmd.c.o'.
[533/822] Compiling C object 'drivers/a715181@@tmp_rte_pmd_softnic at sta/net_softnic_rte_eth_softnic_link.c.o'.
[534/822] Compiling C object 'drivers/a715181@@tmp_rte_pmd_softnic at sta/net_softnic_rte_eth_softnic_swq.c.o'.
[535/822] Linking static target drivers/librte_pmd_sfc.a.
[536/822] Linking target drivers/librte_pmd_sfc.so.1.1.
[537/822] Compiling C object 'drivers/a715181@@tmp_rte_pmd_softnic at sta/net_softnic_rte_eth_softnic_meter.c.o'.
[538/822] Compiling C object 'drivers/a715181@@tmp_rte_pmd_tap at sta/net_tap_tap_bpf_api.c.o'.
[539/822] Compiling C object 'drivers/a715181@@tmp_rte_pmd_tap at sta/net_tap_tap_intr.c.o'.
[540/822] Compiling C object 'drivers/a715181@@tmp_rte_pmd_softnic at sta/net_softnic_rte_eth_softnic_tm.c.o'.
[541/822] Compiling C object 'drivers/a715181@@tmp_rte_pmd_softnic at sta/net_softnic_rte_eth_softnic_thread.c.o'.
[542/822] Compiling C object 'drivers/a715181@@tmp_rte_pmd_softnic at sta/net_softnic_rte_eth_softnic_flow.c.o'.
[543/822] Compiling C object 'drivers/a715181@@tmp_rte_pmd_tap at sta/net_tap_tap_flow.c.o'.
[544/822] Compiling C object 'drivers/net/thunderx/base/80ab7c6@@nicvf_base at sta/nicvf_bsvf.c.o'.
[545/822] Compiling C object 'drivers/net/thunderx/base/80ab7c6@@nicvf_base at sta/nicvf_hw.c.o'.
[546/822] Compiling C object 'drivers/a715181@@tmp_rte_pmd_softnic at sta/net_softnic_rte_eth_softnic_cli.c.o'.
[547/822] Linking static target drivers/libtmp_rte_pmd_softnic.a.
[548/822] Compiling C object 'drivers/net/thunderx/base/80ab7c6@@nicvf_base at sta/nicvf_mbox.c.o'.
[549/822] Linking static target drivers/net/thunderx/base/libnicvf_base.a.
[550/822] Generating rte_pmd_softnic.pmd.c with a custom command.
[551/822] Compiling C object 'drivers/a715181@@rte_pmd_softnic at sta/meson-generated_.._rte_pmd_softnic.pmd.c.o'.
[552/822] Compiling C object 'drivers/a715181@@rte_pmd_softnic at sha/meson-generated_.._rte_pmd_softnic.pmd.c.o'.
[553/822] Compiling C object 'drivers/a715181@@tmp_rte_pmd_vdev_netvsc at sta/net_vdev_netvsc_vdev_netvsc.c.o'.
[554/822] Compiling C object 'drivers/a715181@@tmp_rte_pmd_thunderx at sta/net_thunderx_nicvf_rxtx.c.o'.
[555/822] Linking static target drivers/librte_pmd_softnic.a.
[556/822] Linking static target drivers/libtmp_rte_pmd_vdev_netvsc.a.
[557/822] Generating rte_pmd_vdev_netvsc.pmd.c with a custom command.
[558/822] Linking target drivers/librte_pmd_softnic.so.1.1.
[559/822] Compiling C object 'drivers/a715181@@rte_pmd_vdev_netvsc at sta/meson-generated_.._rte_pmd_vdev_netvsc.pmd.c.o'.
[560/822] Compiling C object 'drivers/a715181@@rte_pmd_vdev_netvsc at sha/meson-generated_.._rte_pmd_vdev_netvsc.pmd.c.o'.
[561/822] Linking static target drivers/librte_pmd_vdev_netvsc.a.
[562/822] Linking target drivers/librte_pmd_vdev_netvsc.so.1.1.
[563/822] Compiling C object 'drivers/a715181@@tmp_rte_pmd_virtio at sta/net_virtio_virtio_user_vhost_kernel_tap.c.o'.
[564/822] Compiling C object 'drivers/a715181@@tmp_rte_pmd_vhost at sta/net_vhost_rte_eth_vhost.c.o'.
[565/822] Linking static target drivers/libtmp_rte_pmd_vhost.a.
[566/822] Generating rte_pmd_vhost.pmd.c with a custom command.
[567/822] Compiling C object 'drivers/a715181@@tmp_rte_pmd_virtio at sta/net_virtio_virtio_rxtx_simple.c.o'.
[568/822] Compiling C object 'drivers/a715181@@rte_pmd_vhost at sha/meson-generated_.._rte_pmd_vhost.pmd.c.o'.
[569/822] Compiling C object 'drivers/a715181@@rte_pmd_vhost at sta/meson-generated_.._rte_pmd_vhost.pmd.c.o'.
[570/822] Linking static target drivers/librte_pmd_vhost.a.
[571/822] Generating symbol file 'drivers/a715181@@rte_pmd_softnic at sha/librte_pmd_softnic.so.1.1.symbols'.
[572/822] Compiling C object 'drivers/a715181@@tmp_rte_pmd_tap at sta/net_tap_rte_eth_tap.c.o'.
[573/822] Linking static target drivers/libtmp_rte_pmd_tap.a.
[574/822] Linking target drivers/librte_pmd_vhost.so.2.1.
[575/822] Compiling C object 'drivers/a715181@@tmp_rte_pmd_virtio at sta/net_virtio_virtio_pci.c.o'.
[576/822] Generating rte_pmd_tap.pmd.c with a custom command.
[577/822] Compiling C object 'drivers/a715181@@rte_pmd_tap at sta/meson-generated_.._rte_pmd_tap.pmd.c.o'.
[578/822] Linking static target drivers/librte_pmd_tap.a.
[579/822] Compiling C object 'drivers/a715181@@tmp_rte_pmd_virtio at sta/net_virtio_virtio_ethdev.c.o'.
[580/822] Compiling C object 'drivers/a715181@@rte_pmd_tap at sha/meson-generated_.._rte_pmd_tap.pmd.c.o'.
[581/822] Compiling C object 'drivers/a715181@@tmp_rte_pmd_thunderx at sta/net_thunderx_nicvf_ethdev.c.o'.
[582/822] Linking static target drivers/libtmp_rte_pmd_thunderx.a.
[583/822] Linking target drivers/librte_pmd_tap.so.1.1.
[584/822] Generating rte_pmd_thunderx.pmd.c with a custom command.
[585/822] Compiling C object 'drivers/a715181@@rte_pmd_thunderx at sta/meson-generated_.._rte_pmd_thunderx.pmd.c.o'.
[586/822] Compiling C object 'drivers/a715181@@tmp_rte_pmd_virtio at sta/net_virtio_virtio_rxtx_simple_sse.c.o'.
[587/822] Linking static target drivers/librte_pmd_thunderx.a.
[588/822] Compiling C object 'drivers/a715181@@rte_pmd_thunderx at sha/meson-generated_.._rte_pmd_thunderx.pmd.c.o'.
[589/822] Linking target drivers/librte_pmd_thunderx.so.1.1.
[590/822] Compiling C object 'drivers/a715181@@tmp_rte_pmd_virtio at sta/net_virtio_virtio_user_vhost_kernel.c.o'.
[591/822] Compiling C object 'drivers/a715181@@tmp_rte_pmd_virtio at sta/net_virtio_virtio_user_ethdev.c.o'.
[592/822] Compiling C object 'drivers/a715181@@tmp_rte_pmd_virtio at sta/net_virtio_virtio_user_virtio_user_dev.c.o'.
[593/822] Compiling C object 'drivers/a715181@@tmp_rte_pmd_virtio at sta/net_virtio_virtio_user_vhost_user.c.o'.
[594/822] Compiling C object 'drivers/a715181@@tmp_rte_pmd_virtio at sta/net_virtio_virtqueue.c.o'.
[595/822] Compiling C object 'drivers/a715181@@tmp_rte_pmd_dpaa_event at sta/event_dpaa_dpaa_eventdev.c.o'.
[596/822] Linking static target drivers/libtmp_rte_pmd_dpaa_event.a.
[597/822] Generating rte_pmd_dpaa_event.pmd.c with a custom command.
[598/822] Compiling C object 'drivers/a715181@@rte_pmd_dpaa_event at sta/meson-generated_.._rte_pmd_dpaa_event.pmd.c.o'.
[599/822] Compiling C object 'drivers/a715181@@tmp_rte_pmd_dpaa2_event at sta/event_dpaa2_dpaa2_hw_dpcon.c.o'.
[600/822] Compiling C object 'drivers/a715181@@rte_pmd_dpaa_event at sha/meson-generated_.._rte_pmd_dpaa_event.pmd.c.o'.
[601/822] Linking static target drivers/librte_pmd_dpaa_event.a.
[602/822] Linking target drivers/librte_pmd_dpaa_event.so.1.1.
[603/822] Compiling C object 'drivers/a715181@@tmp_rte_pmd_octeontx2_event at sta/event_octeontx2_otx2_evdev_irq.c.o'.
[604/822] Compiling C object 'drivers/a715181@@tmp_rte_pmd_vmxnet3 at sta/net_vmxnet3_vmxnet3_ethdev.c.o'.
[605/822] Compiling C object 'drivers/a715181@@tmp_rte_pmd_dpaa2_event at sta/event_dpaa2_dpaa2_eventdev.c.o'.
[606/822] Linking static target drivers/libtmp_rte_pmd_dpaa2_event.a.
[607/822] Generating rte_pmd_dpaa2_event.pmd.c with a custom command.
[608/822] Compiling C object 'drivers/a715181@@rte_pmd_dpaa2_event at sta/meson-generated_.._rte_pmd_dpaa2_event.pmd.c.o'.
[609/822] Compiling C object 'drivers/a715181@@rte_pmd_dpaa2_event at sha/meson-generated_.._rte_pmd_dpaa2_event.pmd.c.o'.
[610/822] Linking static target drivers/librte_pmd_dpaa2_event.a.
[611/822] Linking target drivers/librte_pmd_dpaa2_event.so.2.1.
[612/822] Compiling C object 'drivers/a715181@@tmp_rte_pmd_vmxnet3 at sta/net_vmxnet3_vmxnet3_rxtx.c.o'.
[613/822] Linking static target drivers/libtmp_rte_pmd_vmxnet3.a.
[614/822] Compiling C object 'drivers/a715181@@tmp_rte_pmd_octeontx2_event at sta/event_octeontx2_otx2_evdev_adptr.c.o'.
[615/822] Generating rte_pmd_vmxnet3.pmd.c with a custom command.
[616/822] Compiling C object 'drivers/a715181@@rte_pmd_vmxnet3 at sta/meson-generated_.._rte_pmd_vmxnet3.pmd.c.o'.
[617/822] Compiling C object 'drivers/a715181@@rte_pmd_vmxnet3 at sha/meson-generated_.._rte_pmd_vmxnet3.pmd.c.o'.
[618/822] Linking static target drivers/librte_pmd_vmxnet3.a.
[619/822] Linking target drivers/librte_pmd_vmxnet3.so.1.1.
[620/822] Compiling C object 'drivers/a715181@@tmp_rte_pmd_octeontx2_event at sta/event_octeontx2_otx2_tim_evdev.c.o'.
[621/822] Compiling C object 'drivers/a715181@@tmp_rte_pmd_opdl_event at sta/event_opdl_opdl_test.c.o'.
[622/822] Linking static target drivers/libtmp_rte_pmd_opdl_event.a.
[623/822] Generating rte_pmd_opdl_event.pmd.c with a custom command.
[624/822] Compiling C object 'drivers/a715181@@rte_pmd_opdl_event at sha/meson-generated_.._rte_pmd_opdl_event.pmd.c.o'.
[625/822] Compiling C object 'drivers/a715181@@rte_pmd_opdl_event at sta/meson-generated_.._rte_pmd_opdl_event.pmd.c.o'.
[626/822] Linking static target drivers/librte_pmd_opdl_event.a.
[627/822] Linking target drivers/librte_pmd_opdl_event.so.1.1.
[628/822] Compiling C object 'drivers/a715181@@tmp_rte_pmd_virtio at sta/net_virtio_virtio_rxtx.c.o'.
[629/822] Linking static target drivers/libtmp_rte_pmd_virtio.a.
[630/822] Generating rte_pmd_virtio.pmd.c with a custom command.
[631/822] Compiling C object 'drivers/a715181@@rte_pmd_virtio at sta/meson-generated_.._rte_pmd_virtio.pmd.c.o'.
[632/822] Compiling C object 'drivers/a715181@@rte_pmd_virtio at sha/meson-generated_.._rte_pmd_virtio.pmd.c.o'.
[633/822] Linking static target drivers/librte_pmd_virtio.a.
[634/822] Compiling C object 'drivers/a715181@@tmp_rte_pmd_dpaa_sec at sta/crypto_dpaa_sec_dpaa_sec.c.o'.
[635/822] Linking static target drivers/libtmp_rte_pmd_dpaa_sec.a.
[636/822] Linking target drivers/librte_pmd_virtio.so.1.1.
[637/822] Generating rte_pmd_dpaa_sec.pmd.c with a custom command.
[638/822] Compiling C object 'drivers/a715181@@rte_pmd_dpaa_sec at sta/meson-generated_.._rte_pmd_dpaa_sec.pmd.c.o'.
[639/822] Compiling C object 'drivers/a715181@@rte_pmd_dpaa_sec at sha/meson-generated_.._rte_pmd_dpaa_sec.pmd.c.o'.
[640/822] Linking static target drivers/librte_pmd_dpaa_sec.a.
[641/822] Compiling C object 'drivers/a715181@@tmp_rte_pmd_octeontx_event at sta/event_octeontx_ssovf_evdev.c.o'.
[642/822] Linking target drivers/librte_pmd_dpaa_sec.so.1.1.
[643/822] Compiling C object 'drivers/a715181@@tmp_rte_pmd_octeontx2_event at sta/event_octeontx2_otx2_evdev.c.o'.
[644/822] Compiling C object 'drivers/a715181@@tmp_rte_pmd_octeontx2_event at sta/event_octeontx2_otx2_evdev_selftest.c.o'.
[645/822] Compiling C object 'drivers/a715181@@tmp_rte_pmd_octeontx_event at sta/event_octeontx_timvf_probe.c.o'.
[646/822] Compiling C object 'drivers/a715181@@tmp_rte_pmd_octeontx_event at sta/event_octeontx_ssovf_worker.c.o'.
[647/822] Compiling C object 'drivers/a715181@@tmp_rte_pmd_octeontx_event at sta/event_octeontx_ssovf_probe.c.o'.
[648/822] Compiling C object 'app/a172ced@@dpdk-pdump at exe/pdump_main.c.o'.
[649/822] Linking target app/dpdk-pdump.
[650/822] Compiling C object 'app/a172ced@@dpdk-test-eventdev at exe/test-eventdev_evt_main.c.o'.
[651/822] Compiling C object 'app/a172ced@@dpdk-test-eventdev at exe/test-eventdev_evt_options.c.o'.
[652/822] Compiling C object 'app/a172ced@@dpdk-proc-info at exe/proc-info_main.c.o'.
[653/822] Linking target app/dpdk-proc-info.
[654/822] Compiling C object 'drivers/a715181@@tmp_rte_pmd_sw_event at sta/event_sw_sw_evdev_selftest.c.o'.
[655/822] Linking static target drivers/libtmp_rte_pmd_sw_event.a.
[656/822] Generating rte_pmd_sw_event.pmd.c with a custom command.
[657/822] Compiling C object 'drivers/a715181@@rte_pmd_sw_event at sta/meson-generated_.._rte_pmd_sw_event.pmd.c.o'.
[658/822] Linking static target drivers/librte_pmd_sw_event.a.
[659/822] Compiling C object 'app/a172ced@@dpdk-test-eventdev at exe/test-eventdev_test_order_common.c.o'.
[660/822] Compiling C object 'drivers/a715181@@rte_pmd_sw_event at sha/meson-generated_.._rte_pmd_sw_event.pmd.c.o'.
[661/822] Linking target drivers/librte_pmd_sw_event.so.1.1.
[662/822] Compiling C object 'app/a172ced@@dpdk-test-eventdev at exe/test-eventdev_test_order_atq.c.o'.
[663/822] Compiling C object 'app/a172ced@@dpdk-test-eventdev at exe/test-eventdev_test_order_queue.c.o'.
[664/822] Compiling C object 'app/a172ced@@dpdk-test-eventdev at exe/test-eventdev_test_perf_common.c.o'.
[665/822] Compiling C object 'app/a172ced@@dpdk-test-pipeline at exe/test-pipeline_pipeline_acl.c.o'.
[666/822] Compiling C object 'app/a172ced@@dpdk-test-eventdev at exe/test-eventdev_test_perf_atq.c.o'.
[667/822] Compiling C object 'app/a172ced@@dpdk-test-eventdev at exe/test-eventdev_test_perf_queue.c.o'.
[668/822] Linking target app/dpdk-test-eventdev.
[669/822] Compiling C object 'drivers/a715181@@tmp_rte_pmd_octeontx_event at sta/event_octeontx_ssovf_evdev_selftest.c.o'.
[670/822] Linking static target drivers/libtmp_rte_pmd_octeontx_event.a.
[671/822] Compiling C object 'app/a172ced@@dpdk-test-pipeline at exe/test-pipeline_main.c.o'.
[672/822] Compiling C object 'app/a172ced@@dpdk-test-pipeline at exe/test-pipeline_init.c.o'.
[673/822] Compiling C object 'app/a172ced@@dpdk-test-pipeline at exe/test-pipeline_runtime.c.o'.
[674/822] Generating rte_pmd_octeontx_event.pmd.c with a custom command.
[675/822] Compiling C object 'drivers/a715181@@rte_pmd_octeontx_event at sta/meson-generated_.._rte_pmd_octeontx_event.pmd.c.o'.
[676/822] Compiling C object 'app/a172ced@@dpdk-test-pipeline at exe/test-pipeline_config.c.o'.
[677/822] Linking static target drivers/librte_pmd_octeontx_event.a.
[678/822] Compiling C object 'drivers/a715181@@rte_pmd_octeontx_event at sha/meson-generated_.._rte_pmd_octeontx_event.pmd.c.o'.
[679/822] Linking target drivers/librte_pmd_octeontx_event.so.1.1.
[680/822] Compiling C object 'app/a172ced@@dpdk-test-pipeline at exe/test-pipeline_pipeline_lpm.c.o'.
[681/822] Compiling C object 'app/a172ced@@dpdk-test-pipeline at exe/test-pipeline_pipeline_hash.c.o'.
[682/822] Compiling C object 'app/a172ced@@dpdk-test-pipeline at exe/test-pipeline_pipeline_lpm_ipv6.c.o'.
[683/822] Linking target app/dpdk-test-pipeline.
[684/822] Compiling C object 'app/a172ced@@dpdk-testpmd at exe/test-pmd_cmdline_mtr.c.o'.
[685/822] Compiling C object 'app/a172ced@@dpdk-testpmd at exe/test-pmd_cmdline_tm.c.o'.
[686/822] Compiling C object 'app/a172ced@@dpdk-testpmd at exe/test-pmd_flowgen.c.o'.
[687/822] Compiling C object 'app/a172ced@@dpdk-testpmd at exe/test-pmd_config.c.o'.
[688/822] Compiling C object 'app/a172ced@@dpdk-testpmd at exe/test-pmd_icmpecho.c.o'.
[689/822] Compiling C object 'app/a172ced@@dpdk-testpmd at exe/test-pmd_cmdline_flow.c.o'.
[690/822] Compiling C object 'app/a172ced@@dpdk-testpmd at exe/test-pmd_csumonly.c.o'.
[691/822] Compiling C object 'app/a172ced@@dpdk-testpmd at exe/test-pmd_iofwd.c.o'.
[692/822] Compiling C object 'app/a172ced@@dpdk-testpmd at exe/test-pmd_macfwd.c.o'.
[693/822] Compiling C object 'app/a172ced@@dpdk-testpmd at exe/test-pmd_ieee1588fwd.c.o'.
[694/822] Compiling C object 'app/a172ced@@dpdk-testpmd at exe/test-pmd_macswap.c.o'.
[695/822] Compiling C object 'app/a172ced@@dpdk-testpmd at exe/test-pmd_rxonly.c.o'.
[696/822] Compiling C object 'app/a172ced@@dpdk-testpmd at exe/test-pmd_parameters.c.o'.
[697/822] Compiling C object 'app/a172ced@@dpdk-testpmd at exe/test-pmd_cmdline.c.o'.
[698/822] Compiling C object 'app/a172ced@@dpdk-testpmd at exe/test-pmd_txonly.c.o'.
[699/822] Compiling C object 'app/a172ced@@dpdk-testpmd at exe/test-pmd_noisy_vnf.c.o'.
[700/822] Compiling C object 'app/a172ced@@dpdk-testpmd at exe/test-pmd_util.c.o'.
[701/822] Compiling C object 'app/a172ced@@dpdk-testpmd at exe/test-pmd_softnicfwd.c.o'.
[702/822] Compiling C object 'app/a172ced@@dpdk-testpmd at exe/test-pmd_bpf_cmd.c.o'.
[703/822] Compiling C object 'app/test/3062f5d@@dpdk-test at exe/test_event_eth_rx_adapter.c.o'.
[704/822] Compiling C object 'app/test/3062f5d@@dpdk-test at exe/sample_packet_forward.c.o'.
[705/822] Compiling C object 'app/test/3062f5d@@dpdk-test at exe/test_event_eth_tx_adapter.c.o'.
[706/822] Compiling C object 'app/test/3062f5d@@dpdk-test at exe/test_flow_classify.c.o'.
[707/822] Compiling C object 'app/test/3062f5d@@dpdk-test at exe/test_interrupts.c.o'.
[708/822] Compiling C object 'app/a172ced@@dpdk-testpmd at exe/test-pmd_testpmd.c.o'.
[709/822] Linking target app/dpdk-testpmd.
[710/822] Compiling C object 'app/test/3062f5d@@dpdk-test at exe/test_kni.c.o'.
[711/822] Compiling C object 'app/test/3062f5d@@dpdk-test at exe/test_link_bonding_rssconf.c.o'.
[712/822] Compiling C object 'app/test/3062f5d@@dpdk-test at exe/test_pdump.c.o'.
[713/822] Compiling C object 'app/test/3062f5d@@dpdk-test at exe/test_event_timer_adapter.c.o'.
[714/822] Compiling C object 'app/test/3062f5d@@dpdk-test at exe/test_pmd_ring.c.o'.
[715/822] Compiling C object 'app/test/3062f5d@@dpdk-test at exe/test_pmd_ring_perf.c.o'.
[716/822] Compiling C object 'drivers/a715181@@tmp_rte_pmd_octeontx2_event at sta/event_octeontx2_otx2_worker.c.o'.
[717/822] Compiling C object 'app/test/3062f5d@@dpdk-test at exe/test_pmd_perf.c.o'.
[718/822] Compiling C object 'app/test/3062f5d@@dpdk-test at exe/test_link_bonding.c.o'.
[719/822] Compiling C object 'app/test/3062f5d@@dpdk-test at exe/virtual_pmd.c.o'.
[720/822] Compiling C object 'examples/c590b3c@@dpdk-eventdev_pipeline at exe/eventdev_pipeline_pipeline_worker_generic.c.o'.
[721/822] Compiling C object 'examples/c590b3c@@dpdk-bond at exe/bond_main.c.o'.
[722/822] Linking target examples/dpdk-bond.
[723/822] Compiling C object 'examples/c590b3c@@dpdk-eventdev_pipeline at exe/eventdev_pipeline_main.c.o'.
[724/822] Compiling C object 'examples/c590b3c@@dpdk-distributor at exe/distributor_main.c.o'.
[725/822] Compiling C object 'examples/c590b3c@@dpdk-eventdev_pipeline at exe/eventdev_pipeline_pipeline_worker_tx.c.o'.
[726/822] Compiling C object 'examples/c590b3c@@dpdk-exception_path at exe/exception_path_main.c.o'.
[727/822] Linking target examples/dpdk-distributor.
[728/822] Linking target examples/dpdk-eventdev_pipeline.
[729/822] Linking target examples/dpdk-exception_path.
[730/822] Compiling C object 'examples/c590b3c@@dpdk-flow_filtering at exe/flow_filtering_main.c.o'.
[731/822] Compiling C object 'examples/c590b3c@@dpdk-flow_classify at exe/flow_classify_flow_classify.c.o'.
[732/822] Compiling C object 'app/test/3062f5d@@dpdk-test at exe/test_link_bonding_mode4.c.o'.
[733/822] Linking target examples/dpdk-flow_filtering.
[734/822] Linking target examples/dpdk-flow_classify.
[735/822] Compiling C object 'examples/c590b3c@@dpdk-ip_pipeline at exe/ip_pipeline_kni.c.o'.
[736/822] Compiling C object 'drivers/a715181@@tmp_rte_pmd_octeontx2_event at sta/event_octeontx2_otx2_worker_dual.c.o'.
[737/822] Linking target app/test/dpdk-test.
[738/822] Linking static target drivers/libtmp_rte_pmd_octeontx2_event.a.
[739/822] Compiling C object 'examples/c590b3c@@dpdk-bbdev_app at exe/bbdev_app_main.c.o'.
[740/822] Compiling C object 'examples/c590b3c@@dpdk-ip_pipeline at exe/ip_pipeline_link.c.o'.
[741/822] Generating rte_pmd_octeontx2_event.pmd.c with a custom command.
[742/822] Linking target examples/dpdk-bbdev_app.
[743/822] Compiling C object 'drivers/a715181@@rte_pmd_octeontx2_event at sta/meson-generated_.._rte_pmd_octeontx2_event.pmd.c.o'.
[744/822] Compiling C object 'drivers/a715181@@rte_pmd_octeontx2_event at sha/meson-generated_.._rte_pmd_octeontx2_event.pmd.c.o'.
[745/822] Linking static target drivers/librte_pmd_octeontx2_event.a.
[746/822] Linking target drivers/librte_pmd_octeontx2_event.so.1.1.
[747/822] Compiling C object 'examples/c590b3c@@dpdk-ip_reassembly at exe/ip_reassembly_main.c.o'.
[748/822] Linking target examples/dpdk-ip_reassembly.
[749/822] Compiling C object 'examples/c590b3c@@dpdk-ip_fragmentation at exe/ip_fragmentation_main.c.o'.
[750/822] Compiling C object 'examples/c590b3c@@dpdk-ipsec-secgw at exe/ipsec-secgw_ipsec_process.c.o'.
[751/822] Linking target examples/dpdk-ip_fragmentation.
[752/822] Compiling C object 'examples/c590b3c@@dpdk-ipsec-secgw at exe/ipsec-secgw_sa.c.o'.
[753/822] Compiling C object 'examples/c590b3c@@dpdk-ip_pipeline at exe/ip_pipeline_cli.c.o'.
[754/822] Compiling C object 'examples/c590b3c@@dpdk-l2fwd at exe/l2fwd_main.c.o'.
[755/822] Linking target examples/dpdk-l2fwd.
[756/822] Linking target examples/dpdk-ip_pipeline.
[757/822] Compiling C object 'examples/c590b3c@@dpdk-kni at exe/kni_main.c.o'.
[758/822] Linking target examples/dpdk-kni.
[759/822] Compiling C object 'examples/c590b3c@@dpdk-ipv4_multicast at exe/ipv4_multicast_main.c.o'.
[760/822] Linking target examples/dpdk-ipv4_multicast.
[761/822] Compiling C object 'examples/c590b3c@@dpdk-l2fwd-keepalive at exe/l2fwd-keepalive_main.c.o'.
[762/822] Compiling C object 'examples/c590b3c@@dpdk-l2fwd-jobstats at exe/l2fwd-jobstats_main.c.o'.
[763/822] Linking target examples/dpdk-l2fwd-keepalive.
[764/822] Linking target examples/dpdk-l2fwd-jobstats.
[765/822] Compiling C object 'examples/c590b3c@@dpdk-ipsec-secgw at exe/ipsec-secgw_ipsec.c.o'.
[766/822] Compiling C object 'examples/c590b3c@@dpdk-l3fwd at exe/l3fwd_main.c.o'.
[767/822] Compiling C object 'examples/c590b3c@@dpdk-l3fwd at exe/l3fwd_l3fwd_lpm.c.o'.
[768/822] Compiling C object 'examples/c590b3c@@dpdk-l2fwd-crypto at exe/l2fwd-crypto_main.c.o'.
[769/822] Linking target examples/dpdk-l2fwd-crypto.
[770/822] Compiling C object 'examples/c590b3c@@dpdk-ipsec-secgw at exe/ipsec-secgw_ipsec-secgw.c.o'.
[771/822] Compiling C object 'examples/c590b3c@@dpdk-link_status_interrupt at exe/link_status_interrupt_main.c.o'.
[772/822] Compiling C object 'examples/c590b3c@@dpdk-load_balancer at exe/load_balancer_init.c.o'.
[773/822] Linking target examples/dpdk-link_status_interrupt.
[774/822] Linking target examples/dpdk-ipsec-secgw.
[775/822] Compiling C object 'examples/c590b3c@@dpdk-l3fwd at exe/l3fwd_l3fwd_em.c.o'.
[776/822] Compiling C object 'examples/c590b3c@@dpdk-l3fwd-vf at exe/l3fwd-vf_main.c.o'.
[777/822] Linking target examples/dpdk-l3fwd-vf.
[778/822] Linking target examples/dpdk-l3fwd.
[779/822] Compiling C object 'examples/c590b3c@@dpdk-load_balancer at exe/load_balancer_main.c.o'.
[780/822] Compiling C object 'examples/c590b3c@@dpdk-l3fwd-acl at exe/l3fwd-acl_main.c.o'.
[781/822] Compiling C object 'examples/c590b3c@@dpdk-load_balancer at exe/load_balancer_config.c.o'.
[782/822] Linking target examples/dpdk-l3fwd-acl.
[783/822] Compiling C object 'examples/c590b3c@@dpdk-mp_server at exe/multi_process_client_server_mp_mp_server_init.c.o'.
[784/822] Compiling C object 'examples/c590b3c@@dpdk-mp_client at exe/multi_process_client_server_mp_mp_client_client.c.o'.
[785/822] Linking target examples/dpdk-mp_client.
[786/822] Compiling C object 'examples/c590b3c@@dpdk-hotplug_mp at exe/multi_process_hotplug_mp_commands.c.o'.
[787/822] Linking target examples/dpdk-hotplug_mp.
[788/822] Compiling C object 'examples/c590b3c@@dpdk-load_balancer at exe/load_balancer_runtime.c.o'.
[789/822] Linking target examples/dpdk-load_balancer.
[790/822] Compiling C object 'examples/c590b3c@@dpdk-ptpclient at exe/ptpclient_ptpclient.c.o'.
[791/822] Compiling C object 'examples/c590b3c@@dpdk-mp_server at exe/multi_process_client_server_mp_mp_server_main.c.o'.
[792/822] Linking target examples/dpdk-ptpclient.
[793/822] Compiling C object 'examples/c590b3c@@dpdk-qos_meter at exe/qos_meter_main.c.o'.
[794/822] Linking target examples/dpdk-mp_server.
[795/822] Linking target examples/dpdk-qos_meter.
[796/822] Compiling C object 'examples/c590b3c@@dpdk-symmetric_mp at exe/multi_process_symmetric_mp_main.c.o'.
[797/822] Linking target examples/dpdk-symmetric_mp.
[798/822] Compiling C object 'examples/c590b3c@@dpdk-qos_sched at exe/qos_sched_app_thread.c.o'.
[799/822] Compiling C object 'examples/c590b3c@@dpdk-qos_sched at exe/qos_sched_main.c.o'.
[800/822] Compiling C object 'examples/c590b3c@@dpdk-qos_sched at exe/qos_sched_init.c.o'.
[801/822] Linking target examples/dpdk-qos_sched.
[802/822] Compiling C object 'examples/c590b3c@@dpdk-rxtx_callbacks at exe/rxtx_callbacks_main.c.o'.
[803/822] Compiling C object 'examples/c590b3c@@dpdk-skeleton at exe/skeleton_basicfwd.c.o'.
[804/822] Linking target examples/dpdk-rxtx_callbacks.
[805/822] Compiling C object 'examples/c590b3c@@dpdk-packet_ordering at exe/packet_ordering_main.c.o'.
[806/822] Compiling C object 'examples/c590b3c@@dpdk-vdpa at exe/vdpa_main.c.o'.
[807/822] Linking target examples/dpdk-skeleton.
[808/822] Linking target examples/dpdk-packet_ordering.
[809/822] Linking target examples/dpdk-vdpa.
[810/822] Compiling C object 'examples/c590b3c@@dpdk-l3fwd-power at exe/l3fwd-power_main.c.o'.
[811/822] Linking target examples/dpdk-l3fwd-power.
[812/822] Compiling C object 'examples/c590b3c@@dpdk-tep_termination at exe/tep_termination_vxlan_setup.c.o'.
[813/822] Compiling C object 'examples/c590b3c@@dpdk-tep_termination at exe/tep_termination_main.c.o'.
[814/822] Compiling C object 'examples/c590b3c@@dpdk-vhost_scsi at exe/vhost_scsi_scsi.c.o'.
[815/822] Linking target examples/dpdk-tep_termination.
[816/822] Compiling C object 'examples/c590b3c@@dpdk-vhost_scsi at exe/vhost_scsi_vhost_scsi.c.o'.
FAILED: examples/c590b3c@@dpdk-vhost_scsi at exe/vhost_scsi_vhost_scsi.c.o 
gcc -Iexamples/c590b3c@@dpdk-vhost_scsi at exe -Iexamples -I../examples -Iexamples/vhost_scsi -I../examples/vhost_scsi -I. -I../ -Iconfig -I../config -Ilib/librte_eal/common/include -I../lib/librte_eal/common/include -I../lib/librte_eal/linux/eal/include -Ilib/librte_eal/common -I../lib/librte_eal/common -Ilib/librte_eal/common/include/arch/x86 -I../lib/librte_eal/common/include/arch/x86 -Ilib/librte_eal -I../lib/librte_eal -Ilib/librte_kvargs -I../lib/librte_kvargs -Ilib/librte_mempool -I../lib/librte_mempool -Ilib/librte_ring -I../lib/librte_ring -Ilib/librte_net -I../lib/librte_net -Ilib/librte_mbuf -I../lib/librte_mbuf -Ilib/librte_ethdev -I../lib/librte_ethdev -Ilib/librte_meter -I../lib/librte_meter -Ilib/librte_cmdline -I../lib/librte_cmdline -Ilib/librte_vhost -I../lib/librte_vhost -Ilib/librte_cryptodev -I../lib/librte_cryptodev -Ilib/librte_hash -I../lib/librte_hash -Ilib/librte_pci -I../lib/librte_pci -fdiagnostics-color=always -pipe -D_FILE_OFFSET_BITS=64 -Wall -Winvalid-pch -Werror -O3 -include rte_config.h -Wunused-parameter -Wsign-compare -Wcast-qual -D_GNU_SOURCE -march=native -Wno-format-truncation -MD -MQ 'examples/c590b3c@@dpdk-vhost_scsi at exe/vhost_scsi_vhost_scsi.c.o' -MF 'examples/c590b3c@@dpdk-vhost_scsi at exe/vhost_scsi_vhost_scsi.c.o.d' -o 'examples/c590b3c@@dpdk-vhost_scsi at exe/vhost_scsi_vhost_scsi.c.o' -c ../examples/vhost_scsi/vhost_scsi.c
../examples/vhost_scsi/vhost_scsi.c: In function ‘gpa_to_vva’:
../examples/vhost_scsi/vhost_scsi.c:61:2: error: ‘rte_vhost_va_from_guest_pa’ is deprecated: Symbol is not yet part of stable ABI [-Werror=deprecated-declarations]
  return rte_vhost_va_from_guest_pa(ctrlr->mem, gpa, len);
  ^~~~~~
In file included from ../examples/vhost_scsi/vhost_scsi.c:18:0:
../lib/librte_vhost/rte_vhost.h:238:1: note: declared here
 rte_vhost_va_from_guest_pa(struct rte_vhost_memory *mem,
 ^~~~~~~~~~~~~~~~~~~~~~~~~~
cc1: all warnings being treated as errors
[817/822] Compiling C object 'examples/c590b3c@@dpdk-vhost_crypto at exe/vhost_crypto_main.c.o'.
[818/822] Compiling C object 'examples/c590b3c@@dpdk-vhost at exe/vhost_virtio_net.c.o'.
[819/822] Compiling C object 'examples/c590b3c@@dpdk-vhost at exe/vhost_main.c.o'.
ninja: build stopped: subcommand failed.
ninja -C build-clang-static
ninja: Entering directory `build-clang-static'
[0/1] Regenerating build files.
The Meson build system
Version: 0.50.1
Source dir: /tmp/SUSE15-64_K4.12.14_GCC7.3.1/x86_64-native-linuxapp-gcc/f54e1db45cd243e78997de60e0477310/dpdk
Build dir: /tmp/SUSE15-64_K4.12.14_GCC7.3.1/x86_64-native-linuxapp-gcc/f54e1db45cd243e78997de60e0477310/dpdk/build-clang-static
Build type: native build
Program cat found: YES (/usr/bin/cat)
Project name: DPDK
Project version: 19.11.0-rc0
Native C compiler: clang (clang 5.0.1 "clang version 5.0.1 (tags/RELEASE_501/final 312548)")
Build machine cpu family: x86_64
Build machine cpu: x86_64
Program ../buildtools/symlink-drivers-solibs.sh found: YES (/bin/sh /tmp/SUSE15-64_K4.12.14_GCC7.3.1/x86_64-native-linuxapp-gcc/f54e1db45cd243e78997de60e0477310/dpdk/config/../buildtools/symlink-drivers-solibs.sh)
Checking for size of "void *" : 8
Library libm found: YES
Library numa found: YES
Has header "numaif.h" : YES
Found pkg-config: /usr/bin/pkg-config (0.29.2)
Did not find CMake 'cmake'
Found CMake: NO
Dependency libbsd found: NO (tried pkgconfig and cmake)
Compiler for C supports arguments -Wunused-parameter: YES
Compiler for C supports arguments -Wsign-compare: YES
Compiler for C supports arguments -Wcast-qual: YES
Compiler for C supports arguments -Wno-address-of-packed-member: YES
Fetching value of define "__SSE4_2__" : 1
Fetching value of define "__AES__" : 1
Fetching value of define "__PCLMUL__" : 1
Fetching value of define "__AVX__" : 1
Fetching value of define "__AVX2__" : 1
Fetching value of define "__AVX512F__" : 
Fetching value of define "__RDRND__" : 1
Fetching value of define "__RDSEED__" : 1
Program gen-pmdinfo-cfile.sh found: YES (/tmp/SUSE15-64_K4.12.14_GCC7.3.1/x86_64-native-linuxapp-gcc/f54e1db45cd243e78997de60e0477310/dpdk/buildtools/gen-pmdinfo-cfile.sh)
Using meson's python ['/usr/bin/python3']
Compiler for C supports arguments -Wno-format-truncation: NO
Checking for function "getentropy" : YES
Has header "linux/userfaultfd.h" : YES
Dependency libelf found: YES (cached)
Dependency jansson found: NO (tried pkgconfig and cmake)
Compiler for C supports arguments -Wno-format-truncation: NO
Library libmusdk found: NO
Compiler for C supports arguments -Wno-cast-qual: YES
Dependency libbpf found: NO (tried pkgconfig and cmake)
Library bpf found: NO
Dependency zlib found: YES (cached)
Compiler for C supports arguments -Wno-uninitialized: YES
Compiler for C supports arguments -Wno-unused-parameter: YES
Compiler for C supports arguments -Wno-unused-variable: YES
Compiler for C supports arguments -Wno-misleading-indentation: NO
Compiler for C supports arguments -Wno-implicit-fallthrough: YES
Compiler for C supports arguments -Wno-unused-parameter: YES
Compiler for C supports arguments -Wno-unused-value: YES
Compiler for C supports arguments -Wno-strict-aliasing: YES
Compiler for C supports arguments -Wno-format-extra-args: YES
Compiler for C supports arguments -Wno-unused-variable: YES
Compiler for C supports arguments -Wno-missing-field-initializers: YES
Compiler for C supports arguments -Wno-sign-compare: YES
Compiler for C supports arguments -Wno-unused-value: YES
Compiler for C supports arguments -Wno-format: YES
Compiler for C supports arguments -Wno-error=format-security: YES
Compiler for C supports arguments -Wno-strict-aliasing: YES
Compiler for C supports arguments -Wno-unused-but-set-variable: NO
Compiler for C supports arguments -Wno-unused-parameter: YES
Compiler for C supports arguments -Wno-pointer-to-int-cast: YES
Compiler for C supports arguments -Wno-unused-value: YES
Compiler for C supports arguments -Wno-unused-but-set-variable: NO
Compiler for C supports arguments -Wno-unused-variable: YES
Compiler for C supports arguments -Wno-unused-parameter: YES
Compiler for C supports arguments -Wno-unused-value: YES
Compiler for C supports arguments -Wno-unused-but-set-variable: NO
Compiler for C supports arguments -Wno-unused-parameter: YES
Dependency libmnl found: NO (tried pkgconfig and cmake)
Library mnl found: NO
Dependency libmlx4 found: NO (tried pkgconfig and cmake)
Library mlx4 found: NO
Dependency libibverbs found: NO (tried pkgconfig and cmake)
Library ibverbs found: NO
Dependency libmlx5 found: NO (tried pkgconfig and cmake)
Library mlx5 found: NO
Dependency libibverbs found: NO (tried pkgconfig and cmake)
Library ibverbs found: NO
Library libmusdk found: NO
Library libmusdk found: NO
Library nfb found: NO
Dependency netcope-common found: NO (tried pkgconfig and cmake)
Dependency pcap found: YES (cached)
Compiler for C supports arguments -Wno-strict-aliasing: YES
Compiler for C supports arguments -Wextra: YES
Compiler for C supports arguments -Wdisabled-optimization: YES
Compiler for C supports arguments -Waggregate-return: YES
Compiler for C supports arguments -Wnested-externs: YES
Compiler for C supports arguments -Wbad-function-cast: YES
Compiler for C supports arguments -Wno-sign-compare: YES
Compiler for C supports arguments -Wno-unused-parameter: YES
Compiler for C supports arguments -Wno-unused-variable: YES
Compiler for C supports arguments -Wno-empty-body: YES
Compiler for C supports arguments -Wno-unused-but-set-variable: NO
Library sze2 found: NO
Header <linux/pkt_cls.h> has symbol "TCA_FLOWER_UNSPEC" : YES
Header <linux/pkt_cls.h> has symbol "TCA_FLOWER_KEY_VLAN_PRIO" : YES
Header <linux/pkt_cls.h> has symbol "TCA_BPF_UNSPEC" : YES
Header <linux/pkt_cls.h> has symbol "TCA_BPF_FD" : YES
Header <linux/tc_act/tc_bpf.h> has symbol "TCA_ACT_BPF_UNSPEC" : YES
Header <linux/tc_act/tc_bpf.h> has symbol "TCA_ACT_BPF_FD" : YES
Configuring tap_autoconf.h using configuration
Compiler for C supports arguments -fno-prefetch-loop-arrays: NO
Compiler for C supports arguments -Wno-maybe-uninitialized: NO
Compiler for C supports arguments -Wall: YES
Compiler for C supports arguments -Wextra: YES
Compiler for C supports arguments -D_BSD_SOURCE: YES
Compiler for C supports arguments -D_DEFAULT_SOURCE: YES
Compiler for C supports arguments -D_XOPEN_SOURCE=600: YES
Compiler for C supports arguments -Wno-unused-parameter: YES
Compiler for C supports arguments -Wno-unused-value: YES
Compiler for C supports arguments -Wno-strict-aliasing: YES
Compiler for C supports arguments -Wno-format-extra-args: YES
Library IPSec_MB found: YES
Fetching value of define "IMB_VERSION_STR" : "0.52.0"
Library IPSec_MB found: YES
Fetching value of define "IMB_VERSION_STR" : "0.52.0"
Dependency libcrypto found: YES (cached)
Library sso_kasumi found: NO
Library libmusdk found: NO
Dependency libcrypto found: YES (cached)
Dependency libcrypto found: YES (cached)
Library sso_snow3g found: NO
Library sso_zuc found: NO
Dependency libisal found: NO (tried pkgconfig and cmake)
Dependency zlib found: YES (cached)
Compiler for C supports arguments -Wno-sign-compare: YES
Compiler for C supports arguments -Wno-unused-value: YES
Compiler for C supports arguments -Wno-format: YES
Compiler for C supports arguments -Wno-error=format-security: YES
Compiler for C supports arguments -Wno-strict-aliasing: YES
Compiler for C supports arguments -Wno-unused-but-set-variable: NO
Dependency libfdt found: NO (tried pkgconfig and cmake)
Library execinfo found: NO
Compiler for C supports arguments -Wno-format-truncation: NO
Dependency zlib found: YES (cached)
Library execinfo found: NO
Program doxygen found: NO
Program sphinx-build found: NO
Library execinfo found: NO
Compiler for C supports arguments -Wno-format-truncation: NO
Message: Skipping example "bpf"
Message: Skipping example "ethtool"
Has header "sys/epoll.h" : YES
Library pqos found: NO
Message: Skipping example "l2fwd-cat"
Library rt found: YES
Message: Skipping example "netmap_compat"
Message: Skipping example "performance-thread"
Message: Skipping example "quota_watermark"
Message: Skipping example "server_node_efd"
Has header "linux/virtio_scsi.h" : YES
Library virt found: NO
Dependency jansson found: NO (tried pkgconfig and cmake)
Message: Skipping example "vm_power_manager"
WARNING: Project targetting '>= 0.47.1' but tried to use feature introduced in '0.48.0': console arg in custom_target
Configuring rte_build_config.h using configuration
Message: 
=================
Libraries Enabled
=================

libs:
	kvargs, eal, ring, mempool, mbuf, net, meter, ethdev, 
	pci, cmdline, metrics, hash, timer, acl, bbdev, bitratestats, 
	cfgfile, compressdev, cryptodev, distributor, efd, eventdev, gro, gso, 
	ip_frag, jobstats, kni, latencystats, lpm, member, power, pdump, 
	rawdev, rcu, reorder, sched, security, stack, vhost, ipsec, 
	port, table, pipeline, flow_classify, bpf, 

Message: 
===============
Drivers Enabled
===============

common:
	cpt, dpaax, octeontx, octeontx2, 
bus:
	dpaa, fslmc, ifpga, pci, vdev, vmbus, 
mempool:
	bucket, dpaa, dpaa2, octeontx, octeontx2, ring, stack, 
net:
	af_packet, ark, atlantic, avp, axgbe, bond, bnx2x, bnxt, 
	cxgbe, dpaa, dpaa2, e1000, ena, enetc, enic, failsafe, 
	fm10k, i40e, hinic, iavf, ice, ifc, ipn3ke, ixgbe, 
	kni, liquidio, memif, netvsc, nfp, null, octeontx, octeontx2, 
	pcap, ring, sfc, softnic, tap, thunderx, vdev_netvsc, vhost, 
	virtio, vmxnet3, 
crypto:
	aesni_gcm, aesni_mb, caam_jr, ccp, dpaa_sec, dpaa2_sec, null_crypto, octeontx_crypto, 
	openssl, crypto_scheduler, virtio_crypto, 
compress:
	octeontx_compress, qat, zlib, 
event:
	dpaa, dpaa2, octeontx2, opdl, skeleton, sw, dsw, octeontx, 
	
baseband:
	bbdev_null, bbdev_turbo_sw, bbdev_fpga_lte_fec, 
raw:
	dpaa2_cmdif, dpaa2_qdma, ioat, ntb, octeontx2_dma, skeleton, 

Message: 
=================
Content Skipped
=================

libs:
	telemetry:	missing dependency "jansson"
	
drivers:
	common/mvep:	missing dependency, "libmusdk"
	net/af_xdp:	missing dependency, "libbpf"
	net/mlx4:	missing dependency, "ibverbs"
	net/mlx5:	missing dependency, "ibverbs"
	net/mvneta:	missing dependency, "libmusdk"
	net/mvpp2:	missing dependency, "libmusdk"
	net/nfb:	missing dependency, "libnfb"
	net/szedata2:	missing dependency, "libsze2"
	crypto/kasumi:	missing dependency, "libsso_kasumi"
	crypto/mvsam:	missing dependency, "libmusdk"
	crypto/snow3g:	missing dependency, "libsso_snow3g"
	crypto/zuc:	missing dependency, "libsso_zuc"
	compress/isal:	missing dependency, "libisal"
	raw/ifpga:	missing dependency, "libfdt"
	

Build targets in project: 570
WARNING: Project specifies a minimum meson_version '>= 0.47.1' but uses features which were added in newer versions:
 * 0.48.0: {'console arg in custom_target'}
Found ninja-1.9.0.git.kitware.dyndep-1.jobserver-1 at /usr/bin/ninja
[1/840] Compiling C object 'lib/76b5a35@@rte_ethdev at sta/librte_ethdev_ethdev_profile.c.o'.
[2/840] Compiling C object 'lib/76b5a35@@rte_bitratestats at sta/librte_bitratestats_rte_bitrate.c.o'.
[3/840] Compiling C object 'lib/76b5a35@@rte_ethdev at sta/librte_ethdev_rte_class_eth.c.o'.
[4/840] Compiling C object 'lib/76b5a35@@rte_ethdev at sta/librte_ethdev_ethdev_private.c.o'.
[5/840] Linking static target lib/librte_bitratestats.a.
[6/840] Compiling C object 'lib/76b5a35@@rte_ethdev at sta/librte_ethdev_rte_tm.c.o'.
[7/840] Compiling C object 'lib/76b5a35@@rte_ethdev at sta/librte_ethdev_rte_mtr.c.o'.
[8/840] Compiling C object 'lib/76b5a35@@rte_gro at sta/librte_gro_rte_gro.c.o'.
[9/840] Compiling C object 'lib/76b5a35@@rte_ethdev at sta/librte_ethdev_rte_flow.c.o'.
[10/840] Compiling C object 'lib/76b5a35@@rte_gro at sta/librte_gro_gro_tcp4.c.o'.
[11/840] Compiling C object 'lib/76b5a35@@rte_eventdev at sta/librte_eventdev_rte_event_eth_tx_adapter.c.o'.
[12/840] Compiling C object 'lib/76b5a35@@rte_gro at sta/librte_gro_gro_vxlan_tcp4.c.o'.
[13/840] Compiling C object 'lib/76b5a35@@rte_eventdev at sta/librte_eventdev_rte_eventdev.c.o'.
[14/840] Linking static target lib/librte_gro.a.
[15/840] Compiling C object 'lib/76b5a35@@rte_eventdev at sta/librte_eventdev_rte_event_eth_rx_adapter.c.o'.
[16/840] Linking static target lib/librte_eventdev.a.
[17/840] Compiling C object 'lib/76b5a35@@rte_ethdev at sta/librte_ethdev_rte_ethdev.c.o'.
[18/840] Linking static target lib/librte_ethdev.a.
[19/840] Compiling C object 'lib/76b5a35@@rte_gso at sta/librte_gso_rte_gso.c.o'.
[20/840] Linking static target lib/librte_gso.a.
[21/840] Compiling C object 'lib/76b5a35@@rte_latencystats at sta/librte_latencystats_rte_latencystats.c.o'.
[22/840] Linking static target lib/librte_latencystats.a.
[23/840] Compiling C object 'lib/76b5a35@@rte_kni at sta/librte_kni_rte_kni.c.o'.
[24/840] Linking target lib/librte_ethdev.so.12.1.
[25/840] Linking static target lib/librte_kni.a.
[26/840] Compiling C object 'lib/76b5a35@@rte_vhost at sta/librte_vhost_iotlb.c.o'.
[27/840] Compiling C object 'lib/76b5a35@@rte_vhost at sta/librte_vhost_socket.c.o'.
[28/840] Generating vhost_def with a custom command.
[29/840] Compiling C object 'lib/76b5a35@@rte_vhost at sta/librte_vhost_vdpa.c.o'.
[30/840] Compiling C object 'lib/76b5a35@@rte_pdump at sta/librte_pdump_rte_pdump.c.o'.
[31/840] Linking static target lib/librte_pdump.a.
[32/840] Generating symbol file 'lib/76b5a35@@rte_ethdev at sha/librte_ethdev.so.12.1.symbols'.
[33/833] Compiling C object 'lib/76b5a35@@rte_vhost at sta/librte_vhost_vhost.c.o'.
[34/833] Linking target lib/librte_bitratestats.so.2.1.
[35/833] Compiling C object 'lib/76b5a35@@rte_port at sta/librte_port_rte_port_ethdev.c.o'.
[36/833] Linking target lib/librte_gro.so.1.1.
[37/833] Linking target lib/librte_eventdev.so.7.1.
[38/833] Linking target lib/librte_gso.so.1.1.
[39/833] Linking target lib/librte_kni.so.2.1.
[40/833] Compiling C object 'lib/76b5a35@@rte_flow_classify at sta/librte_flow_classify_rte_flow_classify.c.o'.
[41/833] Linking target lib/librte_latencystats.so.1.1.
[42/833] Linking target lib/librte_pdump.so.3.1.
[43/833] Linking static target lib/librte_port.a.
[44/833] Compiling C object 'lib/76b5a35@@rte_vhost at sta/librte_vhost_vhost_user.c.o'.
[45/833] Compiling C object 'lib/76b5a35@@rte_flow_classify at sta/librte_flow_classify_rte_flow_classify_parse.c.o'.
[46/833] Linking static target lib/librte_flow_classify.a.
[47/833] Generating symbol file 'lib/76b5a35@@rte_gso at sha/librte_gso.so.1.1.symbols'.
[48/833] Generating symbol file 'lib/76b5a35@@rte_kni at sha/librte_kni.so.2.1.symbols'.
[49/833] Linking target lib/librte_port.so.3.1.
[50/833] Generating symbol file 'lib/76b5a35@@rte_eventdev at sha/librte_eventdev.so.7.1.symbols'.
[51/831] Compiling C object 'lib/76b5a35@@rte_bpf at sta/librte_bpf_bpf_pkt.c.o'.
[52/831] Linking static target lib/librte_bpf.a.
[53/831] Compiling C object 'lib/76b5a35@@rte_vhost at sta/librte_vhost_virtio_net.c.o'.
[54/831] Compiling C object 'drivers/a715181@@tmp_rte_bus_dpaa at sta/bus_dpaa_base_fman_fman_hw.c.o'.
[55/831] Linking target lib/librte_bpf.so.1.1.
[56/831] Compiling C object 'lib/76b5a35@@rte_vhost at sta/librte_vhost_vhost_crypto.c.o'.
[57/831] Linking static target lib/librte_vhost.a.
[58/831] Compiling C object 'drivers/a715181@@tmp_rte_bus_dpaa at sta/bus_dpaa_base_fman_fman.c.o'.
[59/831] Linking target lib/librte_vhost.so.4.1.
[60/831] Generating symbol file 'lib/76b5a35@@rte_port at sha/librte_port.so.3.1.symbols'.
[61/827] Linking target lib/librte_flow_classify.so.1.1.
[62/827] Compiling C object 'drivers/a715181@@tmp_rte_bus_dpaa at sta/bus_dpaa_base_fman_netcfg_layer.c.o'.
[63/827] Compiling C object 'drivers/a715181@@tmp_rte_bus_dpaa at sta/bus_dpaa_dpaa_bus.c.o'.
[64/827] Compiling C object 'drivers/a715181@@tmp_rte_bus_fslmc at sta/bus_fslmc_fslmc_vfio.c.o'.
[65/827] Compiling C object 'drivers/a715181@@tmp_rte_bus_fslmc at sta/bus_fslmc_fslmc_bus.c.o'.
[66/827] Compiling C object 'drivers/a715181@@tmp_rte_bus_fslmc at sta/bus_fslmc_portal_dpaa2_hw_dpbp.c.o'.
[67/827] Generating symbol file 'lib/76b5a35@@rte_vhost at sha/librte_vhost.so.4.1.symbols'.
[68/827] Compiling C object 'drivers/a715181@@tmp_rte_bus_fslmc at sta/bus_fslmc_portal_dpaa2_hw_dpci.c.o'.
[69/827] Compiling C object 'drivers/a715181@@tmp_rte_bus_fslmc at sta/bus_fslmc_portal_dpaa2_hw_dpio.c.o'.
[70/827] Linking static target drivers/libtmp_rte_bus_fslmc.a.
[71/827] Compiling C object 'drivers/a715181@@tmp_rte_mempool_dpaa2 at sta/mempool_dpaa2_dpaa2_hw_mempool.c.o'.
[72/827] Linking static target drivers/libtmp_rte_mempool_dpaa2.a.
[73/827] Compiling C object 'drivers/a715181@@tmp_rte_bus_dpaa at sta/bus_dpaa_base_qbman_qman.c.o'.
[74/827] Generating rte_mempool_dpaa2.pmd.c with a custom command.
[75/827] Generating rte_bus_fslmc.pmd.c with a custom command.
[76/827] Compiling C object 'drivers/a715181@@tmp_rte_mempool_dpaa at sta/mempool_dpaa_dpaa_mempool.c.o'.
[77/827] Linking static target drivers/libtmp_rte_bus_dpaa.a.
[78/827] Compiling C object 'drivers/a715181@@rte_bus_fslmc at sta/meson-generated_.._rte_bus_fslmc.pmd.c.o'.
[79/827] Compiling C object 'drivers/a715181@@rte_mempool_dpaa2 at sha/meson-generated_.._rte_mempool_dpaa2.pmd.c.o'.
[80/827] Linking static target drivers/librte_bus_fslmc.a.
[81/827] Compiling C object 'drivers/a715181@@rte_mempool_dpaa2 at sta/meson-generated_.._rte_mempool_dpaa2.pmd.c.o'.
[82/827] Linking static target drivers/libtmp_rte_mempool_dpaa.a.
[83/827] Compiling C object 'drivers/a715181@@rte_bus_fslmc at sha/meson-generated_.._rte_bus_fslmc.pmd.c.o'.
[84/827] Generating rte_mempool_dpaa.pmd.c with a custom command.
[85/827] Generating rte_bus_dpaa.pmd.c with a custom command.
[86/827] Linking target drivers/librte_bus_fslmc.so.2.1.
[87/827] Compiling C object 'drivers/a715181@@rte_mempool_dpaa at sta/meson-generated_.._rte_mempool_dpaa.pmd.c.o'.
[88/827] Compiling C object 'drivers/a715181@@rte_bus_dpaa at sta/meson-generated_.._rte_bus_dpaa.pmd.c.o'.
[89/827] Compiling C object 'drivers/a715181@@tmp_rte_pmd_memif at sta/net_memif_rte_eth_memif.c.o'.
[90/827] Linking static target drivers/librte_bus_dpaa.a.
[91/827] Compiling C object 'drivers/a715181@@tmp_rte_pmd_octeontx2 at sta/net_octeontx2_otx2_rss.c.o'.
[92/827] Compiling C object 'drivers/a715181@@rte_bus_dpaa at sha/meson-generated_.._rte_bus_dpaa.pmd.c.o'.
[93/827] Linking static target drivers/librte_mempool_dpaa.a.
[94/827] Linking static target drivers/librte_mempool_dpaa2.a.
[95/827] Compiling C object 'drivers/a715181@@rte_mempool_dpaa at sha/meson-generated_.._rte_mempool_dpaa.pmd.c.o'.
[96/827] Linking target drivers/librte_bus_dpaa.so.2.1.
[97/827] Generating symbol file 'drivers/a715181@@rte_bus_fslmc at sha/librte_bus_fslmc.so.2.1.symbols'.
[98/827] Compiling C object 'drivers/a715181@@tmp_rte_pmd_octeontx2 at sta/net_octeontx2_otx2_ethdev_devargs.c.o'.
[99/827] Linking target drivers/librte_mempool_dpaa2.so.2.1.
[100/827] Generating symbol file 'drivers/a715181@@rte_bus_dpaa at sha/librte_bus_dpaa.so.2.1.symbols'.
[101/826] Linking target drivers/librte_mempool_dpaa.so.1.1.
[102/826] Compiling C object 'drivers/a715181@@tmp_rte_pmd_ark at sta/net_ark_ark_ethdev.c.o'.
[103/826] Compiling C object 'drivers/a715181@@tmp_rte_pmd_af_packet at sta/net_af_packet_rte_eth_af_packet.c.o'.
[104/826] Linking static target drivers/libtmp_rte_pmd_af_packet.a.
[105/826] Generating symbol file 'drivers/a715181@@rte_mempool_dpaa2 at sha/librte_mempool_dpaa2.so.2.1.symbols'.
[106/822] Generating rte_pmd_af_packet.pmd.c with a custom command.
[107/822] Compiling C object 'drivers/a715181@@rte_pmd_af_packet at sta/meson-generated_.._rte_pmd_af_packet.pmd.c.o'.
[108/822] Compiling C object 'drivers/a715181@@tmp_rte_pmd_ark at sta/net_ark_ark_ethdev_rx.c.o'.
[109/822] Linking static target drivers/librte_pmd_af_packet.a.
[110/822] Compiling C object 'drivers/a715181@@tmp_rte_pmd_ark at sta/net_ark_ark_ethdev_tx.c.o'.
[111/822] Compiling C object 'drivers/a715181@@rte_pmd_af_packet at sha/meson-generated_.._rte_pmd_af_packet.pmd.c.o'.
[112/822] Generating symbol file 'drivers/a715181@@rte_mempool_dpaa at sha/librte_mempool_dpaa.so.1.1.symbols'.
[113/822] Linking target drivers/librte_pmd_af_packet.so.1.1.
[114/822] Compiling C object 'drivers/a715181@@tmp_rte_pmd_octeontx2 at sta/net_octeontx2_otx2_tx.c.o'.
[115/822] Compiling C object 'drivers/a715181@@tmp_rte_pmd_ark at sta/net_ark_ark_pktdir.c.o'.
[116/822] Compiling C object 'drivers/a715181@@tmp_rte_pmd_ark at sta/net_ark_ark_pktchkr.c.o'.
[117/822] Compiling C object 'drivers/a715181@@tmp_rte_pmd_ark at sta/net_ark_ark_pktgen.c.o'.
[118/822] Linking static target drivers/libtmp_rte_pmd_ark.a.
[119/822] Compiling C object 'drivers/a715181@@tmp_rte_pmd_atlantic at sta/net_atlantic_rte_pmd_atlantic.c.o'.
[120/822] Generating rte_pmd_ark.pmd.c with a custom command.
[121/822] Compiling C object 'drivers/a715181@@rte_pmd_ark at sta/meson-generated_.._rte_pmd_ark.pmd.c.o'.
[122/822] Linking static target drivers/librte_pmd_ark.a.
[123/822] Compiling C object 'drivers/a715181@@tmp_rte_pmd_atlantic at sta/net_atlantic_atl_ethdev.c.o'.
[124/822] Compiling C object 'drivers/a715181@@rte_pmd_ark at sha/meson-generated_.._rte_pmd_ark.pmd.c.o'.
[125/822] Compiling C object 'drivers/a715181@@tmp_rte_pmd_atlantic at sta/net_atlantic_atl_rxtx.c.o'.
[126/822] Linking target drivers/librte_pmd_ark.so.1.1.
[127/822] Linking static target drivers/libtmp_rte_pmd_atlantic.a.
[128/822] Compiling C object 'drivers/a715181@@tmp_rte_pmd_axgbe at sta/net_axgbe_axgbe_ethdev.c.o'.
[129/822] Generating rte_pmd_atlantic.pmd.c with a custom command.
[130/822] Compiling C object 'drivers/a715181@@rte_pmd_atlantic at sta/meson-generated_.._rte_pmd_atlantic.pmd.c.o'.
[131/822] Compiling C object 'drivers/a715181@@rte_pmd_atlantic at sha/meson-generated_.._rte_pmd_atlantic.pmd.c.o'.
[132/822] Linking static target drivers/librte_pmd_atlantic.a.
[133/822] Compiling C object 'drivers/a715181@@tmp_rte_pmd_axgbe at sta/net_axgbe_axgbe_dev.c.o'.
[134/822] Linking target drivers/librte_pmd_atlantic.so.1.1.
[135/822] Compiling C object 'drivers/a715181@@tmp_rte_pmd_axgbe at sta/net_axgbe_axgbe_mdio.c.o'.
[136/822] Compiling C object 'drivers/a715181@@tmp_rte_pmd_axgbe at sta/net_axgbe_axgbe_i2c.c.o'.
[137/822] Compiling C object 'drivers/a715181@@tmp_rte_pmd_avp at sta/net_avp_avp_ethdev.c.o'.
[138/822] Linking static target drivers/libtmp_rte_pmd_avp.a.
[139/822] Compiling C object 'drivers/a715181@@tmp_rte_pmd_octeontx2 at sta/net_octeontx2_otx2_rx.c.o'.
[140/822] Generating rte_pmd_avp.pmd.c with a custom command.
[141/822] Compiling C object 'drivers/a715181@@tmp_rte_pmd_axgbe at sta/net_axgbe_axgbe_rxtx.c.o'.
[142/822] Compiling C object 'drivers/a715181@@rte_pmd_avp at sta/meson-generated_.._rte_pmd_avp.pmd.c.o'.
[143/822] Linking static target drivers/librte_pmd_avp.a.
[144/822] Compiling C object 'drivers/a715181@@tmp_rte_pmd_axgbe at sta/net_axgbe_axgbe_phy_impl.c.o'.
[145/822] Compiling C object 'drivers/a715181@@rte_pmd_avp at sha/meson-generated_.._rte_pmd_avp.pmd.c.o'.
[146/822] Compiling C object 'drivers/a715181@@tmp_rte_pmd_axgbe at sta/net_axgbe_axgbe_rxtx_vec_sse.c.o'.
[147/822] Linking target drivers/librte_pmd_avp.so.1.1.
[148/822] Linking static target drivers/libtmp_rte_pmd_axgbe.a.
[149/822] Generating rte_pmd_axgbe.pmd.c with a custom command.
[150/822] Compiling C object 'drivers/a715181@@rte_pmd_axgbe at sta/meson-generated_.._rte_pmd_axgbe.pmd.c.o'.
[151/822] Compiling C object 'drivers/a715181@@tmp_rte_pmd_bond at sta/net_bonding_rte_eth_bond_flow.c.o'.
[152/822] Linking static target drivers/librte_pmd_axgbe.a.
[153/822] Compiling C object 'drivers/a715181@@rte_pmd_axgbe at sha/meson-generated_.._rte_pmd_axgbe.pmd.c.o'.
[154/822] Compiling C object 'drivers/a715181@@tmp_rte_pmd_bond at sta/net_bonding_rte_eth_bond_api.c.o'.
[155/822] Linking target drivers/librte_pmd_axgbe.so.1.1.
[156/822] Compiling C object 'drivers/a715181@@tmp_rte_pmd_bond at sta/net_bonding_rte_eth_bond_alb.c.o'.
[157/822] Compiling C object 'drivers/a715181@@tmp_rte_pmd_bond at sta/net_bonding_rte_eth_bond_args.c.o'.
[158/822] Compiling C object 'drivers/a715181@@tmp_rte_pmd_bond at sta/net_bonding_rte_eth_bond_pmd.c.o'.
[159/822] Compiling C object 'drivers/a715181@@tmp_rte_pmd_bnx2x at sta/net_bnx2x_bnx2x_ethdev.c.o'.
[160/822] Compiling C object 'drivers/a715181@@tmp_rte_pmd_bnx2x at sta/net_bnx2x_bnx2x_rxtx.c.o'.
[161/822] Compiling C object 'drivers/a715181@@tmp_rte_pmd_bond at sta/net_bonding_rte_eth_bond_8023ad.c.o'.
[162/822] Linking static target drivers/libtmp_rte_pmd_bond.a.
[163/822] Generating rte_pmd_bond.pmd.c with a custom command.
[164/822] Compiling C object 'drivers/a715181@@tmp_rte_pmd_bnx2x at sta/net_bnx2x_bnx2x_vfpf.c.o'.
[165/822] Compiling C object 'drivers/a715181@@rte_pmd_bond at sta/meson-generated_.._rte_pmd_bond.pmd.c.o'.
[166/822] Linking static target drivers/librte_pmd_bond.a.
[167/822] Compiling C object 'drivers/a715181@@rte_pmd_bond at sha/meson-generated_.._rte_pmd_bond.pmd.c.o'.
[168/822] Linking target drivers/librte_pmd_bond.so.2.1.
[169/822] Compiling C object 'drivers/a715181@@tmp_rte_pmd_bnxt at sta/net_bnxt_bnxt_filter.c.o'.
[170/822] Compiling C object 'drivers/a715181@@tmp_rte_pmd_bnxt at sta/net_bnxt_bnxt_cpr.c.o'.
[171/822] Compiling C object 'drivers/a715181@@tmp_rte_pmd_bnx2x at sta/net_bnx2x_bnx2x_stats.c.o'.
[172/822] Compiling C object 'drivers/a715181@@tmp_rte_pmd_bnxt at sta/net_bnxt_bnxt_flow.c.o'.
[173/822] Compiling C object 'drivers/a715181@@tmp_rte_pmd_bnx2x at sta/net_bnx2x_ecore_sp.c.o'.
[174/822] Compiling C object 'drivers/a715181@@tmp_rte_pmd_bnxt at sta/net_bnxt_bnxt_ethdev.c.o'.
[175/822] Compiling C object 'drivers/a715181@@tmp_rte_pmd_bnxt at sta/net_bnxt_bnxt_irq.c.o'.
[176/822] Compiling C object 'drivers/a715181@@tmp_rte_pmd_bnxt at sta/net_bnxt_bnxt_ring.c.o'.
[177/822] Compiling C object 'drivers/a715181@@tmp_rte_pmd_bnxt at sta/net_bnxt_bnxt_rxq.c.o'.
[178/822] Compiling C object 'drivers/a715181@@tmp_rte_pmd_bnxt at sta/net_bnxt_bnxt_rxr.c.o'.
[179/822] Compiling C object 'drivers/a715181@@tmp_rte_pmd_bnxt at sta/net_bnxt_bnxt_txq.c.o'.
[180/822] Compiling C object 'drivers/a715181@@tmp_rte_pmd_bnxt at sta/net_bnxt_bnxt_stats.c.o'.
[181/822] Compiling C object 'drivers/a715181@@tmp_rte_pmd_bnxt at sta/net_bnxt_bnxt_vnic.c.o'.
[182/822] Compiling C object 'drivers/a715181@@tmp_rte_pmd_bnxt at sta/net_bnxt_bnxt_txr.c.o'.
[183/822] Compiling C object 'drivers/a715181@@tmp_rte_pmd_bnxt at sta/net_bnxt_bnxt_hwrm.c.o'.
[184/822] Compiling C object 'drivers/a715181@@tmp_rte_pmd_bnxt at sta/net_bnxt_rte_pmd_bnxt.c.o'.
[185/822] Compiling C object 'drivers/a715181@@tmp_rte_pmd_cxgbe at sta/net_cxgbe_cxgbevf_ethdev.c.o'.
[186/822] Compiling C object 'drivers/a715181@@tmp_rte_pmd_bnx2x at sta/net_bnx2x_bnx2x.c.o'.
[187/822] Compiling C object 'drivers/a715181@@tmp_rte_pmd_bnxt at sta/net_bnxt_bnxt_rxtx_vec_sse.c.o'.
[188/822] Linking static target drivers/libtmp_rte_pmd_bnxt.a.
[189/822] Compiling C object 'drivers/a715181@@tmp_rte_pmd_cxgbe at sta/net_cxgbe_cxgbe_ethdev.c.o'.
[190/822] Compiling C object 'drivers/a715181@@tmp_rte_pmd_cxgbe at sta/net_cxgbe_cxgbevf_main.c.o'.
[191/822] Generating rte_pmd_bnxt.pmd.c with a custom command.
[192/822] Compiling C object 'drivers/a715181@@tmp_rte_pmd_bnx2x at sta/net_bnx2x_elink.c.o'.
[193/822] Compiling C object 'drivers/a715181@@rte_pmd_bnxt at sha/meson-generated_.._rte_pmd_bnxt.pmd.c.o'.
[194/822] Linking static target drivers/libtmp_rte_pmd_bnx2x.a.
[195/822] Compiling C object 'drivers/a715181@@rte_pmd_bnxt at sta/meson-generated_.._rte_pmd_bnxt.pmd.c.o'.
[196/822] Linking static target drivers/librte_pmd_bnxt.a.
[197/822] Generating rte_pmd_bnx2x.pmd.c with a custom command.
[198/822] Linking target drivers/librte_pmd_bnxt.so.2.1.
[199/822] Compiling C object 'drivers/a715181@@rte_pmd_bnx2x at sta/meson-generated_.._rte_pmd_bnx2x.pmd.c.o'.
[200/822] Linking static target drivers/librte_pmd_bnx2x.a.
[201/822] Compiling C object 'drivers/a715181@@rte_pmd_bnx2x at sha/meson-generated_.._rte_pmd_bnx2x.pmd.c.o'.
[202/822] Compiling C object 'drivers/a715181@@tmp_rte_pmd_cxgbe at sta/net_cxgbe_cxgbe_flow.c.o'.
[203/822] Linking target drivers/librte_pmd_bnx2x.so.1.1.
[204/822] Compiling C object 'drivers/a715181@@tmp_rte_pmd_cxgbe at sta/net_cxgbe_mps_tcam.c.o'.
[205/822] Compiling C object 'drivers/a715181@@tmp_rte_pmd_cxgbe at sta/net_cxgbe_clip_tbl.c.o'.
[206/822] Compiling C object 'drivers/a715181@@tmp_rte_pmd_cxgbe at sta/net_cxgbe_sge.c.o'.
[207/822] Compiling C object 'drivers/a715181@@tmp_rte_pmd_cxgbe at sta/net_cxgbe_cxgbe_filter.c.o'.
[208/822] Compiling C object 'drivers/a715181@@tmp_rte_pmd_cxgbe at sta/net_cxgbe_l2t.c.o'.
[209/822] Compiling C object 'drivers/a715181@@tmp_rte_pmd_cxgbe at sta/net_cxgbe_cxgbe_main.c.o'.
[210/822] Compiling C object 'drivers/a715181@@tmp_rte_pmd_cxgbe at sta/net_cxgbe_base_t4vf_hw.c.o'.
[211/822] Compiling C object 'drivers/a715181@@tmp_rte_pmd_dpaa at sta/net_dpaa_dpaa_ethdev.c.o'.
[212/822] Compiling C object 'drivers/a715181@@tmp_rte_pmd_dpaa2 at sta/net_dpaa2_base_dpaa2_hw_dpni.c.o'.
[213/822] Compiling C object 'drivers/a715181@@tmp_rte_pmd_dpaa2 at sta/net_dpaa2_dpaa2_ethdev.c.o'.
[214/822] Compiling C object 'drivers/a715181@@tmp_rte_pmd_dpaa2 at sta/net_dpaa2_dpaa2_mux.c.o'.
[215/822] Compiling C object 'drivers/a715181@@tmp_rte_pmd_dpaa at sta/net_dpaa_dpaa_rxtx.c.o'.
[216/822] Compiling C object 'drivers/a715181@@tmp_rte_pmd_cxgbe at sta/net_cxgbe_base_t4_hw.c.o'.
[217/822] Linking static target drivers/libtmp_rte_pmd_dpaa.a.
[218/822] Linking static target drivers/libtmp_rte_pmd_cxgbe.a.
[219/822] Generating rte_pmd_dpaa.pmd.c with a custom command.
[220/822] Compiling C object 'drivers/a715181@@rte_pmd_dpaa at sha/meson-generated_.._rte_pmd_dpaa.pmd.c.o'.
[221/822] Generating rte_pmd_cxgbe.pmd.c with a custom command.
[222/822] Compiling C object 'drivers/a715181@@rte_pmd_dpaa at sta/meson-generated_.._rte_pmd_dpaa.pmd.c.o'.
[223/822] Compiling C object 'drivers/a715181@@rte_pmd_cxgbe at sta/meson-generated_.._rte_pmd_cxgbe.pmd.c.o'.
[224/822] Linking static target drivers/librte_pmd_cxgbe.a.
[225/822] Linking static target drivers/librte_pmd_dpaa.a.
[226/822] Compiling C object 'drivers/a715181@@rte_pmd_cxgbe at sha/meson-generated_.._rte_pmd_cxgbe.pmd.c.o'.
[227/822] Linking target drivers/librte_pmd_dpaa.so.1.1.
[228/822] Compiling C object 'drivers/a715181@@tmp_rte_pmd_e1000 at sta/net_e1000_em_ethdev.c.o'.
[229/822] Linking target drivers/librte_pmd_cxgbe.so.1.1.
[230/822] Compiling C object 'drivers/a715181@@tmp_rte_pmd_dpaa2 at sta/net_dpaa2_dpaa2_flow.c.o'.
[231/822] Compiling C object 'drivers/a715181@@tmp_rte_pmd_dpaa2 at sta/net_dpaa2_dpaa2_rxtx.c.o'.
[232/822] Linking static target drivers/libtmp_rte_pmd_dpaa2.a.
[233/822] Compiling C object 'drivers/a715181@@tmp_rte_pmd_e1000 at sta/net_e1000_em_rxtx.c.o'.
[234/822] Compiling C object 'drivers/a715181@@tmp_rte_pmd_e1000 at sta/net_e1000_igb_flow.c.o'.
[235/822] Generating rte_pmd_dpaa2.pmd.c with a custom command.
[236/822] Compiling C object 'drivers/a715181@@tmp_rte_pmd_ena at sta/net_ena_base_ena_eth_com.c.o'.
[237/822] Compiling C object 'drivers/a715181@@rte_pmd_dpaa2 at sta/meson-generated_.._rte_pmd_dpaa2.pmd.c.o'.
[238/822] Linking static target drivers/librte_pmd_dpaa2.a.
[239/822] Compiling C object 'drivers/a715181@@rte_pmd_dpaa2 at sha/meson-generated_.._rte_pmd_dpaa2.pmd.c.o'.
[240/822] Generating symbol file 'drivers/a715181@@rte_pmd_dpaa at sha/librte_pmd_dpaa.so.1.1.symbols'.
[241/822] Linking target drivers/librte_pmd_dpaa2.so.2.1.
[242/822] Compiling C object 'drivers/a715181@@tmp_rte_pmd_e1000 at sta/net_e1000_igb_pf.c.o'.
[243/822] Compiling C object 'drivers/a715181@@tmp_rte_pmd_ena at sta/net_ena_base_ena_com.c.o'.
[244/822] Compiling C object 'drivers/a715181@@tmp_rte_pmd_enetc at sta/net_enetc_enetc_rxtx.c.o'.
[245/822] Compiling C object 'drivers/a715181@@tmp_rte_pmd_e1000 at sta/net_e1000_igb_ethdev.c.o'.
[246/822] Generating symbol file 'drivers/a715181@@rte_pmd_dpaa2 at sha/librte_pmd_dpaa2.so.2.1.symbols'.
[247/822] Compiling C object 'drivers/a715181@@tmp_rte_pmd_e1000 at sta/net_e1000_igb_rxtx.c.o'.
[248/822] Linking static target drivers/libtmp_rte_pmd_e1000.a.
[249/822] Compiling C object 'drivers/a715181@@tmp_rte_pmd_enetc at sta/net_enetc_enetc_ethdev.c.o'.
[250/822] Linking static target drivers/libtmp_rte_pmd_enetc.a.
[251/822] Generating rte_pmd_e1000.pmd.c with a custom command.
[252/822] Compiling C object 'drivers/a715181@@tmp_rte_pmd_enic at sta/net_enic_enic_clsf.c.o'.
[253/822] Generating rte_pmd_enetc.pmd.c with a custom command.
[254/822] Compiling C object 'drivers/a715181@@rte_pmd_e1000 at sta/meson-generated_.._rte_pmd_e1000.pmd.c.o'.
[255/822] Compiling C object 'drivers/a715181@@rte_pmd_e1000 at sha/meson-generated_.._rte_pmd_e1000.pmd.c.o'.
[256/822] Compiling C object 'drivers/a715181@@rte_pmd_enetc at sta/meson-generated_.._rte_pmd_enetc.pmd.c.o'.
[257/822] Linking static target drivers/librte_pmd_e1000.a.
[258/822] Linking static target drivers/librte_pmd_enetc.a.
[259/822] Compiling C object 'drivers/a715181@@rte_pmd_enetc at sha/meson-generated_.._rte_pmd_enetc.pmd.c.o'.
[260/822] Linking target drivers/librte_pmd_e1000.so.1.1.
[261/822] Linking target drivers/librte_pmd_enetc.so.1.1.
[262/822] Compiling C object 'drivers/a715181@@tmp_rte_pmd_enic at sta/net_enic_enic_ethdev.c.o'.
[263/822] Compiling C object 'drivers/a715181@@tmp_rte_pmd_enic at sta/net_enic_enic_res.c.o'.
[264/822] Compiling C object 'drivers/a715181@@tmp_rte_pmd_enic at sta/net_enic_enic_flow.c.o'.
[265/822] Compiling C object 'drivers/a715181@@tmp_rte_pmd_ena at sta/net_ena_ena_ethdev.c.o'.
[266/822] Linking static target drivers/libtmp_rte_pmd_ena.a.
[267/822] Generating rte_pmd_ena.pmd.c with a custom command.
[268/822] Compiling C object 'drivers/a715181@@tmp_rte_pmd_enic at sta/net_enic_enic_main.c.o'.
[269/822] Compiling C object 'drivers/a715181@@rte_pmd_ena at sta/meson-generated_.._rte_pmd_ena.pmd.c.o'.
[270/822] Compiling C object 'drivers/a715181@@rte_pmd_ena at sha/meson-generated_.._rte_pmd_ena.pmd.c.o'.
[271/822] Linking static target drivers/librte_pmd_ena.a.
[272/822] Compiling C object 'drivers/a715181@@tmp_rte_pmd_failsafe at sta/net_failsafe_failsafe.c.o'.
[273/822] Linking target drivers/librte_pmd_ena.so.1.1.
[274/822] Compiling C object 'drivers/a715181@@tmp_rte_pmd_enic at sta/net_enic_enic_rxtx_vec_avx2.c.o'.
[275/822] Compiling C object 'drivers/a715181@@tmp_rte_pmd_failsafe at sta/net_failsafe_failsafe_eal.c.o'.
[276/822] Compiling C object 'drivers/a715181@@tmp_rte_pmd_failsafe at sta/net_failsafe_failsafe_args.c.o'.
[277/822] Compiling C object 'drivers/a715181@@tmp_rte_pmd_enic at sta/net_enic_enic_rxtx.c.o'.
[278/822] Linking static target drivers/libtmp_rte_pmd_enic.a.
[279/822] Generating rte_pmd_enic.pmd.c with a custom command.
[280/822] Compiling C object 'drivers/a715181@@tmp_rte_pmd_failsafe at sta/net_failsafe_failsafe_ether.c.o'.
[281/822] Compiling C object 'drivers/a715181@@rte_pmd_enic at sta/meson-generated_.._rte_pmd_enic.pmd.c.o'.
[282/822] Linking static target drivers/librte_pmd_enic.a.
[283/822] Compiling C object 'drivers/a715181@@rte_pmd_enic at sha/meson-generated_.._rte_pmd_enic.pmd.c.o'.
[284/822] Compiling C object 'drivers/a715181@@tmp_rte_pmd_failsafe at sta/net_failsafe_failsafe_intr.c.o'.
[285/822] Compiling C object 'drivers/a715181@@tmp_rte_pmd_failsafe at sta/net_failsafe_failsafe_rxtx.c.o'.
[286/822] Compiling C object 'drivers/a715181@@tmp_rte_pmd_failsafe at sta/net_failsafe_failsafe_flow.c.o'.
[287/822] Linking target drivers/librte_pmd_enic.so.1.1.
[288/822] Compiling C object 'drivers/a715181@@tmp_rte_pmd_fm10k at sta/net_fm10k_fm10k_rxtx.c.o'.
[289/822] Compiling C object 'drivers/a715181@@tmp_rte_pmd_failsafe at sta/net_failsafe_failsafe_ops.c.o'.
[290/822] Linking static target drivers/libtmp_rte_pmd_failsafe.a.
[291/822] Generating rte_pmd_failsafe.pmd.c with a custom command.
[292/822] Compiling C object 'drivers/a715181@@rte_pmd_failsafe at sta/meson-generated_.._rte_pmd_failsafe.pmd.c.o'.
[293/822] Compiling C object 'drivers/a715181@@rte_pmd_failsafe at sha/meson-generated_.._rte_pmd_failsafe.pmd.c.o'.
[294/822] Compiling C object 'drivers/a715181@@tmp_rte_pmd_fm10k at sta/net_fm10k_fm10k_ethdev.c.o'.
[295/822] Linking static target drivers/librte_pmd_failsafe.a.
[296/822] Linking target drivers/librte_pmd_failsafe.so.1.1.
[297/822] Compiling C object 'drivers/a715181@@tmp_rte_pmd_fm10k at sta/net_fm10k_fm10k_rxtx_vec.c.o'.
[298/822] Linking static target drivers/libtmp_rte_pmd_fm10k.a.
[299/822] Compiling C object 'drivers/a715181@@tmp_rte_pmd_i40e at sta/net_i40e_i40e_pf.c.o'.
[300/822] Generating rte_pmd_fm10k.pmd.c with a custom command.
[301/822] Compiling C object 'drivers/a715181@@rte_pmd_fm10k at sta/meson-generated_.._rte_pmd_fm10k.pmd.c.o'.
[302/822] Compiling C object 'drivers/a715181@@rte_pmd_fm10k at sha/meson-generated_.._rte_pmd_fm10k.pmd.c.o'.
[303/822] Compiling C object 'drivers/a715181@@tmp_rte_pmd_i40e at sta/net_i40e_i40e_ethdev_vf.c.o'.
[304/822] Linking static target drivers/librte_pmd_fm10k.a.
[305/822] Compiling C object 'drivers/a715181@@tmp_rte_pmd_i40e at sta/net_i40e_i40e_rxtx.c.o'.
[306/822] Linking target drivers/librte_pmd_fm10k.so.1.1.
[307/822] Compiling C object 'drivers/a715181@@tmp_rte_pmd_i40e at sta/net_i40e_i40e_tm.c.o'.
[308/822] Compiling C object 'drivers/a715181@@tmp_rte_pmd_i40e at sta/net_i40e_i40e_fdir.c.o'.
[309/822] Compiling C object 'drivers/a715181@@tmp_rte_pmd_i40e at sta/net_i40e_i40e_vf_representor.c.o'.
[310/822] Compiling C object 'drivers/a715181@@tmp_rte_pmd_i40e at sta/net_i40e_i40e_rxtx_vec_sse.c.o'.
[311/822] Compiling C object 'drivers/a715181@@tmp_rte_pmd_i40e at sta/net_i40e_rte_pmd_i40e.c.o'.
[312/822] Compiling C object 'drivers/a715181@@tmp_rte_pmd_i40e at sta/net_i40e_i40e_rxtx_vec_avx2.c.o'.
[313/822] Compiling C object 'drivers/a715181@@tmp_rte_pmd_hinic at sta/net_hinic_hinic_pmd_rx.c.o'.
[314/822] Compiling C object 'drivers/a715181@@tmp_rte_pmd_i40e at sta/net_i40e_i40e_flow.c.o'.
[315/822] Compiling C object 'drivers/net/hinic/base/12a4447@@hinic_base at sta/hinic_pmd_hwdev.c.o'.
[316/822] Linking static target drivers/net/hinic/base/libhinic_base.a.
[317/822] Compiling C object 'drivers/a715181@@tmp_rte_pmd_hinic at sta/net_hinic_hinic_pmd_ethdev.c.o'.
[318/822] Compiling C object 'drivers/a715181@@tmp_rte_pmd_i40e at sta/net_i40e_i40e_ethdev.c.o'.
[319/822] Linking static target drivers/libtmp_rte_pmd_i40e.a.
[320/822] Compiling C object 'drivers/a715181@@tmp_rte_pmd_hinic at sta/net_hinic_hinic_pmd_tx.c.o'.
[321/822] Compiling C object 'drivers/a715181@@tmp_rte_pmd_iavf at sta/net_iavf_iavf_vchnl.c.o'.
[322/822] Linking static target drivers/libtmp_rte_pmd_hinic.a.
[323/822] Generating rte_pmd_hinic.pmd.c with a custom command.
[324/822] Generating rte_pmd_i40e.pmd.c with a custom command.
[325/822] Compiling C object 'drivers/a715181@@tmp_rte_pmd_iavf at sta/net_iavf_iavf_rxtx.c.o'.
[326/822] Compiling C object 'drivers/a715181@@tmp_rte_pmd_iavf at sta/net_iavf_iavf_ethdev.c.o'.
[327/822] Compiling C object 'drivers/a715181@@rte_pmd_hinic at sta/meson-generated_.._rte_pmd_hinic.pmd.c.o'.
[328/822] Linking static target drivers/librte_pmd_hinic.a.
[329/822] Compiling C object 'drivers/a715181@@rte_pmd_i40e at sta/meson-generated_.._rte_pmd_i40e.pmd.c.o'.
[330/822] Compiling C object 'drivers/a715181@@rte_pmd_i40e at sha/meson-generated_.._rte_pmd_i40e.pmd.c.o'.
[331/822] Compiling C object 'drivers/a715181@@rte_pmd_hinic at sha/meson-generated_.._rte_pmd_hinic.pmd.c.o'.
[332/822] Linking static target drivers/librte_pmd_i40e.a.
[333/822] Linking target drivers/librte_pmd_i40e.so.2.1.
[334/822] Compiling C object 'drivers/a715181@@tmp_rte_pmd_iavf at sta/net_iavf_iavf_rxtx_vec_sse.c.o'.
[335/822] Linking target drivers/librte_pmd_hinic.so.1.1.
[336/822] Linking static target drivers/libtmp_rte_pmd_iavf.a.
[337/822] Generating rte_pmd_iavf.pmd.c with a custom command.
[338/822] Compiling C object 'drivers/a715181@@tmp_rte_pmd_ice at sta/net_ice_ice_ethdev.c.o'.
[339/822] Compiling C object 'drivers/a715181@@rte_pmd_iavf at sha/meson-generated_.._rte_pmd_iavf.pmd.c.o'.
[340/822] Compiling C object 'drivers/a715181@@rte_pmd_iavf at sta/meson-generated_.._rte_pmd_iavf.pmd.c.o'.
[341/822] Linking static target drivers/librte_pmd_iavf.a.
[342/822] Linking target drivers/librte_pmd_iavf.so.1.1.
[343/822] Compiling C object 'drivers/a715181@@tmp_rte_pmd_ice at sta/net_ice_ice_switch_filter.c.o'.
[344/822] Compiling C object 'drivers/a715181@@tmp_rte_pmd_ice at sta/net_ice_ice_rxtx.c.o'.
[345/822] Compiling C object 'drivers/a715181@@tmp_rte_pmd_ice at sta/net_ice_ice_generic_flow.c.o'.
[346/822] Compiling C object 'drivers/a715181@@tmp_rte_pmd_ifc at sta/net_ifc_ifcvf_vdpa.c.o'.
[347/822] Linking static target drivers/libtmp_rte_pmd_ifc.a.
[348/822] Generating rte_pmd_ifc.pmd.c with a custom command.
[349/822] Compiling C object 'drivers/a715181@@tmp_rte_pmd_ipn3ke at sta/net_ipn3ke_ipn3ke_ethdev.c.o'.
[350/822] Compiling C object 'drivers/a715181@@rte_pmd_ifc at sta/meson-generated_.._rte_pmd_ifc.pmd.c.o'.
[351/822] Compiling C object 'drivers/a715181@@rte_pmd_ifc at sha/meson-generated_.._rte_pmd_ifc.pmd.c.o'.
[352/822] Linking static target drivers/librte_pmd_ifc.a.
[353/822] Compiling C object 'drivers/a715181@@tmp_rte_pmd_ice at sta/net_ice_ice_rxtx_vec_avx2.c.o'.
[354/822] Linking target drivers/librte_pmd_ifc.so.1.1.
[355/822] Compiling C object 'drivers/a715181@@tmp_rte_pmd_ipn3ke at sta/net_ipn3ke_ipn3ke_tm.c.o'.
[356/822] Compiling C object 'drivers/a715181@@tmp_rte_pmd_ipn3ke at sta/net_ipn3ke_ipn3ke_flow.c.o'.
[357/822] Compiling C object 'drivers/a715181@@tmp_rte_pmd_ice at sta/net_ice_ice_rxtx_vec_sse.c.o'.
[358/822] Linking static target drivers/libtmp_rte_pmd_ice.a.
[359/822] Generating rte_pmd_ice.pmd.c with a custom command.
[360/822] Compiling C object 'drivers/a715181@@rte_pmd_ice at sta/meson-generated_.._rte_pmd_ice.pmd.c.o'.
[361/822] Compiling C object 'drivers/a715181@@rte_pmd_ice at sha/meson-generated_.._rte_pmd_ice.pmd.c.o'.
[362/822] Linking static target drivers/librte_pmd_ice.a.
[363/822] Compiling C object 'drivers/a715181@@tmp_rte_pmd_ipn3ke at sta/net_ipn3ke_ipn3ke_representor.c.o'.
[364/822] Compiling C object 'drivers/a715181@@tmp_rte_pmd_ixgbe at sta/net_ixgbe_ixgbe_bypass.c.o'.
[365/822] Linking static target drivers/libtmp_rte_pmd_ipn3ke.a.
[366/822] Linking target drivers/librte_pmd_ice.so.1.1.
[367/822] Compiling C object 'drivers/a715181@@tmp_rte_pmd_ixgbe at sta/net_ixgbe_ixgbe_fdir.c.o'.
[368/822] Generating rte_pmd_ipn3ke.pmd.c with a custom command.
[369/822] Compiling C object 'drivers/a715181@@tmp_rte_pmd_ixgbe at sta/net_ixgbe_ixgbe_pf.c.o'.
[370/822] Compiling C object 'drivers/a715181@@rte_pmd_ipn3ke at sta/meson-generated_.._rte_pmd_ipn3ke.pmd.c.o'.
[371/822] Compiling C object 'drivers/a715181@@tmp_rte_pmd_ixgbe at sta/net_ixgbe_ixgbe_ipsec.c.o'.
[372/822] Linking static target drivers/librte_pmd_ipn3ke.a.
[373/822] Compiling C object 'drivers/a715181@@rte_pmd_ipn3ke at sha/meson-generated_.._rte_pmd_ipn3ke.pmd.c.o'.
[374/822] Linking target drivers/librte_pmd_ipn3ke.so.1.1.
[375/822] Compiling C object 'drivers/a715181@@tmp_rte_pmd_ixgbe at sta/net_ixgbe_ixgbe_flow.c.o'.
[376/822] Compiling C object 'drivers/a715181@@tmp_rte_pmd_ixgbe at sta/net_ixgbe_ixgbe_vf_representor.c.o'.
[377/822] Compiling C object 'drivers/a715181@@tmp_rte_pmd_kni at sta/net_kni_rte_eth_kni.c.o'.
[378/822] Linking static target drivers/libtmp_rte_pmd_kni.a.
[379/822] Generating rte_pmd_kni.pmd.c with a custom command.
[380/822] Compiling C object 'drivers/a715181@@tmp_rte_pmd_ixgbe at sta/net_ixgbe_rte_pmd_ixgbe.c.o'.
[381/822] Compiling C object 'drivers/a715181@@rte_pmd_kni at sta/meson-generated_.._rte_pmd_kni.pmd.c.o'.
[382/822] Linking static target drivers/librte_pmd_kni.a.
[383/822] Compiling C object 'drivers/a715181@@tmp_rte_pmd_ixgbe at sta/net_ixgbe_ixgbe_tm.c.o'.
[384/822] Compiling C object 'drivers/a715181@@rte_pmd_kni at sha/meson-generated_.._rte_pmd_kni.pmd.c.o'.
[385/822] Linking target drivers/librte_pmd_kni.so.1.1.
[386/822] Compiling C object 'drivers/a715181@@tmp_rte_pmd_ixgbe at sta/net_ixgbe_ixgbe_ethdev.c.o'.
[387/822] Compiling C object 'drivers/a715181@@tmp_rte_pmd_liquidio at sta/net_liquidio_base_lio_23xx_vf.c.o'.
[388/822] Compiling C object 'drivers/a715181@@tmp_rte_pmd_liquidio at sta/net_liquidio_base_lio_mbox.c.o'.
[389/822] Compiling C object 'drivers/a715181@@tmp_rte_pmd_ixgbe at sta/net_ixgbe_ixgbe_rxtx_vec_sse.c.o'.
[390/822] Compiling C object 'examples/c590b3c@@dpdk-vhost_scsi at exe/vhost_scsi_vhost_scsi.c.o'.
FAILED: examples/c590b3c@@dpdk-vhost_scsi at exe/vhost_scsi_vhost_scsi.c.o 
clang -Iexamples/c590b3c@@dpdk-vhost_scsi at exe -Iexamples -I../examples -Iexamples/vhost_scsi -I../examples/vhost_scsi -I. -I../ -Iconfig -I../config -Ilib/librte_eal/common/include -I../lib/librte_eal/common/include -I../lib/librte_eal/linux/eal/include -Ilib/librte_eal/common -I../lib/librte_eal/common -Ilib/librte_eal/common/include/arch/x86 -I../lib/librte_eal/common/include/arch/x86 -Ilib/librte_eal -I../lib/librte_eal -Ilib/librte_kvargs -I../lib/librte_kvargs -Ilib/librte_mempool -I../lib/librte_mempool -Ilib/librte_ring -I../lib/librte_ring -Ilib/librte_net -I../lib/librte_net -Ilib/librte_mbuf -I../lib/librte_mbuf -Ilib/librte_ethdev -I../lib/librte_ethdev -Ilib/librte_meter -I../lib/librte_meter -Ilib/librte_cmdline -I../lib/librte_cmdline -Ilib/librte_vhost -I../lib/librte_vhost -Ilib/librte_cryptodev -I../lib/librte_cryptodev -Ilib/librte_hash -I../lib/librte_hash -Ilib/librte_pci -I../lib/librte_pci -Xclang -fcolor-diagnostics -pipe -D_FILE_OFFSET_BITS=64 -Wall -Winvalid-pch -Werror -O3 -include rte_config.h -Wunused-parameter -Wsign-compare -Wcast-qual -Wno-address-of-packed-member -D_GNU_SOURCE -march=native -MD -MQ 'examples/c590b3c@@dpdk-vhost_scsi at exe/vhost_scsi_vhost_scsi.c.o' -MF 'examples/c590b3c@@dpdk-vhost_scsi at exe/vhost_scsi_vhost_scsi.c.o.d' -o 'examples/c590b3c@@dpdk-vhost_scsi at exe/vhost_scsi_vhost_scsi.c.o' -c ../examples/vhost_scsi/vhost_scsi.c
../examples/vhost_scsi/vhost_scsi.c:61:9: error: 'rte_vhost_va_from_guest_pa' is deprecated: Symbol is not yet part of stable ABI [-Werror,-Wdeprecated-declarations]
        return rte_vhost_va_from_guest_pa(ctrlr->mem, gpa, len);
               ^
../lib/librte_vhost/rte_vhost.h:236:1: note: 'rte_vhost_va_from_guest_pa' has been explicitly marked deprecated here
__rte_experimental
^
../lib/librte_eal/common/include/rte_compat.h:82:16: note: expanded from macro '__rte_experimental'
__attribute__((deprecated("Symbol is not yet part of stable ABI"), \
               ^
1 error generated.
[391/822] Compiling C object 'drivers/a715181@@tmp_rte_pmd_netvsc at sta/net_netvsc_hn_ethdev.c.o'.
[392/822] Compiling C object 'drivers/a715181@@tmp_rte_pmd_memif at sta/net_memif_memif_socket.c.o'.
[393/822] Compiling C object 'drivers/a715181@@tmp_rte_pmd_liquidio at sta/net_liquidio_lio_rxtx.c.o'.
[394/822] Compiling C object 'drivers/a715181@@tmp_rte_pmd_netvsc at sta/net_netvsc_hn_rndis.c.o'.
[395/822] Compiling C object 'drivers/a715181@@tmp_rte_pmd_ixgbe at sta/net_ixgbe_ixgbe_rxtx.c.o'.
[396/822] Compiling C object 'drivers/a715181@@tmp_rte_pmd_liquidio at sta/net_liquidio_lio_ethdev.c.o'.
[397/822] Compiling C object 'drivers/a715181@@tmp_rte_pmd_netvsc at sta/net_netvsc_hn_rxtx.c.o'.
ninja: build stopped: subcommand failed.
ninja -C build-clang-shared
ninja: Entering directory `build-clang-shared'
[0/1] Regenerating build files.
The Meson build system
Version: 0.50.1
Source dir: /tmp/SUSE15-64_K4.12.14_GCC7.3.1/x86_64-native-linuxapp-gcc/f54e1db45cd243e78997de60e0477310/dpdk
Build dir: /tmp/SUSE15-64_K4.12.14_GCC7.3.1/x86_64-native-linuxapp-gcc/f54e1db45cd243e78997de60e0477310/dpdk/build-clang-shared
Build type: native build
Program cat found: YES (/usr/bin/cat)
Project name: DPDK
Project version: 19.11.0-rc0
Native C compiler: clang (clang 5.0.1 "clang version 5.0.1 (tags/RELEASE_501/final 312548)")
Build machine cpu family: x86_64
Build machine cpu: x86_64
Program ../buildtools/symlink-drivers-solibs.sh found: YES (/bin/sh /tmp/SUSE15-64_K4.12.14_GCC7.3.1/x86_64-native-linuxapp-gcc/f54e1db45cd243e78997de60e0477310/dpdk/config/../buildtools/symlink-drivers-solibs.sh)
Checking for size of "void *" : 8
Library libm found: YES
Library numa found: YES
Has header "numaif.h" : YES
Found pkg-config: /usr/bin/pkg-config (0.29.2)
Did not find CMake 'cmake'
Found CMake: NO
Dependency libbsd found: NO (tried pkgconfig and cmake)
Compiler for C supports arguments -Wunused-parameter: YES
Compiler for C supports arguments -Wsign-compare: YES
Compiler for C supports arguments -Wcast-qual: YES
Compiler for C supports arguments -Wno-address-of-packed-member: YES
Fetching value of define "__SSE4_2__" : 1
Fetching value of define "__AES__" : 1
Fetching value of define "__PCLMUL__" : 1
Fetching value of define "__AVX__" : 1
Fetching value of define "__AVX2__" : 1
Fetching value of define "__AVX512F__" : 
Fetching value of define "__RDRND__" : 1
Fetching value of define "__RDSEED__" : 1
Program gen-pmdinfo-cfile.sh found: YES (/tmp/SUSE15-64_K4.12.14_GCC7.3.1/x86_64-native-linuxapp-gcc/f54e1db45cd243e78997de60e0477310/dpdk/buildtools/gen-pmdinfo-cfile.sh)
Using meson's python ['/usr/bin/python3']
Compiler for C supports arguments -Wno-format-truncation: NO
Checking for function "getentropy" : YES
Has header "linux/userfaultfd.h" : YES
Dependency libelf found: YES (cached)
Dependency jansson found: NO (tried pkgconfig and cmake)
Compiler for C supports arguments -Wno-format-truncation: NO
Library libmusdk found: NO
Compiler for C supports arguments -Wno-cast-qual: YES
Dependency libbpf found: NO (tried pkgconfig and cmake)
Library bpf found: NO
Dependency zlib found: YES (cached)
Compiler for C supports arguments -Wno-uninitialized: YES
Compiler for C supports arguments -Wno-unused-parameter: YES
Compiler for C supports arguments -Wno-unused-variable: YES
Compiler for C supports arguments -Wno-misleading-indentation: NO
Compiler for C supports arguments -Wno-implicit-fallthrough: YES
Compiler for C supports arguments -Wno-unused-parameter: YES
Compiler for C supports arguments -Wno-unused-value: YES
Compiler for C supports arguments -Wno-strict-aliasing: YES
Compiler for C supports arguments -Wno-format-extra-args: YES
Compiler for C supports arguments -Wno-unused-variable: YES
Compiler for C supports arguments -Wno-missing-field-initializers: YES
Compiler for C supports arguments -Wno-sign-compare: YES
Compiler for C supports arguments -Wno-unused-value: YES
Compiler for C supports arguments -Wno-format: YES
Compiler for C supports arguments -Wno-error=format-security: YES
Compiler for C supports arguments -Wno-strict-aliasing: YES
Compiler for C supports arguments -Wno-unused-but-set-variable: NO
Compiler for C supports arguments -Wno-unused-parameter: YES
Compiler for C supports arguments -Wno-pointer-to-int-cast: YES
Compiler for C supports arguments -Wno-unused-value: YES
Compiler for C supports arguments -Wno-unused-but-set-variable: NO
Compiler for C supports arguments -Wno-unused-variable: YES
Compiler for C supports arguments -Wno-unused-parameter: YES
Compiler for C supports arguments -Wno-unused-value: YES
Compiler for C supports arguments -Wno-unused-but-set-variable: NO
Compiler for C supports arguments -Wno-unused-parameter: YES
Dependency libmnl found: NO (tried pkgconfig and cmake)
Library mnl found: NO
Dependency libmlx4 found: NO (tried pkgconfig and cmake)
Library mlx4 found: NO
Dependency libibverbs found: NO (tried pkgconfig and cmake)
Library ibverbs found: NO
Dependency libmlx5 found: NO (tried pkgconfig and cmake)
Library mlx5 found: NO
Dependency libibverbs found: NO (tried pkgconfig and cmake)
Library ibverbs found: NO
Library libmusdk found: NO
Library libmusdk found: NO
Library nfb found: NO
Dependency netcope-common found: NO (tried pkgconfig and cmake)
Dependency pcap found: YES (cached)
Compiler for C supports arguments -Wno-strict-aliasing: YES
Compiler for C supports arguments -Wextra: YES
Compiler for C supports arguments -Wdisabled-optimization: YES
Compiler for C supports arguments -Waggregate-return: YES
Compiler for C supports arguments -Wnested-externs: YES
Compiler for C supports arguments -Wbad-function-cast: YES
Compiler for C supports arguments -Wno-sign-compare: YES
Compiler for C supports arguments -Wno-unused-parameter: YES
Compiler for C supports arguments -Wno-unused-variable: YES
Compiler for C supports arguments -Wno-empty-body: YES
Compiler for C supports arguments -Wno-unused-but-set-variable: NO
Library sze2 found: NO
Header <linux/pkt_cls.h> has symbol "TCA_FLOWER_UNSPEC" : YES
Header <linux/pkt_cls.h> has symbol "TCA_FLOWER_KEY_VLAN_PRIO" : YES
Header <linux/pkt_cls.h> has symbol "TCA_BPF_UNSPEC" : YES
Header <linux/pkt_cls.h> has symbol "TCA_BPF_FD" : YES
Header <linux/tc_act/tc_bpf.h> has symbol "TCA_ACT_BPF_UNSPEC" : YES
Header <linux/tc_act/tc_bpf.h> has symbol "TCA_ACT_BPF_FD" : YES
Configuring tap_autoconf.h using configuration
Compiler for C supports arguments -fno-prefetch-loop-arrays: NO
Compiler for C supports arguments -Wno-maybe-uninitialized: NO
Compiler for C supports arguments -Wall: YES
Compiler for C supports arguments -Wextra: YES
Compiler for C supports arguments -D_BSD_SOURCE: YES
Compiler for C supports arguments -D_DEFAULT_SOURCE: YES
Compiler for C supports arguments -D_XOPEN_SOURCE=600: YES
Compiler for C supports arguments -Wno-unused-parameter: YES
Compiler for C supports arguments -Wno-unused-value: YES
Compiler for C supports arguments -Wno-strict-aliasing: YES
Compiler for C supports arguments -Wno-format-extra-args: YES
Library IPSec_MB found: YES
Fetching value of define "IMB_VERSION_STR" : "0.52.0"
Library IPSec_MB found: YES
Fetching value of define "IMB_VERSION_STR" : "0.52.0"
Dependency libcrypto found: YES (cached)
Library sso_kasumi found: NO
Library libmusdk found: NO
Dependency libcrypto found: YES (cached)
Dependency libcrypto found: YES (cached)
Library sso_snow3g found: NO
Library sso_zuc found: NO
Dependency libisal found: NO (tried pkgconfig and cmake)
Dependency zlib found: YES (cached)
Compiler for C supports arguments -Wno-sign-compare: YES
Compiler for C supports arguments -Wno-unused-value: YES
Compiler for C supports arguments -Wno-format: YES
Compiler for C supports arguments -Wno-error=format-security: YES
Compiler for C supports arguments -Wno-strict-aliasing: YES
Compiler for C supports arguments -Wno-unused-but-set-variable: NO
Dependency libfdt found: NO (tried pkgconfig and cmake)
Library execinfo found: NO
Compiler for C supports arguments -Wno-format-truncation: NO
Dependency zlib found: YES (cached)
Library execinfo found: NO
Program doxygen found: NO
Program sphinx-build found: NO
Library execinfo found: NO
Compiler for C supports arguments -Wno-format-truncation: NO
Message: Skipping example "bpf"
Message: Skipping example "ethtool"
Has header "sys/epoll.h" : YES
Library pqos found: NO
Message: Skipping example "l2fwd-cat"
Library rt found: YES
Message: Skipping example "netmap_compat"
Message: Skipping example "performance-thread"
Message: Skipping example "quota_watermark"
Message: Skipping example "server_node_efd"
Has header "linux/virtio_scsi.h" : YES
Library virt found: NO
Dependency jansson found: NO (tried pkgconfig and cmake)
Message: Skipping example "vm_power_manager"
WARNING: Project targetting '>= 0.47.1' but tried to use feature introduced in '0.48.0': console arg in custom_target
Configuring rte_build_config.h using configuration
Message: 
=================
Libraries Enabled
=================

libs:
	kvargs, eal, ring, mempool, mbuf, net, meter, ethdev, 
	pci, cmdline, metrics, hash, timer, acl, bbdev, bitratestats, 
	cfgfile, compressdev, cryptodev, distributor, efd, eventdev, gro, gso, 
	ip_frag, jobstats, kni, latencystats, lpm, member, power, pdump, 
	rawdev, rcu, reorder, sched, security, stack, vhost, ipsec, 
	port, table, pipeline, flow_classify, bpf, 

Message: 
===============
Drivers Enabled
===============

common:
	cpt, dpaax, octeontx, octeontx2, 
bus:
	dpaa, fslmc, ifpga, pci, vdev, vmbus, 
mempool:
	bucket, dpaa, dpaa2, octeontx, octeontx2, ring, stack, 
net:
	af_packet, ark, atlantic, avp, axgbe, bond, bnx2x, bnxt, 
	cxgbe, dpaa, dpaa2, e1000, ena, enetc, enic, failsafe, 
	fm10k, i40e, hinic, iavf, ice, ifc, ipn3ke, ixgbe, 
	kni, liquidio, memif, netvsc, nfp, null, octeontx, octeontx2, 
	pcap, ring, sfc, softnic, tap, thunderx, vdev_netvsc, vhost, 
	virtio, vmxnet3, 
crypto:
	aesni_gcm, aesni_mb, caam_jr, ccp, dpaa_sec, dpaa2_sec, null_crypto, octeontx_crypto, 
	openssl, crypto_scheduler, virtio_crypto, 
compress:
	octeontx_compress, qat, zlib, 
event:
	dpaa, dpaa2, octeontx2, opdl, skeleton, sw, dsw, octeontx, 
	
baseband:
	bbdev_null, bbdev_turbo_sw, bbdev_fpga_lte_fec, 
raw:
	dpaa2_cmdif, dpaa2_qdma, ioat, ntb, octeontx2_dma, skeleton, 

Message: 
=================
Content Skipped
=================

libs:
	telemetry:	missing dependency "jansson"
	
drivers:
	common/mvep:	missing dependency, "libmusdk"
	net/af_xdp:	missing dependency, "libbpf"
	net/mlx4:	missing dependency, "ibverbs"
	net/mlx5:	missing dependency, "ibverbs"
	net/mvneta:	missing dependency, "libmusdk"
	net/mvpp2:	missing dependency, "libmusdk"
	net/nfb:	missing dependency, "libnfb"
	net/szedata2:	missing dependency, "libsze2"
	crypto/kasumi:	missing dependency, "libsso_kasumi"
	crypto/mvsam:	missing dependency, "libmusdk"
	crypto/snow3g:	missing dependency, "libsso_snow3g"
	crypto/zuc:	missing dependency, "libsso_zuc"
	compress/isal:	missing dependency, "libisal"
	raw/ifpga:	missing dependency, "libfdt"
	

Build targets in project: 570
WARNING: Project specifies a minimum meson_version '>= 0.47.1' but uses features which were added in newer versions:
 * 0.48.0: {'console arg in custom_target'}
Option default_library is: shared [default: static]
Found ninja-1.9.0.git.kitware.dyndep-1.jobserver-1 at /usr/bin/ninja
[1/848] Compiling C object 'lib/76b5a35@@rte_ethdev at sta/librte_ethdev_ethdev_profile.c.o'.
[2/848] Compiling C object 'lib/76b5a35@@rte_ethdev at sta/librte_ethdev_rte_class_eth.c.o'.
[3/848] Compiling C object 'lib/76b5a35@@rte_bitratestats at sta/librte_bitratestats_rte_bitrate.c.o'.
[4/848] Linking static target lib/librte_bitratestats.a.
[5/848] Compiling C object 'lib/76b5a35@@rte_ethdev at sta/librte_ethdev_rte_mtr.c.o'.
[6/848] Compiling C object 'lib/76b5a35@@rte_ethdev at sta/librte_ethdev_rte_tm.c.o'.
[7/848] Compiling C object 'lib/76b5a35@@rte_ethdev at sta/librte_ethdev_ethdev_private.c.o'.
[8/848] Compiling C object 'lib/76b5a35@@rte_gro at sta/librte_gro_rte_gro.c.o'.
[9/848] Compiling C object 'lib/76b5a35@@rte_ethdev at sta/librte_ethdev_rte_flow.c.o'.
[10/848] Compiling C object 'lib/76b5a35@@rte_gro at sta/librte_gro_gro_vxlan_tcp4.c.o'.
[11/848] Compiling C object 'lib/76b5a35@@rte_gro at sta/librte_gro_gro_tcp4.c.o'.
[12/848] Linking static target lib/librte_gro.a.
[13/848] Compiling C object 'lib/76b5a35@@rte_gso at sta/librte_gso_rte_gso.c.o'.
[14/848] Linking static target lib/librte_gso.a.
[15/848] Compiling C object 'lib/76b5a35@@rte_eventdev at sta/librte_eventdev_rte_event_eth_tx_adapter.c.o'.
[16/848] Compiling C object 'lib/76b5a35@@rte_ethdev at sta/librte_ethdev_rte_ethdev.c.o'.
[17/848] Linking static target lib/librte_ethdev.a.
[18/848] Compiling C object 'lib/76b5a35@@rte_eventdev at sta/librte_eventdev_rte_eventdev.c.o'.
[19/848] Compiling C object 'lib/76b5a35@@rte_kni at sta/librte_kni_rte_kni.c.o'.
[20/848] Linking static target lib/librte_kni.a.
[21/848] Linking target lib/librte_ethdev.so.12.1.
[22/848] Compiling C object 'lib/76b5a35@@rte_eventdev at sta/librte_eventdev_rte_event_eth_rx_adapter.c.o'.
[23/848] Linking static target lib/librte_eventdev.a.
[24/848] Compiling C object 'lib/76b5a35@@rte_latencystats at sta/librte_latencystats_rte_latencystats.c.o'.
[25/848] Linking static target lib/librte_latencystats.a.
[26/848] Compiling C object 'lib/76b5a35@@rte_vhost at sta/librte_vhost_socket.c.o'.
[27/848] Compiling C object 'lib/76b5a35@@rte_pdump at sta/librte_pdump_rte_pdump.c.o'.
[28/848] Linking static target lib/librte_pdump.a.
[29/848] Generating vhost_def with a custom command.
[30/848] Generating symbol file 'lib/76b5a35@@rte_ethdev at sha/librte_ethdev.so.12.1.symbols'.
[31/834] Compiling C object 'lib/76b5a35@@rte_vhost at sta/librte_vhost_vdpa.c.o'.
[32/834] Linking target lib/librte_bitratestats.so.2.1.
[33/834] Compiling C object 'lib/76b5a35@@rte_vhost at sta/librte_vhost_iotlb.c.o'.
[34/834] Linking target lib/librte_eventdev.so.7.1.
[35/834] Linking target lib/librte_gro.so.1.1.
[36/834] Compiling C object 'lib/76b5a35@@rte_vhost at sta/librte_vhost_vhost.c.o'.
[37/834] Linking target lib/librte_gso.so.1.1.
[38/834] Compiling C object 'lib/76b5a35@@rte_port at sta/librte_port_rte_port_ethdev.c.o'.
[39/834] Linking target lib/librte_kni.so.2.1.
[40/834] Compiling C object 'lib/76b5a35@@rte_vhost at sta/librte_vhost_vhost_user.c.o'.
[41/834] Generating symbol file 'lib/76b5a35@@rte_gro at sha/librte_gro.so.1.1.symbols'.
[42/834] Linking target lib/librte_latencystats.so.1.1.
[43/834] Generating symbol file 'lib/76b5a35@@rte_bitratestats at sha/librte_bitratestats.so.2.1.symbols'.
[44/834] Linking static target lib/librte_port.a.
[45/834] Linking target lib/librte_pdump.so.3.1.
[46/834] Generating symbol file 'lib/76b5a35@@rte_eventdev at sha/librte_eventdev.so.7.1.symbols'.
[47/831] Generating symbol file 'lib/76b5a35@@rte_gso at sha/librte_gso.so.1.1.symbols'.
[48/831] Generating symbol file 'lib/76b5a35@@rte_kni at sha/librte_kni.so.2.1.symbols'.
[49/831] Linking target lib/librte_port.so.3.1.
[50/831] Generating symbol file 'lib/76b5a35@@rte_latencystats at sha/librte_latencystats.so.1.1.symbols'.
[51/831] Compiling C object 'lib/76b5a35@@rte_flow_classify at sta/librte_flow_classify_rte_flow_classify.c.o'.
[52/831] Compiling C object 'lib/76b5a35@@rte_flow_classify at sta/librte_flow_classify_rte_flow_classify_parse.c.o'.
[53/831] Linking static target lib/librte_flow_classify.a.
[54/831] Compiling C object 'lib/76b5a35@@rte_bpf at sta/librte_bpf_bpf_pkt.c.o'.
[55/831] Linking static target lib/librte_bpf.a.
[56/831] Generating symbol file 'lib/76b5a35@@rte_pdump at sha/librte_pdump.so.3.1.symbols'.
[57/831] Linking target lib/librte_bpf.so.1.1.
[58/831] Compiling C object 'lib/76b5a35@@rte_vhost at sta/librte_vhost_virtio_net.c.o'.
[59/831] Compiling C object 'lib/76b5a35@@rte_vhost at sta/librte_vhost_vhost_crypto.c.o'.
[60/831] Generating symbol file 'lib/76b5a35@@rte_port at sha/librte_port.so.3.1.symbols'.
[61/827] Linking static target lib/librte_vhost.a.
[62/827] Compiling C object 'drivers/a715181@@tmp_rte_bus_dpaa at sta/bus_dpaa_base_fman_fman_hw.c.o'.
[63/827] Linking target lib/librte_vhost.so.4.1.
[64/827] Compiling C object 'drivers/a715181@@tmp_rte_bus_dpaa at sta/bus_dpaa_base_fman_fman.c.o'.
[65/827] Generating symbol file 'lib/76b5a35@@rte_bpf at sha/librte_bpf.so.1.1.symbols'.
[66/827] Linking target lib/librte_flow_classify.so.1.1.
[67/827] Compiling C object 'drivers/a715181@@tmp_rte_bus_dpaa at sta/bus_dpaa_base_fman_netcfg_layer.c.o'.
[68/827] Compiling C object 'drivers/a715181@@tmp_rte_bus_dpaa at sta/bus_dpaa_dpaa_bus.c.o'.
[69/827] Compiling C object 'drivers/a715181@@tmp_rte_bus_fslmc at sta/bus_fslmc_portal_dpaa2_hw_dpbp.c.o'.
[70/827] Generating symbol file 'lib/76b5a35@@rte_flow_classify at sha/librte_flow_classify.so.1.1.symbols'.
[71/827] Compiling C object 'drivers/a715181@@tmp_rte_bus_fslmc at sta/bus_fslmc_fslmc_bus.c.o'.
[72/827] Generating symbol file 'lib/76b5a35@@rte_vhost at sha/librte_vhost.so.4.1.symbols'.
[73/827] Compiling C object 'drivers/a715181@@tmp_rte_bus_fslmc at sta/bus_fslmc_portal_dpaa2_hw_dpci.c.o'.
[74/827] Compiling C object 'drivers/a715181@@tmp_rte_bus_dpaa at sta/bus_dpaa_base_qbman_qman.c.o'.
[75/827] Linking static target drivers/libtmp_rte_bus_dpaa.a.
[76/827] Compiling C object 'drivers/a715181@@tmp_rte_bus_fslmc at sta/bus_fslmc_fslmc_vfio.c.o'.
[77/827] Compiling C object 'drivers/a715181@@tmp_rte_bus_fslmc at sta/bus_fslmc_portal_dpaa2_hw_dpio.c.o'.
[78/827] Linking static target drivers/libtmp_rte_bus_fslmc.a.
[79/827] Generating rte_bus_dpaa.pmd.c with a custom command.
[80/827] Compiling C object 'drivers/a715181@@rte_bus_dpaa at sta/meson-generated_.._rte_bus_dpaa.pmd.c.o'.
[81/827] Compiling C object 'drivers/a715181@@tmp_rte_mempool_dpaa at sta/mempool_dpaa_dpaa_mempool.c.o'.
[82/827] Linking static target drivers/librte_bus_dpaa.a.
[83/827] Linking static target drivers/libtmp_rte_mempool_dpaa.a.
[84/827] Generating rte_mempool_dpaa.pmd.c with a custom command.
[85/827] Generating rte_bus_fslmc.pmd.c with a custom command.
[86/827] Compiling C object 'drivers/a715181@@tmp_rte_mempool_dpaa2 at sta/mempool_dpaa2_dpaa2_hw_mempool.c.o'.
[87/827] Compiling C object 'drivers/a715181@@rte_bus_dpaa at sha/meson-generated_.._rte_bus_dpaa.pmd.c.o'.
[88/827] Linking static target drivers/libtmp_rte_mempool_dpaa2.a.
[89/827] Compiling C object 'drivers/a715181@@rte_mempool_dpaa at sta/meson-generated_.._rte_mempool_dpaa.pmd.c.o'.
[90/827] Compiling C object 'drivers/a715181@@rte_bus_fslmc at sta/meson-generated_.._rte_bus_fslmc.pmd.c.o'.
[91/827] Linking static target drivers/librte_bus_fslmc.a.
[92/827] Generating rte_mempool_dpaa2.pmd.c with a custom command.
[93/827] Compiling C object 'drivers/a715181@@rte_bus_fslmc at sha/meson-generated_.._rte_bus_fslmc.pmd.c.o'.
[94/827] Compiling C object 'drivers/a715181@@tmp_rte_pmd_memif at sta/net_memif_rte_eth_memif.c.o'.
[95/827] Linking target drivers/librte_bus_dpaa.so.2.1.
[96/827] Compiling C object 'drivers/a715181@@rte_mempool_dpaa2 at sta/meson-generated_.._rte_mempool_dpaa2.pmd.c.o'.
[97/827] Compiling C object 'drivers/a715181@@rte_mempool_dpaa at sha/meson-generated_.._rte_mempool_dpaa.pmd.c.o'.
[98/827] Linking static target drivers/librte_mempool_dpaa.a.
[99/827] Linking target drivers/librte_bus_fslmc.so.2.1.
[100/827] Linking static target drivers/librte_mempool_dpaa2.a.
[101/827] Compiling C object 'drivers/a715181@@rte_mempool_dpaa2 at sha/meson-generated_.._rte_mempool_dpaa2.pmd.c.o'.
[102/827] Compiling C object 'drivers/a715181@@tmp_rte_pmd_octeontx2 at sta/net_octeontx2_otx2_rss.c.o'.
[103/827] Generating symbol file 'drivers/a715181@@rte_bus_fslmc at sha/librte_bus_fslmc.so.2.1.symbols'.
[104/827] Linking target drivers/librte_mempool_dpaa2.so.2.1.
[105/827] Generating symbol file 'drivers/a715181@@rte_bus_dpaa at sha/librte_bus_dpaa.so.2.1.symbols'.
[106/826] Compiling C object 'drivers/a715181@@tmp_rte_pmd_ark at sta/net_ark_ark_ethdev_rx.c.o'.
[107/826] Compiling C object 'drivers/a715181@@tmp_rte_pmd_octeontx2 at sta/net_octeontx2_otx2_ethdev_devargs.c.o'.
[108/826] Linking target drivers/librte_mempool_dpaa.so.1.1.
[109/826] Compiling C object 'drivers/a715181@@tmp_rte_pmd_ark at sta/net_ark_ark_ethdev.c.o'.
[110/826] Compiling C object 'drivers/a715181@@tmp_rte_pmd_af_packet at sta/net_af_packet_rte_eth_af_packet.c.o'.
[111/826] Linking static target drivers/libtmp_rte_pmd_af_packet.a.
[112/826] Generating symbol file 'drivers/a715181@@rte_mempool_dpaa2 at sha/librte_mempool_dpaa2.so.2.1.symbols'.
[113/822] Generating rte_pmd_af_packet.pmd.c with a custom command.
[114/822] Compiling C object 'drivers/a715181@@rte_pmd_af_packet at sta/meson-generated_.._rte_pmd_af_packet.pmd.c.o'.
[115/822] Compiling C object 'drivers/a715181@@rte_pmd_af_packet at sha/meson-generated_.._rte_pmd_af_packet.pmd.c.o'.
[116/822] Linking static target drivers/librte_pmd_af_packet.a.
[117/822] Compiling C object 'drivers/a715181@@tmp_rte_pmd_octeontx2 at sta/net_octeontx2_otx2_tx.c.o'.
[118/822] Linking target drivers/librte_pmd_af_packet.so.1.1.
[119/822] Compiling C object 'drivers/a715181@@tmp_rte_pmd_ark at sta/net_ark_ark_pktchkr.c.o'.
[120/822] Generating symbol file 'drivers/a715181@@rte_mempool_dpaa at sha/librte_mempool_dpaa.so.1.1.symbols'.
[121/822] Compiling C object 'drivers/a715181@@tmp_rte_pmd_ark at sta/net_ark_ark_ethdev_tx.c.o'.
[122/822] Compiling C object 'drivers/a715181@@tmp_rte_pmd_ark at sta/net_ark_ark_pktdir.c.o'.
[123/822] Compiling C object 'drivers/a715181@@tmp_rte_pmd_ark at sta/net_ark_ark_pktgen.c.o'.
[124/822] Linking static target drivers/libtmp_rte_pmd_ark.a.
[125/822] Generating rte_pmd_ark.pmd.c with a custom command.
[126/822] Compiling C object 'drivers/a715181@@tmp_rte_pmd_atlantic at sta/net_atlantic_rte_pmd_atlantic.c.o'.
[127/822] Compiling C object 'drivers/a715181@@rte_pmd_ark at sta/meson-generated_.._rte_pmd_ark.pmd.c.o'.
[128/822] Linking static target drivers/librte_pmd_ark.a.
[129/822] Compiling C object 'drivers/a715181@@rte_pmd_ark at sha/meson-generated_.._rte_pmd_ark.pmd.c.o'.
[130/822] Compiling C object 'drivers/a715181@@tmp_rte_pmd_atlantic at sta/net_atlantic_atl_rxtx.c.o'.
[131/822] Linking target drivers/librte_pmd_ark.so.1.1.
[132/822] Compiling C object 'drivers/a715181@@tmp_rte_pmd_atlantic at sta/net_atlantic_atl_ethdev.c.o'.
[133/822] Linking static target drivers/libtmp_rte_pmd_atlantic.a.
[134/822] Compiling C object 'drivers/a715181@@tmp_rte_pmd_octeontx2 at sta/net_octeontx2_otx2_rx.c.o'.
[135/822] Generating rte_pmd_atlantic.pmd.c with a custom command.
[136/822] Compiling C object 'drivers/a715181@@tmp_rte_pmd_axgbe at sta/net_axgbe_axgbe_ethdev.c.o'.
[137/822] Compiling C object 'drivers/a715181@@rte_pmd_atlantic at sta/meson-generated_.._rte_pmd_atlantic.pmd.c.o'.
[138/822] Linking static target drivers/librte_pmd_atlantic.a.
[139/822] Compiling C object 'drivers/a715181@@rte_pmd_atlantic at sha/meson-generated_.._rte_pmd_atlantic.pmd.c.o'.
[140/822] Compiling C object 'drivers/a715181@@tmp_rte_pmd_avp at sta/net_avp_avp_ethdev.c.o'.
[141/822] Linking target drivers/librte_pmd_atlantic.so.1.1.
[142/822] Compiling C object 'drivers/a715181@@tmp_rte_pmd_axgbe at sta/net_axgbe_axgbe_i2c.c.o'.
[143/822] Linking static target drivers/libtmp_rte_pmd_avp.a.
[144/822] Generating rte_pmd_avp.pmd.c with a custom command.
[145/822] Compiling C object 'drivers/a715181@@tmp_rte_pmd_axgbe at sta/net_axgbe_axgbe_dev.c.o'.
[146/822] Compiling C object 'drivers/a715181@@rte_pmd_avp at sta/meson-generated_.._rte_pmd_avp.pmd.c.o'.
[147/822] Compiling C object 'drivers/a715181@@rte_pmd_avp at sha/meson-generated_.._rte_pmd_avp.pmd.c.o'.
[148/822] Linking static target drivers/librte_pmd_avp.a.
[149/822] Compiling C object 'drivers/a715181@@tmp_rte_pmd_axgbe at sta/net_axgbe_axgbe_mdio.c.o'.
[150/822] Linking target drivers/librte_pmd_avp.so.1.1.
[151/822] Compiling C object 'drivers/a715181@@tmp_rte_pmd_axgbe at sta/net_axgbe_axgbe_rxtx.c.o'.
[152/822] Compiling C object 'drivers/a715181@@tmp_rte_pmd_axgbe at sta/net_axgbe_axgbe_phy_impl.c.o'.
[153/822] Compiling C object 'drivers/a715181@@tmp_rte_pmd_axgbe at sta/net_axgbe_axgbe_rxtx_vec_sse.c.o'.
[154/822] Linking static target drivers/libtmp_rte_pmd_axgbe.a.
[155/822] Compiling C object 'drivers/a715181@@tmp_rte_pmd_bond at sta/net_bonding_rte_eth_bond_args.c.o'.
[156/822] Generating rte_pmd_axgbe.pmd.c with a custom command.
[157/822] Compiling C object 'drivers/a715181@@tmp_rte_pmd_bond at sta/net_bonding_rte_eth_bond_alb.c.o'.
[158/822] Compiling C object 'drivers/a715181@@rte_pmd_axgbe at sta/meson-generated_.._rte_pmd_axgbe.pmd.c.o'.
[159/822] Compiling C object 'drivers/a715181@@tmp_rte_pmd_bond at sta/net_bonding_rte_eth_bond_flow.c.o'.
[160/822] Linking static target drivers/librte_pmd_axgbe.a.
[161/822] Compiling C object 'drivers/a715181@@tmp_rte_pmd_bond at sta/net_bonding_rte_eth_bond_api.c.o'.
[162/822] Compiling C object 'drivers/a715181@@rte_pmd_axgbe at sha/meson-generated_.._rte_pmd_axgbe.pmd.c.o'.
[163/822] Linking target drivers/librte_pmd_axgbe.so.1.1.
[164/822] Compiling C object 'drivers/a715181@@tmp_rte_pmd_bond at sta/net_bonding_rte_eth_bond_8023ad.c.o'.
[165/822] Compiling C object 'drivers/a715181@@tmp_rte_pmd_bnx2x at sta/net_bnx2x_bnx2x_ethdev.c.o'.
[166/822] Compiling C object 'drivers/a715181@@tmp_rte_pmd_bnx2x at sta/net_bnx2x_bnx2x_vfpf.c.o'.
[167/822] Compiling C object 'drivers/a715181@@tmp_rte_pmd_bnx2x at sta/net_bnx2x_bnx2x_rxtx.c.o'.
[168/822] Compiling C object 'drivers/a715181@@tmp_rte_pmd_bond at sta/net_bonding_rte_eth_bond_pmd.c.o'.
[169/822] Linking static target drivers/libtmp_rte_pmd_bond.a.
[170/822] Generating rte_pmd_bond.pmd.c with a custom command.
[171/822] Compiling C object 'drivers/a715181@@rte_pmd_bond at sta/meson-generated_.._rte_pmd_bond.pmd.c.o'.
[172/822] Compiling C object 'drivers/a715181@@rte_pmd_bond at sha/meson-generated_.._rte_pmd_bond.pmd.c.o'.
[173/822] Linking static target drivers/librte_pmd_bond.a.
[174/822] Compiling C object 'drivers/a715181@@tmp_rte_pmd_bnxt at sta/net_bnxt_bnxt_filter.c.o'.
[175/822] Linking target drivers/librte_pmd_bond.so.2.1.
[176/822] Compiling C object 'drivers/a715181@@tmp_rte_pmd_bnxt at sta/net_bnxt_bnxt_cpr.c.o'.
[177/822] Compiling C object 'drivers/a715181@@tmp_rte_pmd_bnx2x at sta/net_bnx2x_ecore_sp.c.o'.
[178/822] Generating symbol file 'drivers/a715181@@rte_pmd_bond at sha/librte_pmd_bond.so.2.1.symbols'.
[179/822] Compiling C object 'drivers/a715181@@tmp_rte_pmd_bnx2x at sta/net_bnx2x_bnx2x_stats.c.o'.
[180/822] Compiling C object 'drivers/a715181@@tmp_rte_pmd_bnxt at sta/net_bnxt_bnxt_irq.c.o'.
[181/822] Compiling C object 'drivers/a715181@@tmp_rte_pmd_bnxt at sta/net_bnxt_bnxt_ethdev.c.o'.
[182/822] Compiling C object 'drivers/a715181@@tmp_rte_pmd_bnxt at sta/net_bnxt_bnxt_flow.c.o'.
[183/822] Compiling C object 'drivers/a715181@@tmp_rte_pmd_bnxt at sta/net_bnxt_bnxt_ring.c.o'.
[184/822] Compiling C object 'drivers/a715181@@tmp_rte_pmd_bnxt at sta/net_bnxt_bnxt_rxr.c.o'.
[185/822] Compiling C object 'drivers/a715181@@tmp_rte_pmd_bnxt at sta/net_bnxt_bnxt_stats.c.o'.
[186/822] Compiling C object 'drivers/a715181@@tmp_rte_pmd_bnxt at sta/net_bnxt_bnxt_txq.c.o'.
[187/822] Compiling C object 'drivers/a715181@@tmp_rte_pmd_bnxt at sta/net_bnxt_bnxt_rxq.c.o'.
[188/822] Compiling C object 'drivers/a715181@@tmp_rte_pmd_bnxt at sta/net_bnxt_bnxt_hwrm.c.o'.
[189/822] Compiling C object 'drivers/a715181@@tmp_rte_pmd_bnxt at sta/net_bnxt_bnxt_vnic.c.o'.
[190/822] Compiling C object 'drivers/a715181@@tmp_rte_pmd_bnxt at sta/net_bnxt_bnxt_txr.c.o'.
[191/822] Compiling C object 'drivers/a715181@@tmp_rte_pmd_bnx2x at sta/net_bnx2x_elink.c.o'.
[192/822] Compiling C object 'drivers/a715181@@tmp_rte_pmd_bnx2x at sta/net_bnx2x_bnx2x.c.o'.
[193/822] Linking static target drivers/libtmp_rte_pmd_bnx2x.a.
[194/822] Compiling C object 'drivers/a715181@@tmp_rte_pmd_cxgbe at sta/net_cxgbe_cxgbevf_ethdev.c.o'.
[195/822] Compiling C object 'drivers/a715181@@tmp_rte_pmd_bnxt at sta/net_bnxt_rte_pmd_bnxt.c.o'.
[196/822] Generating rte_pmd_bnx2x.pmd.c with a custom command.
[197/822] Compiling C object 'drivers/a715181@@rte_pmd_bnx2x at sta/meson-generated_.._rte_pmd_bnx2x.pmd.c.o'.
[198/822] Compiling C object 'drivers/a715181@@tmp_rte_pmd_cxgbe at sta/net_cxgbe_cxgbevf_main.c.o'.
[199/822] Linking static target drivers/librte_pmd_bnx2x.a.
[200/822] Compiling C object 'drivers/a715181@@rte_pmd_bnx2x at sha/meson-generated_.._rte_pmd_bnx2x.pmd.c.o'.
[201/822] Compiling C object 'drivers/a715181@@tmp_rte_pmd_cxgbe at sta/net_cxgbe_cxgbe_ethdev.c.o'.
[202/822] Compiling C object 'drivers/a715181@@tmp_rte_pmd_bnxt at sta/net_bnxt_bnxt_rxtx_vec_sse.c.o'.
[203/822] Linking target drivers/librte_pmd_bnx2x.so.1.1.
[204/822] Linking static target drivers/libtmp_rte_pmd_bnxt.a.
[205/822] Compiling C object 'drivers/a715181@@tmp_rte_pmd_cxgbe at sta/net_cxgbe_cxgbe_flow.c.o'.
[206/822] Compiling C object 'drivers/a715181@@tmp_rte_pmd_cxgbe at sta/net_cxgbe_clip_tbl.c.o'.
[207/822] Generating rte_pmd_bnxt.pmd.c with a custom command.
[208/822] Compiling C object 'drivers/a715181@@tmp_rte_pmd_cxgbe at sta/net_cxgbe_cxgbe_filter.c.o'.
[209/822] Compiling C object 'drivers/a715181@@rte_pmd_bnxt at sha/meson-generated_.._rte_pmd_bnxt.pmd.c.o'.
[210/822] Compiling C object 'drivers/a715181@@rte_pmd_bnxt at sta/meson-generated_.._rte_pmd_bnxt.pmd.c.o'.
[211/822] Linking target drivers/librte_pmd_bnxt.so.2.1.
[212/822] Linking static target drivers/librte_pmd_bnxt.a.
[213/822] Compiling C object 'drivers/a715181@@tmp_rte_pmd_cxgbe at sta/net_cxgbe_cxgbe_main.c.o'.
[214/822] Compiling C object 'drivers/a715181@@tmp_rte_pmd_cxgbe at sta/net_cxgbe_l2t.c.o'.
[215/822] Compiling C object 'drivers/a715181@@tmp_rte_pmd_cxgbe at sta/net_cxgbe_mps_tcam.c.o'.
[216/822] Compiling C object 'drivers/a715181@@tmp_rte_pmd_cxgbe at sta/net_cxgbe_base_t4vf_hw.c.o'.
[217/822] Generating symbol file 'drivers/a715181@@rte_pmd_bnxt at sha/librte_pmd_bnxt.so.2.1.symbols'.
[218/822] Compiling C object 'drivers/a715181@@tmp_rte_pmd_dpaa2 at sta/net_dpaa2_base_dpaa2_hw_dpni.c.o'.
[219/822] Compiling C object 'drivers/a715181@@tmp_rte_pmd_cxgbe at sta/net_cxgbe_sge.c.o'.
[220/822] Compiling C object 'drivers/a715181@@tmp_rte_pmd_dpaa at sta/net_dpaa_dpaa_ethdev.c.o'.
[221/822] Compiling C object 'drivers/a715181@@tmp_rte_pmd_cxgbe at sta/net_cxgbe_base_t4_hw.c.o'.
[222/822] Linking static target drivers/libtmp_rte_pmd_cxgbe.a.
[223/822] Compiling C object 'drivers/a715181@@tmp_rte_pmd_dpaa2 at sta/net_dpaa2_dpaa2_ethdev.c.o'.
[224/822] Generating rte_pmd_cxgbe.pmd.c with a custom command.
[225/822] Compiling C object 'drivers/a715181@@tmp_rte_pmd_dpaa at sta/net_dpaa_dpaa_rxtx.c.o'.
[226/822] Compiling C object 'drivers/a715181@@rte_pmd_cxgbe at sta/meson-generated_.._rte_pmd_cxgbe.pmd.c.o'.
[227/822] Compiling C object 'drivers/a715181@@tmp_rte_pmd_dpaa2 at sta/net_dpaa2_dpaa2_mux.c.o'.
[228/822] Compiling C object 'drivers/a715181@@rte_pmd_cxgbe at sha/meson-generated_.._rte_pmd_cxgbe.pmd.c.o'.
[229/822] Linking static target drivers/libtmp_rte_pmd_dpaa.a.
[230/822] Linking static target drivers/librte_pmd_cxgbe.a.
[231/822] Linking target drivers/librte_pmd_cxgbe.so.1.1.
[232/822] Compiling C object 'drivers/a715181@@tmp_rte_pmd_dpaa2 at sta/net_dpaa2_dpaa2_flow.c.o'.
[233/822] Generating rte_pmd_dpaa.pmd.c with a custom command.
[234/822] Compiling C object 'drivers/a715181@@rte_pmd_dpaa at sha/meson-generated_.._rte_pmd_dpaa.pmd.c.o'.
[235/822] Compiling C object 'drivers/a715181@@tmp_rte_pmd_e1000 at sta/net_e1000_em_ethdev.c.o'.
[236/822] Compiling C object 'drivers/a715181@@rte_pmd_dpaa at sta/meson-generated_.._rte_pmd_dpaa.pmd.c.o'.
[237/822] Linking static target drivers/librte_pmd_dpaa.a.
[238/822] Linking target drivers/librte_pmd_dpaa.so.1.1.
[239/822] Compiling C object 'drivers/a715181@@tmp_rte_pmd_dpaa2 at sta/net_dpaa2_dpaa2_rxtx.c.o'.
[240/822] Linking static target drivers/libtmp_rte_pmd_dpaa2.a.
[241/822] Compiling C object 'drivers/a715181@@tmp_rte_pmd_ena at sta/net_ena_base_ena_eth_com.c.o'.
[242/822] Generating rte_pmd_dpaa2.pmd.c with a custom command.
[243/822] Compiling C object 'drivers/a715181@@rte_pmd_dpaa2 at sta/meson-generated_.._rte_pmd_dpaa2.pmd.c.o'.
[244/822] Generating symbol file 'drivers/a715181@@rte_pmd_dpaa at sha/librte_pmd_dpaa.so.1.1.symbols'.
[245/822] Compiling C object 'drivers/a715181@@rte_pmd_dpaa2 at sha/meson-generated_.._rte_pmd_dpaa2.pmd.c.o'.
[246/822] Linking static target drivers/librte_pmd_dpaa2.a.
[247/822] Linking target drivers/librte_pmd_dpaa2.so.2.1.
[248/822] Compiling C object 'drivers/a715181@@tmp_rte_pmd_e1000 at sta/net_e1000_em_rxtx.c.o'.
[249/822] Compiling C object 'drivers/a715181@@tmp_rte_pmd_e1000 at sta/net_e1000_igb_pf.c.o'.
[250/822] Compiling C object 'drivers/a715181@@tmp_rte_pmd_e1000 at sta/net_e1000_igb_flow.c.o'.
[251/822] Compiling C object 'drivers/a715181@@tmp_rte_pmd_e1000 at sta/net_e1000_igb_rxtx.c.o'.
[252/822] Compiling C object 'drivers/a715181@@tmp_rte_pmd_ena at sta/net_ena_base_ena_com.c.o'.
[253/822] Generating symbol file 'drivers/a715181@@rte_pmd_dpaa2 at sha/librte_pmd_dpaa2.so.2.1.symbols'.
[254/822] Compiling C object 'drivers/a715181@@tmp_rte_pmd_e1000 at sta/net_e1000_igb_ethdev.c.o'.
[255/822] Linking static target drivers/libtmp_rte_pmd_e1000.a.
[256/822] Compiling C object 'drivers/a715181@@tmp_rte_pmd_enic at sta/net_enic_enic_clsf.c.o'.
[257/822] Compiling C object 'drivers/a715181@@tmp_rte_pmd_enetc at sta/net_enetc_enetc_ethdev.c.o'.
[258/822] Generating rte_pmd_e1000.pmd.c with a custom command.
[259/822] Compiling C object 'drivers/a715181@@tmp_rte_pmd_enic at sta/net_enic_enic_ethdev.c.o'.
[260/822] Compiling C object 'drivers/a715181@@rte_pmd_e1000 at sha/meson-generated_.._rte_pmd_e1000.pmd.c.o'.
[261/822] Compiling C object 'drivers/a715181@@rte_pmd_e1000 at sta/meson-generated_.._rte_pmd_e1000.pmd.c.o'.
[262/822] Linking static target drivers/librte_pmd_e1000.a.
[263/822] Compiling C object 'drivers/a715181@@tmp_rte_pmd_enetc at sta/net_enetc_enetc_rxtx.c.o'.
[264/822] Linking static target drivers/libtmp_rte_pmd_enetc.a.
[265/822] Linking target drivers/librte_pmd_e1000.so.1.1.
[266/822] Generating rte_pmd_enetc.pmd.c with a custom command.
[267/822] Compiling C object 'drivers/a715181@@rte_pmd_enetc at sta/meson-generated_.._rte_pmd_enetc.pmd.c.o'.
[268/822] Compiling C object 'drivers/a715181@@tmp_rte_pmd_enic at sta/net_enic_enic_res.c.o'.
[269/822] Linking static target drivers/librte_pmd_enetc.a.
[270/822] Compiling C object 'drivers/a715181@@rte_pmd_enetc at sha/meson-generated_.._rte_pmd_enetc.pmd.c.o'.
[271/822] Compiling C object 'drivers/a715181@@tmp_rte_pmd_ena at sta/net_ena_ena_ethdev.c.o'.
[272/822] Compiling C object 'drivers/a715181@@tmp_rte_pmd_enic at sta/net_enic_enic_flow.c.o'.
[273/822] Linking static target drivers/libtmp_rte_pmd_ena.a.
[274/822] Generating rte_pmd_ena.pmd.c with a custom command.
[275/822] Compiling C object 'drivers/a715181@@rte_pmd_ena at sta/meson-generated_.._rte_pmd_ena.pmd.c.o'.
[276/822] Linking target drivers/librte_pmd_enetc.so.1.1.
[277/822] Linking static target drivers/librte_pmd_ena.a.
[278/822] Compiling C object 'drivers/a715181@@rte_pmd_ena at sha/meson-generated_.._rte_pmd_ena.pmd.c.o'.
[279/822] Compiling C object 'drivers/a715181@@tmp_rte_pmd_enic at sta/net_enic_enic_main.c.o'.
[280/822] Linking target drivers/librte_pmd_ena.so.1.1.
[281/822] Compiling C object 'drivers/a715181@@tmp_rte_pmd_failsafe at sta/net_failsafe_failsafe.c.o'.
[282/822] Compiling C object 'drivers/a715181@@tmp_rte_pmd_enic at sta/net_enic_enic_rxtx_vec_avx2.c.o'.
[283/822] Compiling C object 'drivers/a715181@@tmp_rte_pmd_enic at sta/net_enic_enic_rxtx.c.o'.
[284/822] Linking static target drivers/libtmp_rte_pmd_enic.a.
[285/822] Compiling C object 'drivers/a715181@@tmp_rte_pmd_failsafe at sta/net_failsafe_failsafe_args.c.o'.
[286/822] Compiling C object 'drivers/a715181@@tmp_rte_pmd_failsafe at sta/net_failsafe_failsafe_intr.c.o'.
[287/822] Generating rte_pmd_enic.pmd.c with a custom command.
[288/822] Compiling C object 'drivers/a715181@@tmp_rte_pmd_failsafe at sta/net_failsafe_failsafe_eal.c.o'.
[289/822] Compiling C object 'drivers/a715181@@tmp_rte_pmd_failsafe at sta/net_failsafe_failsafe_flow.c.o'.
[290/822] Compiling C object 'drivers/a715181@@tmp_rte_pmd_failsafe at sta/net_failsafe_failsafe_ether.c.o'.
[291/822] Compiling C object 'drivers/a715181@@rte_pmd_enic at sha/meson-generated_.._rte_pmd_enic.pmd.c.o'.
[292/822] Compiling C object 'drivers/a715181@@rte_pmd_enic at sta/meson-generated_.._rte_pmd_enic.pmd.c.o'.
[293/822] Linking static target drivers/librte_pmd_enic.a.
[294/822] Linking target drivers/librte_pmd_enic.so.1.1.
[295/822] Compiling C object 'drivers/a715181@@tmp_rte_pmd_failsafe at sta/net_failsafe_failsafe_rxtx.c.o'.
[296/822] Compiling C object 'drivers/a715181@@tmp_rte_pmd_failsafe at sta/net_failsafe_failsafe_ops.c.o'.
[297/822] Compiling C object 'drivers/a715181@@tmp_rte_pmd_fm10k at sta/net_fm10k_fm10k_rxtx.c.o'.
[298/822] Linking static target drivers/libtmp_rte_pmd_failsafe.a.
[299/822] Generating rte_pmd_failsafe.pmd.c with a custom command.
[300/822] Compiling C object 'drivers/a715181@@rte_pmd_failsafe at sta/meson-generated_.._rte_pmd_failsafe.pmd.c.o'.
[301/822] Compiling C object 'drivers/a715181@@rte_pmd_failsafe at sha/meson-generated_.._rte_pmd_failsafe.pmd.c.o'.
[302/822] Linking static target drivers/librte_pmd_failsafe.a.
[303/822] Compiling C object 'drivers/a715181@@tmp_rte_pmd_i40e at sta/net_i40e_i40e_pf.c.o'.
[304/822] Linking target drivers/librte_pmd_failsafe.so.1.1.
[305/822] Compiling C object 'drivers/a715181@@tmp_rte_pmd_fm10k at sta/net_fm10k_fm10k_rxtx_vec.c.o'.
[306/822] Compiling C object 'drivers/a715181@@tmp_rte_pmd_i40e at sta/net_i40e_i40e_ethdev_vf.c.o'.
[307/822] Compiling C object 'drivers/a715181@@tmp_rte_pmd_fm10k at sta/net_fm10k_fm10k_ethdev.c.o'.
[308/822] Linking static target drivers/libtmp_rte_pmd_fm10k.a.
[309/822] Generating rte_pmd_fm10k.pmd.c with a custom command.
[310/822] Compiling C object 'drivers/a715181@@rte_pmd_fm10k at sta/meson-generated_.._rte_pmd_fm10k.pmd.c.o'.
[311/822] Compiling C object 'drivers/a715181@@rte_pmd_fm10k at sha/meson-generated_.._rte_pmd_fm10k.pmd.c.o'.
[312/822] Linking static target drivers/librte_pmd_fm10k.a.
[313/822] Compiling C object 'drivers/a715181@@tmp_rte_pmd_i40e at sta/net_i40e_i40e_rxtx.c.o'.
[314/822] Compiling C object 'drivers/a715181@@tmp_rte_pmd_i40e at sta/net_i40e_i40e_tm.c.o'.
[315/822] Linking target drivers/librte_pmd_fm10k.so.1.1.
[316/822] Compiling C object 'drivers/a715181@@tmp_rte_pmd_i40e at sta/net_i40e_i40e_vf_representor.c.o'.
[317/822] Compiling C object 'drivers/a715181@@tmp_rte_pmd_i40e at sta/net_i40e_i40e_fdir.c.o'.
[318/822] Compiling C object 'drivers/a715181@@tmp_rte_pmd_i40e at sta/net_i40e_i40e_flow.c.o'.
[319/822] Compiling C object 'drivers/net/hinic/base/12a4447@@hinic_base at sta/hinic_pmd_hwdev.c.o'.
[320/822] Linking static target drivers/net/hinic/base/libhinic_base.a.
[321/822] Compiling C object 'drivers/a715181@@tmp_rte_pmd_hinic at sta/net_hinic_hinic_pmd_rx.c.o'.
[322/822] Compiling C object 'drivers/a715181@@tmp_rte_pmd_i40e at sta/net_i40e_rte_pmd_i40e.c.o'.
[323/822] Compiling C object 'drivers/a715181@@tmp_rte_pmd_i40e at sta/net_i40e_i40e_rxtx_vec_sse.c.o'.
[324/822] Compiling C object 'drivers/a715181@@tmp_rte_pmd_hinic at sta/net_hinic_hinic_pmd_ethdev.c.o'.
[325/822] Compiling C object 'drivers/a715181@@tmp_rte_pmd_i40e at sta/net_i40e_i40e_rxtx_vec_avx2.c.o'.
[326/822] Compiling C object 'drivers/a715181@@tmp_rte_pmd_iavf at sta/net_iavf_iavf_vchnl.c.o'.
[327/822] Compiling C object 'drivers/a715181@@tmp_rte_pmd_i40e at sta/net_i40e_i40e_ethdev.c.o'.
[328/822] Compiling C object 'drivers/a715181@@tmp_rte_pmd_iavf at sta/net_iavf_iavf_ethdev.c.o'.
[329/822] Linking static target drivers/libtmp_rte_pmd_i40e.a.
[330/822] Generating rte_pmd_i40e.pmd.c with a custom command.
[331/822] Compiling C object 'drivers/a715181@@rte_pmd_i40e at sta/meson-generated_.._rte_pmd_i40e.pmd.c.o'.
[332/822] Compiling C object 'drivers/a715181@@tmp_rte_pmd_hinic at sta/net_hinic_hinic_pmd_tx.c.o'.
[333/822] Compiling C object 'drivers/a715181@@tmp_rte_pmd_iavf at sta/net_iavf_iavf_rxtx.c.o'.
[334/822] Linking static target drivers/libtmp_rte_pmd_hinic.a.
[335/822] Linking static target drivers/librte_pmd_i40e.a.
[336/822] Compiling C object 'drivers/a715181@@rte_pmd_i40e at sha/meson-generated_.._rte_pmd_i40e.pmd.c.o'.
[337/822] Compiling C object 'drivers/a715181@@tmp_rte_pmd_ice at sta/net_ice_ice_rxtx.c.o'.
[338/822] Generating rte_pmd_hinic.pmd.c with a custom command.
[339/822] Compiling C object 'drivers/a715181@@tmp_rte_pmd_iavf at sta/net_iavf_iavf_rxtx_vec_sse.c.o'.
[340/822] Compiling C object 'drivers/a715181@@tmp_rte_pmd_ice at sta/net_ice_ice_switch_filter.c.o'.
[341/822] Linking static target drivers/libtmp_rte_pmd_iavf.a.
[342/822] Compiling C object 'drivers/a715181@@rte_pmd_hinic at sha/meson-generated_.._rte_pmd_hinic.pmd.c.o'.
[343/822] Compiling C object 'drivers/a715181@@rte_pmd_hinic at sta/meson-generated_.._rte_pmd_hinic.pmd.c.o'.
[344/822] Linking target drivers/librte_pmd_i40e.so.2.1.
[345/822] Linking static target drivers/librte_pmd_hinic.a.
[346/822] Generating rte_pmd_iavf.pmd.c with a custom command.
[347/822] Linking target drivers/librte_pmd_hinic.so.1.1.
[348/822] Compiling C object 'drivers/a715181@@rte_pmd_iavf at sha/meson-generated_.._rte_pmd_iavf.pmd.c.o'.
[349/822] Compiling C object 'drivers/a715181@@tmp_rte_pmd_ice at sta/net_ice_ice_ethdev.c.o'.
[350/822] Compiling C object 'drivers/a715181@@rte_pmd_iavf at sta/meson-generated_.._rte_pmd_iavf.pmd.c.o'.
[351/822] Linking static target drivers/librte_pmd_iavf.a.
[352/822] Linking target drivers/librte_pmd_iavf.so.1.1.
[353/822] Compiling C object 'drivers/a715181@@tmp_rte_pmd_ice at sta/net_ice_ice_generic_flow.c.o'.
[354/822] Generating symbol file 'drivers/a715181@@rte_pmd_i40e at sha/librte_pmd_i40e.so.2.1.symbols'.
[355/822] Compiling C object 'drivers/a715181@@tmp_rte_pmd_ice at sta/net_ice_ice_rxtx_vec_sse.c.o'.
[356/822] Compiling C object 'drivers/a715181@@tmp_rte_pmd_ipn3ke at sta/net_ipn3ke_ipn3ke_ethdev.c.o'.
[357/822] Compiling C object 'drivers/a715181@@tmp_rte_pmd_ifc at sta/net_ifc_ifcvf_vdpa.c.o'.
[358/822] Linking static target drivers/libtmp_rte_pmd_ifc.a.
[359/822] Generating rte_pmd_ifc.pmd.c with a custom command.
[360/822] Compiling C object 'drivers/a715181@@tmp_rte_pmd_ixgbe at sta/net_ixgbe_ixgbe_fdir.c.o'.
[361/822] Compiling C object 'drivers/a715181@@tmp_rte_pmd_ipn3ke at sta/net_ipn3ke_ipn3ke_representor.c.o'.
[362/822] Compiling C object 'drivers/a715181@@rte_pmd_ifc at sha/meson-generated_.._rte_pmd_ifc.pmd.c.o'.
[363/822] Compiling C object 'drivers/a715181@@rte_pmd_ifc at sta/meson-generated_.._rte_pmd_ifc.pmd.c.o'.
[364/822] Linking target drivers/librte_pmd_ifc.so.1.1.
[365/822] Linking static target drivers/librte_pmd_ifc.a.
[366/822] Compiling C object 'drivers/a715181@@tmp_rte_pmd_ice at sta/net_ice_ice_rxtx_vec_avx2.c.o'.
[367/822] Compiling C object 'drivers/a715181@@tmp_rte_pmd_ixgbe at sta/net_ixgbe_ixgbe_bypass.c.o'.
[368/822] Linking static target drivers/libtmp_rte_pmd_ice.a.
[369/822] Compiling C object 'drivers/a715181@@tmp_rte_pmd_ipn3ke at sta/net_ipn3ke_ipn3ke_flow.c.o'.
[370/822] Generating rte_pmd_ice.pmd.c with a custom command.
[371/822] Compiling C object 'drivers/a715181@@tmp_rte_pmd_ipn3ke at sta/net_ipn3ke_ipn3ke_tm.c.o'.
[372/822] Compiling C object 'drivers/a715181@@rte_pmd_ice at sta/meson-generated_.._rte_pmd_ice.pmd.c.o'.
[373/822] Linking static target drivers/librte_pmd_ice.a.
[374/822] Compiling C object 'drivers/a715181@@rte_pmd_ice at sha/meson-generated_.._rte_pmd_ice.pmd.c.o'.
[375/822] Linking static target drivers/libtmp_rte_pmd_ipn3ke.a.
[376/822] Linking target drivers/librte_pmd_ice.so.1.1.
[377/822] Generating rte_pmd_ipn3ke.pmd.c with a custom command.
[378/822] Compiling C object 'drivers/a715181@@rte_pmd_ipn3ke at sta/meson-generated_.._rte_pmd_ipn3ke.pmd.c.o'.
[379/822] Linking static target drivers/librte_pmd_ipn3ke.a.
[380/822] Compiling C object 'drivers/a715181@@rte_pmd_ipn3ke at sha/meson-generated_.._rte_pmd_ipn3ke.pmd.c.o'.
[381/822] Linking target drivers/librte_pmd_ipn3ke.so.1.1.
[382/822] Compiling C object 'drivers/a715181@@tmp_rte_pmd_ixgbe at sta/net_ixgbe_ixgbe_pf.c.o'.
[383/822] Compiling C object 'drivers/a715181@@tmp_rte_pmd_ixgbe at sta/net_ixgbe_ixgbe_ipsec.c.o'.
[384/822] Compiling C object 'drivers/a715181@@tmp_rte_pmd_ixgbe at sta/net_ixgbe_ixgbe_tm.c.o'.
[385/822] Compiling C object 'drivers/a715181@@tmp_rte_pmd_ixgbe at sta/net_ixgbe_ixgbe_vf_representor.c.o'.
[386/822] Compiling C object 'drivers/a715181@@tmp_rte_pmd_ixgbe at sta/net_ixgbe_ixgbe_flow.c.o'.
[387/822] Compiling C object 'drivers/a715181@@tmp_rte_pmd_kni at sta/net_kni_rte_eth_kni.c.o'.
[388/822] Linking static target drivers/libtmp_rte_pmd_kni.a.
[389/822] Compiling C object 'drivers/a715181@@tmp_rte_pmd_ixgbe at sta/net_ixgbe_rte_pmd_ixgbe.c.o'.
[390/822] Generating rte_pmd_kni.pmd.c with a custom command.
[391/822] Compiling C object 'drivers/a715181@@tmp_rte_pmd_liquidio at sta/net_liquidio_base_lio_23xx_vf.c.o'.
[392/822] Compiling C object 'drivers/a715181@@tmp_rte_pmd_ixgbe at sta/net_ixgbe_ixgbe_rxtx_vec_sse.c.o'.
[393/822] Compiling C object 'drivers/a715181@@rte_pmd_kni at sha/meson-generated_.._rte_pmd_kni.pmd.c.o'.
[394/822] Compiling C object 'drivers/a715181@@rte_pmd_kni at sta/meson-generated_.._rte_pmd_kni.pmd.c.o'.
[395/822] Linking static target drivers/librte_pmd_kni.a.
[396/822] Compiling C object 'drivers/a715181@@tmp_rte_pmd_liquidio at sta/net_liquidio_base_lio_mbox.c.o'.
[397/822] Linking target drivers/librte_pmd_kni.so.1.1.
[398/822] Compiling C object 'drivers/a715181@@tmp_rte_pmd_liquidio at sta/net_liquidio_lio_ethdev.c.o'.
[399/822] Compiling C object 'drivers/a715181@@tmp_rte_pmd_ixgbe at sta/net_ixgbe_ixgbe_rxtx.c.o'.
[400/822] Compiling C object 'drivers/a715181@@tmp_rte_pmd_memif at sta/net_memif_memif_socket.c.o'.
[401/822] Linking static target drivers/libtmp_rte_pmd_memif.a.
[402/822] Generating rte_pmd_memif.pmd.c with a custom command.
[403/822] Compiling C object 'drivers/a715181@@tmp_rte_pmd_netvsc at sta/net_netvsc_hn_ethdev.c.o'.
[404/822] Compiling C object 'examples/c590b3c@@dpdk-vmdq_dcb at exe/vmdq_dcb_main.c.o'.
[405/822] Compiling C object 'drivers/a715181@@rte_pmd_memif at sta/meson-generated_.._rte_pmd_memif.pmd.c.o'.
[406/822] Linking static target drivers/librte_pmd_memif.a.
[407/822] Compiling C object 'examples/c590b3c@@dpdk-vmdq at exe/vmdq_main.c.o'.
[408/822] Linking target examples/dpdk-vmdq.
[409/822] Compiling C object 'drivers/a715181@@rte_pmd_memif at sha/meson-generated_.._rte_pmd_memif.pmd.c.o'.
[410/822] Linking target examples/dpdk-vmdq_dcb.
[411/822] Compiling C object 'drivers/a715181@@tmp_rte_pmd_netvsc at sta/net_netvsc_hn_rndis.c.o'.
[412/822] Compiling C object 'drivers/a715181@@tmp_rte_pmd_ixgbe at sta/net_ixgbe_ixgbe_ethdev.c.o'.
[413/822] Linking static target drivers/libtmp_rte_pmd_ixgbe.a.
[414/822] Linking target drivers/librte_pmd_memif.so.1.1.
[415/822] Compiling C object 'drivers/a715181@@tmp_rte_pmd_liquidio at sta/net_liquidio_lio_rxtx.c.o'.
[416/822] Linking static target drivers/libtmp_rte_pmd_liquidio.a.
[417/822] Generating rte_pmd_ixgbe.pmd.c with a custom command.
[418/822] Generating rte_pmd_liquidio.pmd.c with a custom command.
[419/822] Compiling C object 'drivers/a715181@@tmp_rte_pmd_netvsc at sta/net_netvsc_hn_vf.c.o'.
[420/822] Compiling C object 'drivers/a715181@@rte_pmd_ixgbe at sta/meson-generated_.._rte_pmd_ixgbe.pmd.c.o'.
[421/822] Compiling C object 'drivers/a715181@@rte_pmd_liquidio at sta/meson-generated_.._rte_pmd_liquidio.pmd.c.o'.
[422/822] Linking static target drivers/librte_pmd_liquidio.a.
[423/822] Linking static target drivers/librte_pmd_ixgbe.a.
[424/822] Compiling C object 'drivers/a715181@@rte_pmd_ixgbe at sha/meson-generated_.._rte_pmd_ixgbe.pmd.c.o'.
[425/822] Compiling C object 'drivers/a715181@@tmp_rte_pmd_nfp at sta/net_nfp_nfpcore_nfp_cpp_pcie_ops.c.o'.
[426/822] Compiling C object 'drivers/a715181@@tmp_rte_pmd_nfp at sta/net_nfp_nfpcore_nfp_nsp.c.o'.
[427/822] Compiling C object 'drivers/a715181@@rte_pmd_liquidio at sha/meson-generated_.._rte_pmd_liquidio.pmd.c.o'.
[428/822] Linking target drivers/librte_pmd_ixgbe.so.2.1.
[429/822] Linking target drivers/librte_pmd_liquidio.so.1.1.
[430/822] Compiling C object 'drivers/a715181@@tmp_rte_pmd_netvsc at sta/net_netvsc_hn_nvs.c.o'.
[431/822] Compiling C object 'drivers/a715181@@tmp_rte_pmd_netvsc at sta/net_netvsc_hn_rxtx.c.o'.
[432/822] Linking static target drivers/libtmp_rte_pmd_netvsc.a.
[433/822] Generating rte_pmd_netvsc.pmd.c with a custom command.
[434/822] Compiling C object 'drivers/a715181@@tmp_rte_pmd_nfp at sta/net_nfp_nfpcore_nfp_mip.c.o'.
[435/822] Compiling C object 'drivers/a715181@@rte_pmd_netvsc at sha/meson-generated_.._rte_pmd_netvsc.pmd.c.o'.
[436/822] Compiling C object 'drivers/a715181@@rte_pmd_netvsc at sta/meson-generated_.._rte_pmd_netvsc.pmd.c.o'.
[437/822] Linking static target drivers/librte_pmd_netvsc.a.
[438/822] Compiling C object 'drivers/a715181@@tmp_rte_pmd_nfp at sta/net_nfp_nfpcore_nfp_cppcore.c.o'.
[439/822] Linking target drivers/librte_pmd_netvsc.so.2.1.
[440/822] Compiling C object 'drivers/a715181@@tmp_rte_pmd_nfp at sta/net_nfp_nfpcore_nfp_nffw.c.o'.
[441/822] Compiling C object 'drivers/a715181@@tmp_rte_pmd_nfp at sta/net_nfp_nfpcore_nfp_resource.c.o'.
[442/822] Generating symbol file 'drivers/a715181@@rte_pmd_ixgbe at sha/librte_pmd_ixgbe.so.2.1.symbols'.
[443/822] Compiling C object 'drivers/a715181@@tmp_rte_pmd_nfp at sta/net_nfp_nfpcore_nfp_nsp_cmds.c.o'.
[444/822] Compiling C object 'drivers/a715181@@tmp_rte_pmd_nfp at sta/net_nfp_nfpcore_nfp_rtsym.c.o'.
[445/822] Compiling C object 'drivers/a715181@@tmp_rte_pmd_nfp at sta/net_nfp_nfpcore_nfp_mutex.c.o'.
[446/822] Compiling C object 'drivers/a715181@@tmp_rte_pmd_nfp at sta/net_nfp_nfpcore_nfp_hwinfo.c.o'.
[447/822] Compiling C object 'drivers/a715181@@tmp_rte_pmd_nfp at sta/net_nfp_nfpcore_nfp_nsp_eth.c.o'.
[448/822] Compiling C object 'drivers/a715181@@tmp_rte_pmd_octeontx at sta/net_octeontx_octeontx_rxtx.c.o'.
[449/822] Compiling C object 'drivers/a715181@@tmp_rte_pmd_nfp at sta/net_nfp_nfp_net.c.o'.
[450/822] Linking static target drivers/libtmp_rte_pmd_nfp.a.
[451/822] Compiling C object 'drivers/a715181@@tmp_rte_pmd_null at sta/net_null_rte_eth_null.c.o'.
[452/822] Linking static target drivers/libtmp_rte_pmd_null.a.
[453/822] Generating rte_pmd_null.pmd.c with a custom command.
[454/822] Compiling C object 'drivers/a715181@@tmp_rte_pmd_octeontx at sta/net_octeontx_octeontx_ethdev.c.o'.
[455/822] Compiling C object 'drivers/a715181@@tmp_rte_pmd_octeontx2 at sta/net_octeontx2_otx2_ptp.c.o'.
[456/822] Compiling C object 'drivers/a715181@@rte_pmd_null at sta/meson-generated_.._rte_pmd_null.pmd.c.o'.
[457/822] Linking static target drivers/libtmp_rte_pmd_octeontx.a.
[458/822] Linking static target drivers/librte_pmd_null.a.
[459/822] Generating rte_pmd_nfp.pmd.c with a custom command.
[460/822] Generating rte_pmd_octeontx.pmd.c with a custom command.
[461/822] Compiling C object 'drivers/a715181@@tmp_rte_pmd_octeontx2 at sta/net_octeontx2_otx2_link.c.o'.
[462/822] Compiling C object 'drivers/a715181@@rte_pmd_null at sha/meson-generated_.._rte_pmd_null.pmd.c.o'.
[463/822] Compiling C object 'drivers/a715181@@rte_pmd_nfp at sta/meson-generated_.._rte_pmd_nfp.pmd.c.o'.
[464/822] Linking static target drivers/librte_pmd_nfp.a.
[465/822] Linking target drivers/librte_pmd_null.so.2.1.
[466/822] Compiling C object 'drivers/a715181@@rte_pmd_nfp at sha/meson-generated_.._rte_pmd_nfp.pmd.c.o'.
[467/822] Compiling C object 'drivers/a715181@@rte_pmd_octeontx at sha/meson-generated_.._rte_pmd_octeontx.pmd.c.o'.
[468/822] Compiling C object 'drivers/a715181@@rte_pmd_octeontx at sta/meson-generated_.._rte_pmd_octeontx.pmd.c.o'.
[469/822] Linking target drivers/librte_pmd_nfp.so.1.1.
[470/822] Linking static target drivers/librte_pmd_octeontx.a.
[471/822] Compiling C object 'drivers/a715181@@tmp_rte_pmd_octeontx2 at sta/net_octeontx2_otx2_mac.c.o'.
[472/822] Linking target drivers/librte_pmd_octeontx.so.1.1.
[473/822] Compiling C object 'drivers/a715181@@tmp_rte_pmd_octeontx2 at sta/net_octeontx2_otx2_lookup.c.o'.
[474/822] Compiling C object 'drivers/a715181@@tmp_rte_pmd_octeontx2 at sta/net_octeontx2_otx2_flow.c.o'.
[475/822] Generating symbol file 'drivers/a715181@@rte_pmd_octeontx at sha/librte_pmd_octeontx.so.1.1.symbols'.
[476/822] Compiling C object 'drivers/a715181@@tmp_rte_pmd_octeontx2 at sta/net_octeontx2_otx2_vlan.c.o'.
[477/822] Compiling C object 'drivers/a715181@@tmp_rte_pmd_octeontx2 at sta/net_octeontx2_otx2_tm.c.o'.
[478/822] Compiling C object 'drivers/a715181@@tmp_rte_pmd_octeontx2 at sta/net_octeontx2_otx2_flow_ctrl.c.o'.
[479/822] Compiling C object 'drivers/a715181@@tmp_rte_pmd_octeontx2 at sta/net_octeontx2_otx2_flow_parse.c.o'.
[480/822] Compiling C object 'drivers/a715181@@tmp_rte_pmd_octeontx2 at sta/net_octeontx2_otx2_ethdev_irq.c.o'.
[481/822] Compiling C object 'drivers/a715181@@tmp_rte_pmd_octeontx2 at sta/net_octeontx2_otx2_stats.c.o'.
[482/822] Compiling C object 'drivers/a715181@@tmp_rte_pmd_octeontx2 at sta/net_octeontx2_otx2_ethdev.c.o'.
[483/822] Compiling C object 'drivers/a715181@@tmp_rte_pmd_ring at sta/net_ring_rte_eth_ring.c.o'.
[484/822] Compiling C object 'drivers/a715181@@tmp_rte_pmd_octeontx2 at sta/net_octeontx2_otx2_ethdev_ops.c.o'.
[485/822] Linking static target drivers/libtmp_rte_pmd_ring.a.
[486/822] Compiling C object 'drivers/a715181@@tmp_rte_pmd_octeontx2 at sta/net_octeontx2_otx2_ethdev_debug.c.o'.
[487/822] Generating rte_pmd_ring.pmd.c with a custom command.
[488/822] Compiling C object 'drivers/a715181@@rte_pmd_ring at sta/meson-generated_.._rte_pmd_ring.pmd.c.o'.
[489/822] Linking static target drivers/librte_pmd_ring.a.
[490/822] Compiling C object 'drivers/a715181@@rte_pmd_ring at sha/meson-generated_.._rte_pmd_ring.pmd.c.o'.
[491/822] Compiling C object 'drivers/a715181@@tmp_rte_pmd_octeontx2 at sta/net_octeontx2_otx2_flow_utils.c.o'.
[492/822] Linking static target drivers/libtmp_rte_pmd_octeontx2.a.
[493/822] Linking target drivers/librte_pmd_ring.so.2.1.
[494/822] Compiling C object 'drivers/a715181@@tmp_rte_pmd_sfc at sta/net_sfc_sfc_mcdi.c.o'.
[495/822] Compiling C object 'drivers/a715181@@tmp_rte_pmd_sfc at sta/net_sfc_sfc_kvargs.c.o'.
[496/822] Compiling C object 'drivers/a715181@@tmp_rte_pmd_sfc at sta/net_sfc_sfc_ethdev.c.o'.
[497/822] Compiling C object 'drivers/a715181@@tmp_rte_pmd_pcap at sta/net_pcap_rte_eth_pcap.c.o'.
[498/822] Linking static target drivers/libtmp_rte_pmd_pcap.a.
[499/822] Generating rte_pmd_pcap.pmd.c with a custom command.
[500/822] Generating rte_pmd_octeontx2.pmd.c with a custom command.
[501/822] Compiling C object 'drivers/a715181@@rte_pmd_pcap at sta/meson-generated_.._rte_pmd_pcap.pmd.c.o'.
[502/822] Compiling C object 'drivers/a715181@@tmp_rte_pmd_sfc at sta/net_sfc_sfc.c.o'.
[503/822] Linking static target drivers/librte_pmd_pcap.a.
[504/822] Compiling C object 'drivers/a715181@@rte_pmd_octeontx2 at sta/meson-generated_.._rte_pmd_octeontx2.pmd.c.o'.
[505/822] Compiling C object 'drivers/a715181@@rte_pmd_pcap at sha/meson-generated_.._rte_pmd_pcap.pmd.c.o'.
[506/822] Compiling C object 'drivers/a715181@@rte_pmd_octeontx2 at sha/meson-generated_.._rte_pmd_octeontx2.pmd.c.o'.
[507/822] Linking static target drivers/librte_pmd_octeontx2.a.
[508/822] Linking target drivers/librte_pmd_pcap.so.1.1.
[509/822] Generating symbol file 'drivers/a715181@@rte_pmd_ring at sha/librte_pmd_ring.so.2.1.symbols'.
[510/822] Linking target drivers/librte_pmd_octeontx2.so.1.1.
[511/822] Compiling C object 'drivers/a715181@@tmp_rte_pmd_sfc at sta/net_sfc_sfc_intr.c.o'.
[512/822] Compiling C object 'drivers/a715181@@tmp_rte_pmd_sfc at sta/net_sfc_sfc_port.c.o'.
[513/822] Compiling C object 'drivers/a715181@@tmp_rte_pmd_sfc at sta/net_sfc_sfc_filter.c.o'.
[514/822] Compiling C object 'drivers/a715181@@tmp_rte_pmd_sfc at sta/net_sfc_sfc_ev.c.o'.
[515/822] Compiling C object 'drivers/a715181@@tmp_rte_pmd_sfc at sta/net_sfc_sfc_tso.c.o'.
[516/822] Generating symbol file 'drivers/a715181@@rte_pmd_octeontx2 at sha/librte_pmd_octeontx2.so.1.1.symbols'.
[517/822] Compiling C object 'drivers/a715181@@tmp_rte_pmd_sfc at sta/net_sfc_sfc_ef10_rx.c.o'.
[518/822] Compiling C object 'drivers/a715181@@tmp_rte_pmd_sfc at sta/net_sfc_sfc_rx.c.o'.
[519/822] Compiling C object 'drivers/a715181@@tmp_rte_pmd_softnic at sta/net_softnic_rte_eth_softnic_pipeline.c.o'.
[520/822] Compiling C object 'drivers/a715181@@tmp_rte_pmd_sfc at sta/net_sfc_sfc_tx.c.o'.
[521/822] Compiling C object 'drivers/a715181@@tmp_rte_pmd_sfc at sta/net_sfc_sfc_ef10_tx.c.o'.
[522/822] Compiling C object 'drivers/a715181@@tmp_rte_pmd_softnic at sta/net_softnic_rte_eth_softnic_tap.c.o'.
[523/822] Compiling C object 'drivers/a715181@@tmp_rte_pmd_sfc at sta/net_sfc_sfc_flow.c.o'.
[524/822] Compiling C object 'drivers/a715181@@tmp_rte_pmd_sfc at sta/net_sfc_sfc_ef10_essb_rx.c.o'.
[525/822] Linking static target drivers/libtmp_rte_pmd_sfc.a.
[526/822] Compiling C object 'drivers/a715181@@tmp_rte_pmd_softnic at sta/net_softnic_rte_eth_softnic_swq.c.o'.
[527/822] Compiling C object 'drivers/a715181@@tmp_rte_pmd_softnic at sta/net_softnic_rte_eth_softnic_action.c.o'.
[528/822] Compiling C object 'drivers/a715181@@tmp_rte_pmd_softnic at sta/net_softnic_rte_eth_softnic_cryptodev.c.o'.
[529/822] Compiling C object 'drivers/a715181@@tmp_rte_pmd_softnic at sta/net_softnic_rte_eth_softnic_mempool.c.o'.
[530/822] Generating rte_pmd_sfc.pmd.c with a custom command.
[531/822] Compiling C object 'drivers/a715181@@tmp_rte_pmd_softnic at sta/net_softnic_rte_eth_softnic_link.c.o'.
[532/822] Compiling C object 'drivers/a715181@@rte_pmd_sfc at sha/meson-generated_.._rte_pmd_sfc.pmd.c.o'.
[533/822] Compiling C object 'drivers/a715181@@rte_pmd_sfc at sta/meson-generated_.._rte_pmd_sfc.pmd.c.o'.
[534/822] Linking static target drivers/librte_pmd_sfc.a.
[535/822] Linking target drivers/librte_pmd_sfc.so.1.1.
[536/822] Compiling C object 'drivers/a715181@@tmp_rte_pmd_softnic at sta/net_softnic_rte_eth_softnic_meter.c.o'.
[537/822] Compiling C object 'drivers/a715181@@tmp_rte_pmd_softnic at sta/net_softnic_rte_eth_softnic_tm.c.o'.
[538/822] Compiling C object 'drivers/a715181@@tmp_rte_pmd_tap at sta/net_tap_tap_intr.c.o'.
[539/822] Compiling C object 'drivers/a715181@@tmp_rte_pmd_tap at sta/net_tap_tap_bpf_api.c.o'.
[540/822] Compiling C object 'drivers/a715181@@tmp_rte_pmd_softnic at sta/net_softnic_rte_eth_softnic_thread.c.o'.
[541/822] Compiling C object 'drivers/a715181@@tmp_rte_pmd_softnic at sta/net_softnic_rte_eth_softnic.c.o'.
[542/822] Compiling C object 'drivers/a715181@@tmp_rte_pmd_tap at sta/net_tap_tap_flow.c.o'.
[543/822] Compiling C object 'drivers/net/thunderx/base/80ab7c6@@nicvf_base at sta/nicvf_mbox.c.o'.
[544/822] Compiling C object 'drivers/a715181@@tmp_rte_pmd_softnic at sta/net_softnic_rte_eth_softnic_flow.c.o'.
[545/822] Compiling C object 'drivers/net/thunderx/base/80ab7c6@@nicvf_base at sta/nicvf_hw.c.o'.
[546/822] Compiling C object 'drivers/net/thunderx/base/80ab7c6@@nicvf_base at sta/nicvf_bsvf.c.o'.
[547/822] Linking static target drivers/net/thunderx/base/libnicvf_base.a.
[548/822] Compiling C object 'drivers/a715181@@tmp_rte_pmd_thunderx at sta/net_thunderx_nicvf_rxtx.c.o'.
[549/822] Compiling C object 'drivers/a715181@@tmp_rte_pmd_virtio at sta/net_virtio_virtio_user_vhost_kernel_tap.c.o'.
[550/822] Compiling C object 'drivers/a715181@@tmp_rte_pmd_softnic at sta/net_softnic_rte_eth_softnic_cli.c.o'.
[551/822] Compiling C object 'drivers/a715181@@tmp_rte_pmd_vdev_netvsc at sta/net_vdev_netvsc_vdev_netvsc.c.o'.
[552/822] Linking static target drivers/libtmp_rte_pmd_vdev_netvsc.a.
[553/822] Linking static target drivers/libtmp_rte_pmd_softnic.a.
[554/822] Generating rte_pmd_vdev_netvsc.pmd.c with a custom command.
[555/822] Compiling C object 'drivers/a715181@@tmp_rte_pmd_vhost at sta/net_vhost_rte_eth_vhost.c.o'.
[556/822] Compiling C object 'drivers/a715181@@rte_pmd_vdev_netvsc at sha/meson-generated_.._rte_pmd_vdev_netvsc.pmd.c.o'.
[557/822] Compiling C object 'drivers/a715181@@rte_pmd_vdev_netvsc at sta/meson-generated_.._rte_pmd_vdev_netvsc.pmd.c.o'.
[558/822] Linking static target drivers/librte_pmd_vdev_netvsc.a.
[559/822] Linking static target drivers/libtmp_rte_pmd_vhost.a.
[560/822] Linking target drivers/librte_pmd_vdev_netvsc.so.1.1.
[561/822] Generating rte_pmd_vhost.pmd.c with a custom command.
[562/822] Generating rte_pmd_softnic.pmd.c with a custom command.
[563/822] Compiling C object 'drivers/a715181@@tmp_rte_pmd_virtio at sta/net_virtio_virtio_pci.c.o'.
[564/822] Compiling C object 'drivers/a715181@@tmp_rte_pmd_virtio at sta/net_virtio_virtio_ethdev.c.o'.
[565/822] Compiling C object 'drivers/a715181@@rte_pmd_vhost at sha/meson-generated_.._rte_pmd_vhost.pmd.c.o'.
[566/822] Compiling C object 'drivers/a715181@@tmp_rte_pmd_thunderx at sta/net_thunderx_nicvf_ethdev.c.o'.
[567/822] Compiling C object 'drivers/a715181@@rte_pmd_softnic at sha/meson-generated_.._rte_pmd_softnic.pmd.c.o'.
[568/822] Compiling C object 'drivers/a715181@@rte_pmd_softnic at sta/meson-generated_.._rte_pmd_softnic.pmd.c.o'.
[569/822] Linking static target drivers/libtmp_rte_pmd_thunderx.a.
[570/822] Linking static target drivers/librte_pmd_softnic.a.
[571/822] Compiling C object 'drivers/a715181@@rte_pmd_vhost at sta/meson-generated_.._rte_pmd_vhost.pmd.c.o'.
[572/822] Linking target drivers/librte_pmd_vhost.so.2.1.
[573/822] Linking target drivers/librte_pmd_softnic.so.1.1.
[574/822] Linking static target drivers/librte_pmd_vhost.a.
[575/822] Generating rte_pmd_thunderx.pmd.c with a custom command.
[576/822] Compiling C object 'drivers/a715181@@tmp_rte_pmd_tap at sta/net_tap_rte_eth_tap.c.o'.
[577/822] Linking static target drivers/libtmp_rte_pmd_tap.a.
[578/822] Compiling C object 'drivers/a715181@@rte_pmd_thunderx at sta/meson-generated_.._rte_pmd_thunderx.pmd.c.o'.
[579/822] Generating rte_pmd_tap.pmd.c with a custom command.
[580/822] Compiling C object 'drivers/a715181@@rte_pmd_thunderx at sha/meson-generated_.._rte_pmd_thunderx.pmd.c.o'.
[581/822] Compiling C object 'drivers/a715181@@rte_pmd_tap at sta/meson-generated_.._rte_pmd_tap.pmd.c.o'.
[582/822] Linking static target drivers/librte_pmd_tap.a.
[583/822] Compiling C object 'drivers/a715181@@tmp_rte_pmd_virtio at sta/net_virtio_virtio_rxtx_simple.c.o'.
[584/822] Compiling C object 'drivers/a715181@@rte_pmd_tap at sha/meson-generated_.._rte_pmd_tap.pmd.c.o'.
[585/822] Linking static target drivers/librte_pmd_thunderx.a.
[586/822] Generating symbol file 'drivers/a715181@@rte_pmd_softnic at sha/librte_pmd_softnic.so.1.1.symbols'.
[587/822] Linking target drivers/librte_pmd_tap.so.1.1.
[588/822] Linking target drivers/librte_pmd_thunderx.so.1.1.
[589/822] Compiling C object 'drivers/a715181@@tmp_rte_pmd_virtio at sta/net_virtio_virtio_rxtx_simple_sse.c.o'.
[590/822] Compiling C object 'drivers/a715181@@tmp_rte_pmd_virtio at sta/net_virtio_virtio_user_ethdev.c.o'.
[591/822] Compiling C object 'drivers/a715181@@tmp_rte_pmd_virtio at sta/net_virtio_virtio_user_vhost_kernel.c.o'.
[592/822] Compiling C object 'drivers/a715181@@tmp_rte_pmd_virtio at sta/net_virtio_virtqueue.c.o'.
[593/822] Compiling C object 'drivers/a715181@@tmp_rte_pmd_virtio at sta/net_virtio_virtio_user_virtio_user_dev.c.o'.
[594/822] Compiling C object 'drivers/a715181@@tmp_rte_pmd_virtio at sta/net_virtio_virtio_rxtx.c.o'.
[595/822] Compiling C object 'drivers/a715181@@tmp_rte_pmd_virtio at sta/net_virtio_virtio_user_vhost_user.c.o'.
[596/822] Linking static target drivers/libtmp_rte_pmd_virtio.a.
[597/822] Compiling C object 'drivers/a715181@@tmp_rte_pmd_dpaa_event at sta/event_dpaa_dpaa_eventdev.c.o'.
[598/822] Linking static target drivers/libtmp_rte_pmd_dpaa_event.a.
[599/822] Generating rte_pmd_virtio.pmd.c with a custom command.
[600/822] Compiling C object 'drivers/a715181@@tmp_rte_pmd_vmxnet3 at sta/net_vmxnet3_vmxnet3_ethdev.c.o'.
[601/822] Generating rte_pmd_dpaa_event.pmd.c with a custom command.
[602/822] Compiling C object 'drivers/a715181@@rte_pmd_virtio at sha/meson-generated_.._rte_pmd_virtio.pmd.c.o'.
[603/822] Compiling C object 'drivers/a715181@@rte_pmd_virtio at sta/meson-generated_.._rte_pmd_virtio.pmd.c.o'.
[604/822] Compiling C object 'drivers/a715181@@tmp_rte_pmd_dpaa2_event at sta/event_dpaa2_dpaa2_eventdev.c.o'.
[605/822] Compiling C object 'drivers/a715181@@rte_pmd_dpaa_event at sta/meson-generated_.._rte_pmd_dpaa_event.pmd.c.o'.
[606/822] Linking static target drivers/librte_pmd_dpaa_event.a.
[607/822] Linking static target drivers/librte_pmd_virtio.a.
[608/822] Linking target drivers/librte_pmd_virtio.so.1.1.
[609/822] Compiling C object 'drivers/a715181@@tmp_rte_pmd_vmxnet3 at sta/net_vmxnet3_vmxnet3_rxtx.c.o'.
[610/822] Compiling C object 'drivers/a715181@@rte_pmd_dpaa_event at sha/meson-generated_.._rte_pmd_dpaa_event.pmd.c.o'.
[611/822] Linking static target drivers/libtmp_rte_pmd_vmxnet3.a.
[612/822] Generating rte_pmd_vmxnet3.pmd.c with a custom command.
[613/822] Compiling C object 'drivers/a715181@@tmp_rte_pmd_dpaa2_event at sta/event_dpaa2_dpaa2_hw_dpcon.c.o'.
[614/822] Linking target drivers/librte_pmd_dpaa_event.so.1.1.
[615/822] Compiling C object 'drivers/a715181@@rte_pmd_vmxnet3 at sha/meson-generated_.._rte_pmd_vmxnet3.pmd.c.o'.
[616/822] Compiling C object 'drivers/a715181@@rte_pmd_vmxnet3 at sta/meson-generated_.._rte_pmd_vmxnet3.pmd.c.o'.
[617/822] Linking static target drivers/libtmp_rte_pmd_dpaa2_event.a.
[618/822] Linking static target drivers/librte_pmd_vmxnet3.a.
[619/822] Compiling C object 'drivers/a715181@@tmp_rte_pmd_octeontx2_event at sta/event_octeontx2_otx2_evdev_irq.c.o'.
[620/822] Generating rte_pmd_dpaa2_event.pmd.c with a custom command.
[621/822] Linking target drivers/librte_pmd_vmxnet3.so.1.1.
[622/822] Compiling C object 'drivers/a715181@@rte_pmd_dpaa2_event at sta/meson-generated_.._rte_pmd_dpaa2_event.pmd.c.o'.
[623/822] Compiling C object 'drivers/a715181@@rte_pmd_dpaa2_event at sha/meson-generated_.._rte_pmd_dpaa2_event.pmd.c.o'.
[624/822] Linking static target drivers/librte_pmd_dpaa2_event.a.
[625/822] Linking target drivers/librte_pmd_dpaa2_event.so.2.1.
[626/822] Compiling C object 'drivers/a715181@@tmp_rte_pmd_octeontx2_event at sta/event_octeontx2_otx2_evdev_adptr.c.o'.
[627/822] Compiling C object 'drivers/a715181@@tmp_rte_pmd_octeontx2_event at sta/event_octeontx2_otx2_evdev.c.o'.
[628/822] Compiling C object 'drivers/a715181@@tmp_rte_pmd_octeontx2_event at sta/event_octeontx2_otx2_tim_evdev.c.o'.
[629/822] Compiling C object 'drivers/a715181@@tmp_rte_pmd_octeontx_event at sta/event_octeontx_ssovf_evdev.c.o'.
[630/822] Compiling C object 'drivers/a715181@@tmp_rte_pmd_opdl_event at sta/event_opdl_opdl_test.c.o'.
[631/822] Linking static target drivers/libtmp_rte_pmd_opdl_event.a.
[632/822] Generating rte_pmd_opdl_event.pmd.c with a custom command.
[633/822] Compiling C object 'drivers/a715181@@rte_pmd_opdl_event at sha/meson-generated_.._rte_pmd_opdl_event.pmd.c.o'.
[634/822] Compiling C object 'drivers/a715181@@rte_pmd_opdl_event at sta/meson-generated_.._rte_pmd_opdl_event.pmd.c.o'.
[635/822] Linking static target drivers/librte_pmd_opdl_event.a.
[636/822] Linking target drivers/librte_pmd_opdl_event.so.1.1.
[637/822] Compiling C object 'drivers/a715181@@tmp_rte_pmd_sw_event at sta/event_sw_sw_evdev_selftest.c.o'.
[638/822] Compiling C object 'drivers/a715181@@tmp_rte_pmd_octeontx_event at sta/event_octeontx_ssovf_worker.c.o'.
[639/822] Linking static target drivers/libtmp_rte_pmd_sw_event.a.
[640/822] Generating rte_pmd_sw_event.pmd.c with a custom command.
[641/822] Compiling C object 'drivers/a715181@@rte_pmd_sw_event at sta/meson-generated_.._rte_pmd_sw_event.pmd.c.o'.
[642/822] Linking static target drivers/librte_pmd_sw_event.a.
[643/822] Compiling C object 'drivers/a715181@@tmp_rte_pmd_octeontx2_event at sta/event_octeontx2_otx2_evdev_selftest.c.o'.
[644/822] Compiling C object 'drivers/a715181@@rte_pmd_sw_event at sha/meson-generated_.._rte_pmd_sw_event.pmd.c.o'.
[645/822] Compiling C object 'drivers/a715181@@tmp_rte_pmd_dpaa_sec at sta/crypto_dpaa_sec_dpaa_sec.c.o'.
[646/822] Linking static target drivers/libtmp_rte_pmd_dpaa_sec.a.
[647/822] Linking target drivers/librte_pmd_sw_event.so.1.1.
[648/822] Generating rte_pmd_dpaa_sec.pmd.c with a custom command.
[649/822] Compiling C object 'drivers/a715181@@rte_pmd_dpaa_sec at sta/meson-generated_.._rte_pmd_dpaa_sec.pmd.c.o'.
[650/822] Compiling C object 'drivers/a715181@@tmp_rte_pmd_octeontx_event at sta/event_octeontx_ssovf_probe.c.o'.
[651/822] Compiling C object 'drivers/a715181@@tmp_rte_pmd_octeontx_event at sta/event_octeontx_ssovf_evdev_selftest.c.o'.
[652/822] Linking static target drivers/librte_pmd_dpaa_sec.a.
[653/822] Compiling C object 'drivers/a715181@@tmp_rte_pmd_octeontx_event at sta/event_octeontx_timvf_probe.c.o'.
[654/822] Compiling C object 'drivers/a715181@@rte_pmd_dpaa_sec at sha/meson-generated_.._rte_pmd_dpaa_sec.pmd.c.o'.
[655/822] Linking static target drivers/libtmp_rte_pmd_octeontx_event.a.
[656/822] Linking target drivers/librte_pmd_dpaa_sec.so.1.1.
[657/822] Generating rte_pmd_octeontx_event.pmd.c with a custom command.
[658/822] Compiling C object 'app/a172ced@@dpdk-pdump at exe/pdump_main.c.o'.
[659/822] Compiling C object 'drivers/a715181@@rte_pmd_octeontx_event at sta/meson-generated_.._rte_pmd_octeontx_event.pmd.c.o'.
[660/822] Compiling C object 'drivers/a715181@@rte_pmd_octeontx_event at sha/meson-generated_.._rte_pmd_octeontx_event.pmd.c.o'.
[661/822] Compiling C object 'app/a172ced@@dpdk-test-eventdev at exe/test-eventdev_evt_main.c.o'.
[662/822] Linking static target drivers/librte_pmd_octeontx_event.a.
[663/822] Linking target app/dpdk-pdump.
[664/822] Linking target drivers/librte_pmd_octeontx_event.so.1.1.
[665/822] Compiling C object 'app/a172ced@@dpdk-test-eventdev at exe/test-eventdev_test_order_common.c.o'.
[666/822] Compiling C object 'app/a172ced@@dpdk-proc-info at exe/proc-info_main.c.o'.
[667/822] Compiling C object 'app/a172ced@@dpdk-test-eventdev at exe/test-eventdev_evt_options.c.o'.
[668/822] Linking target app/dpdk-proc-info.
[669/822] Compiling C object 'app/a172ced@@dpdk-test-eventdev at exe/test-eventdev_test_perf_common.c.o'.
[670/822] Compiling C object 'app/a172ced@@dpdk-test-eventdev at exe/test-eventdev_test_order_queue.c.o'.
[671/822] Compiling C object 'app/a172ced@@dpdk-test-eventdev at exe/test-eventdev_test_perf_queue.c.o'.
[672/822] Compiling C object 'app/a172ced@@dpdk-test-eventdev at exe/test-eventdev_test_order_atq.c.o'.
[673/822] Compiling C object 'app/a172ced@@dpdk-test-pipeline at exe/test-pipeline_pipeline_acl.c.o'.
[674/822] Compiling C object 'app/a172ced@@dpdk-test-pipeline at exe/test-pipeline_runtime.c.o'.
[675/822] Compiling C object 'app/a172ced@@dpdk-test-pipeline at exe/test-pipeline_init.c.o'.
[676/822] Compiling C object 'app/a172ced@@dpdk-test-pipeline at exe/test-pipeline_main.c.o'.
[677/822] Compiling C object 'app/a172ced@@dpdk-test-eventdev at exe/test-eventdev_test_perf_atq.c.o'.
[678/822] Linking target app/dpdk-test-eventdev.
[679/822] Compiling C object 'app/a172ced@@dpdk-test-pipeline at exe/test-pipeline_pipeline_lpm.c.o'.
[680/822] Compiling C object 'app/a172ced@@dpdk-test-pipeline at exe/test-pipeline_config.c.o'.
[681/822] Compiling C object 'app/a172ced@@dpdk-test-pipeline at exe/test-pipeline_pipeline_hash.c.o'.
[682/822] Compiling C object 'app/a172ced@@dpdk-test-pipeline at exe/test-pipeline_pipeline_lpm_ipv6.c.o'.
[683/822] Compiling C object 'app/a172ced@@dpdk-testpmd at exe/test-pmd_cmdline_mtr.c.o'.
[684/822] Linking target app/dpdk-test-pipeline.
[685/822] Compiling C object 'app/a172ced@@dpdk-testpmd at exe/test-pmd_cmdline_tm.c.o'.
[686/822] Compiling C object 'app/a172ced@@dpdk-testpmd at exe/test-pmd_flowgen.c.o'.
[687/822] Compiling C object 'app/a172ced@@dpdk-testpmd at exe/test-pmd_icmpecho.c.o'.
[688/822] Compiling C object 'app/a172ced@@dpdk-testpmd at exe/test-pmd_cmdline_flow.c.o'.
[689/822] Compiling C object 'app/a172ced@@dpdk-testpmd at exe/test-pmd_csumonly.c.o'.
[690/822] Compiling C object 'app/a172ced@@dpdk-testpmd at exe/test-pmd_config.c.o'.
[691/822] Compiling C object 'app/a172ced@@dpdk-testpmd at exe/test-pmd_iofwd.c.o'.
[692/822] Compiling C object 'app/a172ced@@dpdk-testpmd at exe/test-pmd_ieee1588fwd.c.o'.
[693/822] Compiling C object 'app/a172ced@@dpdk-testpmd at exe/test-pmd_macswap.c.o'.
[694/822] Compiling C object 'app/a172ced@@dpdk-testpmd at exe/test-pmd_cmdline.c.o'.
[695/822] Compiling C object 'app/a172ced@@dpdk-testpmd at exe/test-pmd_macfwd.c.o'.
[696/822] Compiling C object 'app/a172ced@@dpdk-testpmd at exe/test-pmd_parameters.c.o'.
[697/822] Compiling C object 'app/a172ced@@dpdk-testpmd at exe/test-pmd_noisy_vnf.c.o'.
[698/822] Compiling C object 'app/a172ced@@dpdk-testpmd at exe/test-pmd_rxonly.c.o'.
[699/822] Compiling C object 'app/a172ced@@dpdk-testpmd at exe/test-pmd_util.c.o'.
[700/822] Compiling C object 'app/a172ced@@dpdk-testpmd at exe/test-pmd_txonly.c.o'.
[701/822] Compiling C object 'app/a172ced@@dpdk-testpmd at exe/test-pmd_softnicfwd.c.o'.
[702/822] Compiling C object 'app/test/3062f5d@@dpdk-test at exe/sample_packet_forward.c.o'.
[703/822] Compiling C object 'app/a172ced@@dpdk-testpmd at exe/test-pmd_bpf_cmd.c.o'.
[704/822] Compiling C object 'app/test/3062f5d@@dpdk-test at exe/test_event_eth_rx_adapter.c.o'.
[705/822] Compiling C object 'app/test/3062f5d@@dpdk-test at exe/test_interrupts.c.o'.
[706/822] Compiling C object 'app/test/3062f5d@@dpdk-test at exe/test_event_eth_tx_adapter.c.o'.
[707/822] Compiling C object 'app/test/3062f5d@@dpdk-test at exe/test_kni.c.o'.
[708/822] Compiling C object 'app/a172ced@@dpdk-testpmd at exe/test-pmd_testpmd.c.o'.
[709/822] Compiling C object 'app/test/3062f5d@@dpdk-test at exe/test_flow_classify.c.o'.
[710/822] Linking target app/dpdk-testpmd.
[711/822] Compiling C object 'app/test/3062f5d@@dpdk-test at exe/test_event_timer_adapter.c.o'.
[712/822] Compiling C object 'app/test/3062f5d@@dpdk-test at exe/test_link_bonding_rssconf.c.o'.
[713/822] Compiling C object 'app/test/3062f5d@@dpdk-test at exe/test_pdump.c.o'.
[714/822] Compiling C object 'app/test/3062f5d@@dpdk-test at exe/test_pmd_perf.c.o'.
[715/822] Compiling C object 'drivers/a715181@@tmp_rte_pmd_octeontx2_event at sta/event_octeontx2_otx2_worker.c.o'.
[716/822] Compiling C object 'examples/c590b3c@@dpdk-eventdev_pipeline at exe/eventdev_pipeline_pipeline_worker_generic.c.o'.
[717/822] Compiling C object 'app/test/3062f5d@@dpdk-test at exe/test_pmd_ring.c.o'.
[718/822] Compiling C object 'app/test/3062f5d@@dpdk-test at exe/virtual_pmd.c.o'.
[719/822] Compiling C object 'app/test/3062f5d@@dpdk-test at exe/test_link_bonding_mode4.c.o'.
[720/822] Compiling C object 'app/test/3062f5d@@dpdk-test at exe/test_link_bonding.c.o'.
[721/822] Compiling C object 'app/test/3062f5d@@dpdk-test at exe/test_pmd_ring_perf.c.o'.
[722/822] Compiling C object 'examples/c590b3c@@dpdk-bond at exe/bond_main.c.o'.
[723/822] Linking target examples/dpdk-bond.
[724/822] Compiling C object 'drivers/a715181@@tmp_rte_pmd_octeontx2_event at sta/event_octeontx2_otx2_worker_dual.c.o'.
[725/822] Linking static target drivers/libtmp_rte_pmd_octeontx2_event.a.
[726/822] Compiling C object 'examples/c590b3c@@dpdk-eventdev_pipeline at exe/eventdev_pipeline_pipeline_worker_tx.c.o'.
[727/822] Linking target app/test/dpdk-test.
[728/822] Compiling C object 'examples/c590b3c@@dpdk-distributor at exe/distributor_main.c.o'.
[729/822] Generating rte_pmd_octeontx2_event.pmd.c with a custom command.
[730/822] Compiling C object 'examples/c590b3c@@dpdk-exception_path at exe/exception_path_main.c.o'.
[731/822] Linking target examples/dpdk-distributor.
[732/822] Compiling C object 'drivers/a715181@@rte_pmd_octeontx2_event at sha/meson-generated_.._rte_pmd_octeontx2_event.pmd.c.o'.
[733/822] Compiling C object 'examples/c590b3c@@dpdk-eventdev_pipeline at exe/eventdev_pipeline_main.c.o'.
[734/822] Compiling C object 'drivers/a715181@@rte_pmd_octeontx2_event at sta/meson-generated_.._rte_pmd_octeontx2_event.pmd.c.o'.
[735/822] Linking static target drivers/librte_pmd_octeontx2_event.a.
[736/822] Linking target examples/dpdk-exception_path.
[737/822] Linking target examples/dpdk-eventdev_pipeline.
[738/822] Linking target drivers/librte_pmd_octeontx2_event.so.1.1.
[739/822] Compiling C object 'examples/c590b3c@@dpdk-bbdev_app at exe/bbdev_app_main.c.o'.
[740/822] Compiling C object 'examples/c590b3c@@dpdk-ip_pipeline at exe/ip_pipeline_kni.c.o'.
[741/822] Compiling C object 'examples/c590b3c@@dpdk-flow_filtering at exe/flow_filtering_main.c.o'.
[742/822] Compiling C object 'examples/c590b3c@@dpdk-ip_fragmentation at exe/ip_fragmentation_main.c.o'.
[743/822] Linking target examples/dpdk-ip_fragmentation.
[744/822] Compiling C object 'examples/c590b3c@@dpdk-flow_classify at exe/flow_classify_flow_classify.c.o'.
[745/822] Linking target examples/dpdk-flow_filtering.
[746/822] Linking target examples/dpdk-bbdev_app.
[747/822] Compiling C object 'examples/c590b3c@@dpdk-ip_reassembly at exe/ip_reassembly_main.c.o'.
[748/822] Linking target examples/dpdk-flow_classify.
[749/822] Linking target examples/dpdk-ip_reassembly.
[750/822] Compiling C object 'examples/c590b3c@@dpdk-ip_pipeline at exe/ip_pipeline_link.c.o'.
[751/822] Compiling C object 'examples/c590b3c@@dpdk-ipsec-secgw at exe/ipsec-secgw_ipsec.c.o'.
[752/822] Compiling C object 'examples/c590b3c@@dpdk-ipsec-secgw at exe/ipsec-secgw_sa.c.o'.
[753/822] Compiling C object 'examples/c590b3c@@dpdk-ipsec-secgw at exe/ipsec-secgw_ipsec_process.c.o'.
[754/822] Compiling C object 'examples/c590b3c@@dpdk-l2fwd at exe/l2fwd_main.c.o'.
[755/822] Linking target examples/dpdk-l2fwd.
[756/822] Compiling C object 'examples/c590b3c@@dpdk-ipv4_multicast at exe/ipv4_multicast_main.c.o'.
[757/822] Linking target examples/dpdk-ipv4_multicast.
[758/822] Compiling C object 'examples/c590b3c@@dpdk-l2fwd-jobstats at exe/l2fwd-jobstats_main.c.o'.
[759/822] Linking target examples/dpdk-l2fwd-jobstats.
[760/822] Compiling C object 'examples/c590b3c@@dpdk-kni at exe/kni_main.c.o'.
[761/822] Linking target examples/dpdk-kni.
[762/822] Compiling C object 'examples/c590b3c@@dpdk-ipsec-secgw at exe/ipsec-secgw_ipsec-secgw.c.o'.
[763/822] Compiling C object 'examples/c590b3c@@dpdk-l3fwd at exe/l3fwd_l3fwd_lpm.c.o'.
[764/822] Linking target examples/dpdk-ipsec-secgw.
[765/822] Compiling C object 'examples/c590b3c@@dpdk-ip_pipeline at exe/ip_pipeline_cli.c.o'.
[766/822] Linking target examples/dpdk-ip_pipeline.
[767/822] Compiling C object 'examples/c590b3c@@dpdk-l2fwd-keepalive at exe/l2fwd-keepalive_main.c.o'.
[768/822] Compiling C object 'examples/c590b3c@@dpdk-l2fwd-crypto at exe/l2fwd-crypto_main.c.o'.
[769/822] Linking target examples/dpdk-l2fwd-keepalive.
[770/822] Linking target examples/dpdk-l2fwd-crypto.
[771/822] Compiling C object 'examples/c590b3c@@dpdk-l3fwd-vf at exe/l3fwd-vf_main.c.o'.
[772/822] Linking target examples/dpdk-l3fwd-vf.
[773/822] Compiling C object 'examples/c590b3c@@dpdk-l3fwd at exe/l3fwd_main.c.o'.
[774/822] Compiling C object 'examples/c590b3c@@dpdk-link_status_interrupt at exe/link_status_interrupt_main.c.o'.
[775/822] Linking target examples/dpdk-link_status_interrupt.
[776/822] Compiling C object 'examples/c590b3c@@dpdk-l3fwd-power at exe/l3fwd-power_main.c.o'.
[777/822] Compiling C object 'examples/c590b3c@@dpdk-load_balancer at exe/load_balancer_init.c.o'.
[778/822] Linking target examples/dpdk-l3fwd-power.
[779/822] Compiling C object 'examples/c590b3c@@dpdk-l3fwd at exe/l3fwd_l3fwd_em.c.o'.
[780/822] Compiling C object 'examples/c590b3c@@dpdk-load_balancer at exe/load_balancer_main.c.o'.
[781/822] Linking target examples/dpdk-l3fwd.
[782/822] Compiling C object 'examples/c590b3c@@dpdk-l3fwd-acl at exe/l3fwd-acl_main.c.o'.
[783/822] Linking target examples/dpdk-l3fwd-acl.
[784/822] Compiling C object 'examples/c590b3c@@dpdk-mp_server at exe/multi_process_client_server_mp_mp_server_init.c.o'.
[785/822] Compiling C object 'examples/c590b3c@@dpdk-load_balancer at exe/load_balancer_config.c.o'.
[786/822] Compiling C object 'examples/c590b3c@@dpdk-hotplug_mp at exe/multi_process_hotplug_mp_commands.c.o'.
[787/822] Linking target examples/dpdk-hotplug_mp.
[788/822] Compiling C object 'examples/c590b3c@@dpdk-symmetric_mp at exe/multi_process_symmetric_mp_main.c.o'.
[789/822] Linking target examples/dpdk-symmetric_mp.
[790/822] Compiling C object 'examples/c590b3c@@dpdk-mp_client at exe/multi_process_client_server_mp_mp_client_client.c.o'.
[791/822] Linking target examples/dpdk-mp_client.
[792/822] Compiling C object 'examples/c590b3c@@dpdk-mp_server at exe/multi_process_client_server_mp_mp_server_main.c.o'.
[793/822] Linking target examples/dpdk-mp_server.
[794/822] Compiling C object 'examples/c590b3c@@dpdk-load_balancer at exe/load_balancer_runtime.c.o'.
[795/822] Compiling C object 'examples/c590b3c@@dpdk-ptpclient at exe/ptpclient_ptpclient.c.o'.
[796/822] Linking target examples/dpdk-load_balancer.
[797/822] Linking target examples/dpdk-ptpclient.
[798/822] Compiling C object 'examples/c590b3c@@dpdk-qos_sched at exe/qos_sched_main.c.o'.
[799/822] Compiling C object 'examples/c590b3c@@dpdk-qos_sched at exe/qos_sched_app_thread.c.o'.
[800/822] Compiling C object 'examples/c590b3c@@dpdk-qos_sched at exe/qos_sched_init.c.o'.
[801/822] Compiling C object 'examples/c590b3c@@dpdk-qos_meter at exe/qos_meter_main.c.o'.
[802/822] Linking target examples/dpdk-qos_sched.
[803/822] Compiling C object 'examples/c590b3c@@dpdk-packet_ordering at exe/packet_ordering_main.c.o'.
[804/822] Linking target examples/dpdk-qos_meter.
[805/822] Compiling C object 'examples/c590b3c@@dpdk-rxtx_callbacks at exe/rxtx_callbacks_main.c.o'.
[806/822] Linking target examples/dpdk-packet_ordering.
[807/822] Compiling C object 'examples/c590b3c@@dpdk-skeleton at exe/skeleton_basicfwd.c.o'.
[808/822] Linking target examples/dpdk-rxtx_callbacks.
[809/822] Linking target examples/dpdk-skeleton.
[810/822] Compiling C object 'examples/c590b3c@@dpdk-tep_termination at exe/tep_termination_main.c.o'.
[811/822] Compiling C object 'examples/c590b3c@@dpdk-vdpa at exe/vdpa_main.c.o'.
[812/822] Linking target examples/dpdk-vdpa.
[813/822] Compiling C object 'examples/c590b3c@@dpdk-tep_termination at exe/tep_termination_vxlan_setup.c.o'.
[814/822] Linking target examples/dpdk-tep_termination.
[815/822] Compiling C object 'examples/c590b3c@@dpdk-vhost at exe/vhost_virtio_net.c.o'.
[816/822] Compiling C object 'examples/c590b3c@@dpdk-vhost_scsi at exe/vhost_scsi_scsi.c.o'.
[817/822] Compiling C object 'examples/c590b3c@@dpdk-vhost_crypto at exe/vhost_crypto_main.c.o'.
[818/822] Compiling C object 'examples/c590b3c@@dpdk-vhost_scsi at exe/vhost_scsi_vhost_scsi.c.o'.
FAILED: examples/c590b3c@@dpdk-vhost_scsi at exe/vhost_scsi_vhost_scsi.c.o 
clang -Iexamples/c590b3c@@dpdk-vhost_scsi at exe -Iexamples -I../examples -Iexamples/vhost_scsi -I../examples/vhost_scsi -I. -I../ -Iconfig -I../config -Ilib/librte_eal/common/include -I../lib/librte_eal/common/include -I../lib/librte_eal/linux/eal/include -Ilib/librte_eal/common -I../lib/librte_eal/common -Ilib/librte_eal/common/include/arch/x86 -I../lib/librte_eal/common/include/arch/x86 -Ilib/librte_eal -I../lib/librte_eal -Ilib/librte_kvargs -I../lib/librte_kvargs -Ilib/librte_mempool -I../lib/librte_mempool -Ilib/librte_ring -I../lib/librte_ring -Ilib/librte_net -I../lib/librte_net -Ilib/librte_mbuf -I../lib/librte_mbuf -Ilib/librte_ethdev -I../lib/librte_ethdev -Ilib/librte_meter -I../lib/librte_meter -Ilib/librte_cmdline -I../lib/librte_cmdline -Ilib/librte_vhost -I../lib/librte_vhost -Ilib/librte_cryptodev -I../lib/librte_cryptodev -Ilib/librte_hash -I../lib/librte_hash -Ilib/librte_pci -I../lib/librte_pci -Xclang -fcolor-diagnostics -pipe -D_FILE_OFFSET_BITS=64 -Wall -Winvalid-pch -Werror -O3 -include rte_config.h -Wunused-parameter -Wsign-compare -Wcast-qual -Wno-address-of-packed-member -D_GNU_SOURCE -march=native -MD -MQ 'examples/c590b3c@@dpdk-vhost_scsi at exe/vhost_scsi_vhost_scsi.c.o' -MF 'examples/c590b3c@@dpdk-vhost_scsi at exe/vhost_scsi_vhost_scsi.c.o.d' -o 'examples/c590b3c@@dpdk-vhost_scsi at exe/vhost_scsi_vhost_scsi.c.o' -c ../examples/vhost_scsi/vhost_scsi.c
../examples/vhost_scsi/vhost_scsi.c:61:9: error: 'rte_vhost_va_from_guest_pa' is deprecated: Symbol is not yet part of stable ABI [-Werror,-Wdeprecated-declarations]
        return rte_vhost_va_from_guest_pa(ctrlr->mem, gpa, len);
               ^
../lib/librte_vhost/rte_vhost.h:236:1: note: 'rte_vhost_va_from_guest_pa' has been explicitly marked deprecated here
__rte_experimental
^
../lib/librte_eal/common/include/rte_compat.h:82:16: note: expanded from macro '__rte_experimental'
__attribute__((deprecated("Symbol is not yet part of stable ABI"), \
               ^
1 error generated.
[819/822] Linking target examples/dpdk-vhost_crypto.
[820/822] Compiling C object 'examples/c590b3c@@dpdk-vhost at exe/vhost_main.c.o'.
ninja: build stopped: subcommand failed




*Meson Build Failed #3:
OS: FC30-64
Target:build-gcc-static
FAILED: examples/c590b3c@@dpdk-vhost_scsi at exe/vhost_scsi_vhost_scsi.c.o 
gcc -Iexamples/c590b3c@@dpdk-vhost_scsi at exe -Iexamples -I../examples -Iexamples/vhost_scsi -I../examples/vhost_scsi -I. -I../ -Iconfig -I../config -Ilib/librte_eal/common/include -I../lib/librte_eal/common/include -I../lib/librte_eal/linux/eal/include -Ilib/librte_eal/common -I../lib/librte_eal/common -Ilib/librte_eal/common/include/arch/x86 -I../lib/librte_eal/common/include/arch/x86 -Ilib/librte_eal -I../lib/librte_eal -Ilib/librte_kvargs -I../lib/librte_kvargs -Ilib/librte_mempool -I../lib/librte_mempool -Ilib/librte_ring -I../lib/librte_ring -Ilib/librte_net -I../lib/librte_net -Ilib/librte_mbuf -I../lib/librte_mbuf -Ilib/librte_ethdev -I../lib/librte_ethdev -Ilib/librte_meter -I../lib/librte_meter -Ilib/librte_cmdline -I../lib/librte_cmdline -Ilib/librte_vhost -I../lib/librte_vhost -Ilib/librte_cryptodev -I../lib/librte_cryptodev -Ilib/librte_hash -I../lib/librte_hash -Ilib/librte_pci -I../lib/librte_pci -fdiagnostics-color=always -pipe -D_FILE_OFFSET_BITS=64 -Wall -Winvalid-pch -Werror -O3 -include rte_config.h -Wunused-parameter -Wsign-compare -Wcast-qual -Wno-address-of-packed-member -D_GNU_SOURCE -march=native -mno-avx512f -Wno-format-truncation -MD -MQ 'examples/c590b3c@@dpdk-vhost_scsi at exe/vhost_scsi_vhost_scsi.c.o' -MF 'examples/c590b3c@@dpdk-vhost_scsi at exe/vhost_scsi_vhost_scsi.c.o.d' -o 'examples/c590b3c@@dpdk-vhost_scsi at exe/vhost_scsi_vhost_scsi.c.o' -c ../examples/vhost_scsi/vhost_scsi.c
../examples/vhost_scsi/vhost_scsi.c: In function ‘gpa_to_vva’:
../examples/vhost_scsi/vhost_scsi.c:61:2: error: ‘rte_vhost_va_from_guest_pa’ is deprecated: Symbol is not yet part of stable ABI [-Werror=deprecated-declarations]
   61 |  return rte_vhost_va_from_guest_pa(ctrlr->mem, gpa, len);
      |  ^~~~~~
In file included from ../examples/vhost_scsi/vhost_scsi.c:18:
../lib/librte_vhost/rte_vhost.h:238:1: note: declared here
  238 | rte_vhost_va_from_guest_pa(struct rte_vhost_memory *mem,
      | ^~~~~~~~~~~~~~~~~~~~~~~~~~
cc1: all warnings being treated as errors
[1757/1784] Linking target examples/dpdk-qos_meter.
[1758/1784] Linking target examples/dpdk-qos_sched.
[1759/1784] Compiling C object 'examples/c590b3c@@dpdk-skeleton at exe/skeleton_basicfwd.c.o'.
[1760/1784] Linking target examples/dpdk-service_cores.
[1761/1784] Compiling C object 'examples/c590b3c@@dpdk-rxtx_callbacks at exe/rxtx_callbacks_main.c.o'.
[1762/1784] Compiling C object 'examples/c590b3c@@dpdk-tep_termination at exe/tep_termination_vxlan_setup.c.o'.
[1763/1784] Compiling C object 'examples/c590b3c@@dpdk-vhost at exe/vhost_virtio_net.c.o'.
ninja: build stopped: subcommand failed




*Meson Build Failed #4:
OS: UB1804-64
Target:build-gcc-static
FAILED: examples/c590b3c@@dpdk-vhost_scsi at exe/vhost_scsi_vhost_scsi.c.o 
gcc -Iexamples/c590b3c@@dpdk-vhost_scsi at exe -Iexamples -I../examples -Iexamples/vhost_scsi -I../examples/vhost_scsi -I. -I../ -Iconfig -I../config -Ilib/librte_eal/common/include -I../lib/librte_eal/common/include -I../lib/librte_eal/linux/eal/include -Ilib/librte_eal/common -I../lib/librte_eal/common -Ilib/librte_eal/common/include/arch/x86 -I../lib/librte_eal/common/include/arch/x86 -Ilib/librte_eal -I../lib/librte_eal -Ilib/librte_kvargs -I../lib/librte_kvargs -Ilib/librte_mempool -I../lib/librte_mempool -Ilib/librte_ring -I../lib/librte_ring -Ilib/librte_net -I../lib/librte_net -Ilib/librte_mbuf -I../lib/librte_mbuf -Ilib/librte_ethdev -I../lib/librte_ethdev -Ilib/librte_meter -I../lib/librte_meter -Ilib/librte_cmdline -I../lib/librte_cmdline -Ilib/librte_vhost -I../lib/librte_vhost -Ilib/librte_cryptodev -I../lib/librte_cryptodev -Ilib/librte_hash -I../lib/librte_hash -Ilib/librte_pci -I../lib/librte_pci -fdiagnostics-color=always -pipe -D_FILE_OFFSET_BITS=64 -Wall -Winvalid-pch -Werror -O3 -include rte_config.h -Wunused-parameter -Wsign-compare -Wcast-qual -D_GNU_SOURCE -march=native -mno-avx512f -Wno-format-truncation -MD -MQ 'examples/c590b3c@@dpdk-vhost_scsi at exe/vhost_scsi_vhost_scsi.c.o' -MF 'examples/c590b3c@@dpdk-vhost_scsi at exe/vhost_scsi_vhost_scsi.c.o.d' -o 'examples/c590b3c@@dpdk-vhost_scsi at exe/vhost_scsi_vhost_scsi.c.o' -c ../examples/vhost_scsi/vhost_scsi.c
../examples/vhost_scsi/vhost_scsi.c: In function ‘gpa_to_vva’:
../examples/vhost_scsi/vhost_scsi.c:61:2: error: ‘rte_vhost_va_from_guest_pa’ is deprecated: Symbol is not yet part of stable ABI [-Werror=deprecated-declarations]
  return rte_vhost_va_from_guest_pa(ctrlr->mem, gpa, len);
  ^~~~~~
In file included from ../examples/vhost_scsi/vhost_scsi.c:18:0:
../lib/librte_vhost/rte_vhost.h:238:1: note: declared here
 rte_vhost_va_from_guest_pa(struct rte_vhost_memory *mem,
 ^~~~~~~~~~~~~~~~~~~~~~~~~~
cc1: all warnings being treated as errors
[1771/1791] Compiling C object 'examples/c590b3c@@dpdk-vdpa at exe/vdpa_main.c.o'.
[1772/1791] Linking target examples/dpdk-timer.
[1773/1791] Linking target examples/dpdk-skeleton.
[1774/1791] Compiling C object 'examples/c590b3c@@dpdk-vhost_crypto at exe/vhost_crypto_main.c.o'.
[1775/1791] Compiling C object 'examples/c590b3c@@dpdk-tep_termination at exe/tep_termination_main.c.o'.
ninja: build stopped: subcommand failed



DPDK STV team


More information about the test-report mailing list