[dpdk-test-report] |FAILURE| pw59808[v7, 11/17] raw/ifpga: add PCIe BDF devices tree scan

sys_stv at intel.com sys_stv at intel.com
Thu Sep 26 11:18:53 CEST 2019


Test-Label: Intel-compilation
Test-Status: FAILURE
http://dpdk.org/patch/59808

_Compilation issues_

Submitter: Pei, Andy <andy.pei at intel.com>
Date: 2019-09-26 08:07:36
Reply_mail: 1569485262-457887-12-git-send-email-andy.pei at intel.com
DPDK git baseline: Repo:dpdk-next-net-intel, CommitID: 008dabc7879c6c4bfbb4e59c00f2efb5a04eedaa

Makefile build Summary: 22 Builds Done, 0 Successful, 22 Failures

Meson build Summary: 7 Builds Done, 2 Successful, 5 Failures

               +==============================================+===========+==========+
               |                   Makefile                   |   Meson   | Document |
+--------------+------+-------+------+------------+-----------+-----------+----------+
| os           | gcc  | clang | icc  | gcc+shared | gcc+debug | gcc/clang | pdf/html |
+--------------+------+-------+------+------------+-----------+-----------+----------+
| RHEL76-64    | FAIL |       |      |            |           |           |          |
| CENTOS76-64  | FAIL | FAIL  | FAIL | FAIL       | FAIL      |           |          |
| UB1804-64    | FAIL | FAIL  | FAIL |            |           | FAIL      | pass     |
| UB1604-32    | FAIL |       |      |            |           | FAIL      |          |
| UB1904-64    | FAIL |       |      |            |           |           |          |
| UB1604-64    | FAIL | FAIL  |      |            |           |           |          |
| FC30-64      | FAIL | FAIL  |      |            |           | FAIL      |          |
| WIN10-64     |      |       |      |            |           | pass      |          |
| FreeBSD12-64 | FAIL | FAIL  |      | FAIL       | FAIL      | FAIL      |          |
| RHEL80-64    | FAIL |       |      |            |           |           |          |
| SUSE15-64    | FAIL | FAIL  |      |            |           | FAIL      |          |
+--------------+------+-------+------+------------+-----------+-----------+----------+

Test environment and configuration as below:

** Makefile build **


OS: RHEL76-64
	Kernel Version: 3.10.0-957.el7.x86_64
	CPU info: Intel(R) Xeon(R) CPU E5-2699 v4 @ 2.20GHz
	GCC Version: gcc (GCC) 4.8.5 20150623 (Red Hat 4.8.5-36)
	Clang Version: NA
	x86_64-native-linuxapp-gcc


OS: CENTOS76-64
	Kernel Version: 3.10.0-957.10.1.el7.x86_64
	CPU info: Intel(R) Xeon(R) CPU E5-2699 v4 @ 2.20GHz
	GCC Version: gcc (GCC) 4.8.5 20150623 (Red Hat 4.8.5-36)
	Clang Version: 3.4.2 (tags/RELEASE_34/dot2-final)
	x86_64-native-linuxapp-clang
	x86_64-native-linuxapp-gcc+debug
	x86_64-native-linuxapp-gcc
	x86_64-native-linuxapp-gcc+shared
	x86_64-native-linuxapp-icc


OS: UB1804-64
	Kernel Version: 4.15.0-20-generic
	CPU info: Intel(R) Xeon(R) CPU E5-2699 v3 @ 2.30GHz
	GCC Version: gcc (Ubuntu 7.3.0-27ubuntu1~18.04) 7.3.0
	Clang Version: 6.0.0-1ubuntu2 (tags/RELEASE_600/final)
	x86_64-native-linuxapp-icc
	x86_64-native-linuxapp-clang
	x86_64-native-linuxapp-gcc


OS: UB1904-64
	Kernel Version: 5.0.0-13-generic
	CPU info: Intel(R) Xeon(R) CPU E5-2699 v3 @ 2.30GHz
	GCC Version: gcc (Ubuntu 8.3.0-6ubuntu1) 8.3.0
	Clang Version: 8.0.0-3 (tags/RELEASE_800/final)
	x86_64-native-linuxapp-gcc


OS: UB1604-32
	Kernel Version: 4.4.0-131-generic
	CPU info: Intel(R) Xeon(R) CPU E5-2699 v3 @ 2.30GHz
	GCC Version: gcc (Ubuntu 5.4.0-6ubuntu1~16.04.11) 5.4.0 20160609
	Clang Version: 3.8.0-2ubuntu4 (tags/RELEASE_380/final)
	i686-native-linuxapp-gcc


OS: UB1604-64
	Kernel Version: 4.4.0-47-generic
	CPU info: Intel(R) Xeon(R) CPU E5-2699 v3 @ 2.30GHz
	GCC Version: gcc (Ubuntu 5.4.0-6ubuntu1~16.04.10) 5.4.0 20160609
	Clang Version: 3.8.0-2ubuntu4 (tags/RELEASE_380/final)
	x86_64-native-linuxapp-clang
	x86_64-native-linuxapp-gcc


OS: FC30-64
	Kernel Version: 5.1.7-300.fc30.x86_64
	CPU info: Intel(R) Xeon(R) CPU E5-2699 v4 @ 2.20GHz
	GCC Version: gcc (GCC) 9.1.1 20190503 (Red Hat 9.1.1-1)
	Clang Version: 8.0.0 (Fedora 8.0.0-1.fc30)
	x86_64-native-linuxapp-gcc
	x86_64-native-linuxapp-clang


OS: FreeBSD12-64
	Kernel Version: 12.0-RC3
	CPU info: Intel(R) Xeon(R) CPU E5-2699 v4 @ 2.20GHz (2194.97-MHz K8-class CPU)
	GCC Version: gcc (FreeBSD Ports Collection) 7.3.0
	Clang Version: 6.0.1 (tags/RELEASE_601/final 335540) (based on LLVM 6.0.1)
	x86_64-native-bsdapp-gcc+shared
	x86_64-native-bsdapp-gcc+debug
	x86_64-native-bsdapp-clang
	x86_64-native-bsdapp-gcc


OS: RHEL80-64
	Kernel Version: 4.18.0-80.el8.x86_64
	CPU info: Intel(R) Xeon(R) CPU E5-2699 v4 @ 2.20GHz
	GCC Version: gcc (GCC) 8.2.1 20180905 (Red Hat 8.2.1-3)
	Clang Version: 6.0.1 (tags/RELEASE_601/final)
	x86_64-native-linuxapp-gcc


OS: SUSE15-64
	Kernel Version: 4.12.14-lp150.11-default
	CPU info: Intel(R) Xeon(R) CPU E5-2699 v4 @ 2.20GHz
	GCC Version: gcc (SUSE Linux) 7.3.1 20180323 [gcc-7-branch revision 258812]
	Clang Version: 5.0.1 (tags/RELEASE_501/final 312548)
	x86_64-native-linuxapp-gcc
	x86_64-native-linuxapp-clang


** Meson build **


OS: UB1804-64
	Kernel Version: 4.15.0-20-generic
	CPU info: Intel(R) Xeon(R) CPU E5-2699 v4 @ 2.20GHz
	GCC Version: gcc (Ubuntu 7.3.0-27ubuntu1~18.04) 7.3.0
	Clang Version: 6.0.0-1ubuntu2 (tags/RELEASE_600/final)
	x86_64-native-linuxapp-doc
	build-gcc-static
	build-gcc-shared
	build-clang-static
	build-clang-shared
	build-x86-default


OS: UB1604-32
	Kernel Version: 4.4.0-131-generic
	CPU info: Intel(R) Xeon(R) CPU E5-2699 v4 @ 2.20GHz
	GCC Version: gcc (Ubuntu 5.4.0-6ubuntu1~16.04.11) 5.4.0 20160609
	Clang Version: 3.8.0-2ubuntu4 (tags/RELEASE_380/final)
	build-gcc-static
	build-gcc-shared
	build-clang-static
	build-clang-shared
	build-x86-default


OS: FC30-64
	Kernel Version: 5.0.9-301.fc30.x86_64
	CPU info: Intel(R) Xeon(R) CPU E5-2699 v4 @ 2.20GHz
	GCC Version: gcc (GCC) 9.1.1 20190503 (Red Hat 9.1.1-1)
	Clang Version: 8.0.0 (Fedora 8.0.0-1.fc30)
	build-gcc-static
	build-gcc-shared
	build-clang-static
	build-clang-shared
	build-x86-default


OS: WIN10-64
	Kernel Version: N/A
	CPU info: N/A
	GCC Version: N/A
	Clang Version: Clang 8.0.0
	x86_64-windows-clang


OS: FreeBSD12-64
	Kernel Version: 12.0-RC3
	CPU info: Intel(R) Xeon(R) CPU E5-2699 v4 @ 2.20GHz (2194.99-MHz K8-class CPU)
	GCC Version: gcc (FreeBSD Ports Collection) 7.3.0
	Clang Version: 6.0.1 (tags/RELEASE_601/final 335540) (based on LLVM 6.0.1)
	build-gcc-static
	build-gcc-shared
	build-clang-static
	build-clang-shared
	build-x86-default


OS: SUSE15-64
	Kernel Version: 4.12.14-lp150.11-default
	CPU info: Intel(R) Xeon(R) CPU E5-2699 v4 @ 2.20GHz
	GCC Version: gcc (SUSE Linux) 7.3.1 20180323 [gcc-7-branch revision 258812]
	Clang Version: 5.0.1 (tags/RELEASE_501/final 312548)
	build-gcc-static
	build-gcc-shared
	build-clang-static
	build-clang-shared
	build-x86-default


*Make Build Failed #1:
OS: UB1604-64
Target: x86_64-native-linuxapp-clang
  CC opae_intel_max10.o
  CC opae_i2c.o
  CC opae_at24_eeprom.o
  CC opae_eth_group.o
  CC ifpga_rawdev.o
/tmp/UB1604-64_K4.4.0_Clang3.8.0/x86_64-native-linuxapp-clang/fa7f4591e096456ab9618272622d34e0/dpdk/drivers/raw/ifpga/base/opae_intel_max10.c:6:10: fatal error: 'libfdt.h' file not found
#include <libfdt.h>
         ^
1 error generated.
/tmp/UB1604-64_K4.4.0_Clang3.8.0/x86_64-native-linuxapp-clang/fa7f4591e096456ab9618272622d34e0/dpdk/mk/internal/rte.compile-pre.mk:114: recipe for target 'opae_intel_max10.o' failed
make[6]: *** [opae_intel_max10.o] Error 1
make[6]: *** Waiting for unfinished jobs....
  PMDINFO ifpga_rawdev.o.pmd.c
  CC ifpga_rawdev.o.pmd.o
  LD ifpga_rawdev.o
/tmp/UB1604-64_K4.4.0_Clang3.8.0/x86_64-native-linuxapp-clang/fa7f4591e096456ab9618272622d34e0/dpdk/mk/rte.subdir.mk:35: recipe for target 'ifpga' failed
make[5]: *** [ifpga] Error 2
/tmp/UB1604-64_K4.4.0_Clang3.8.0/x86_64-native-linuxapp-clang/fa7f4591e096456ab9618272622d34e0/dpdk/mk/rte.subdir.mk:35: recipe for target 'raw' failed
make[4]: *** [raw] Error 2
/tmp/UB1604-64_K4.4.0_Clang3.8.0/x86_64-native-linuxapp-clang/fa7f4591e096456ab9618272622d34e0/dpdk/mk/rte.sdkbuild.mk:46: recipe for target 'drivers' failed
make[3]: *** [drivers] Error 2
/tmp/UB1604-64_K4.4.0_Clang3.8.0/x86_64-native-linuxapp-clang/fa7f4591e096456ab9618272622d34e0/dpdk/mk/rte.sdkroot.mk:98: recipe for target 'all' failed
make[2]: *** [all] Error 2
/tmp/UB1604-64_K4.4.0_Clang3.8.0/x86_64-native-linuxapp-clang/fa7f4591e096456ab9618272622d34e0/dpdk/mk/rte.sdkinstall.mk:60: recipe for target 'pre_install' failed
make[1]: *** [pre_install] Error 2
/tmp/UB1604-64_K4.4.0_Clang3.8.0/x86_64-native-linuxapp-clang/fa7f4591e096456ab9618272622d34e0/dpdk/mk/rte.sdkroot.mk:77: recipe for target 'install' failed
make: *** [install] Error 2


*Make Build Failed #2:
OS: UB1604-32
Target: i686-native-linuxapp-gcc
  CC opae_at24_eeprom.o
  CC opae_eth_group.o
  AR librte_rawdev_ioat.a
  CC ifpga_rawdev.o
  INSTALL-LIB librte_rawdev_ioat.a
/tmp/UB1604-32_K4.4.0_GCC5.4.0/i686-native-linuxapp-gcc/fa7f4591e096456ab9618272622d34e0/dpdk/drivers/raw/ifpga/base/opae_intel_max10.c:6:20: fatal error: libfdt.h: No such file or directory
compilation terminated.
/tmp/UB1604-32_K4.4.0_GCC5.4.0/i686-native-linuxapp-gcc/fa7f4591e096456ab9618272622d34e0/dpdk/mk/internal/rte.compile-pre.mk:114: recipe for target 'opae_intel_max10.o' failed
make[6]: *** [opae_intel_max10.o] Error 1
make[6]: *** Waiting for unfinished jobs....
In file included from /tmp/UB1604-32_K4.4.0_GCC5.4.0/i686-native-linuxapp-gcc/fa7f4591e096456ab9618272622d34e0/dpdk/drivers/raw/ifpga/ifpga_rawdev.c:41:0:
/tmp/UB1604-32_K4.4.0_GCC5.4.0/i686-native-linuxapp-gcc/fa7f4591e096456ab9618272622d34e0/dpdk/drivers/raw/ifpga/ifpga_rawdev.c: In function ‘fme_err_read_seu_emr’:
/tmp/UB1604-32_K4.4.0_GCC5.4.0/i686-native-linuxapp-gcc/fa7f4591e096456ab9618272622d34e0/dpdk/drivers/raw/ifpga/ifpga_rawdev.h:11:51: warning: format ‘%lx’ expects argument of type ‘long unsigned int’, but argument 5 has type ‘u64 {aka long long unsigned int}’ [-Wformat=]
  rte_log(RTE_LOG_ ## level, ifpga_rawdev_logtype, "%s(): " fmt "\n", \
--
/tmp/UB1604-32_K4.4.0_GCC5.4.0/i686-native-linuxapp-gcc/fa7f4591e096456ab9618272622d34e0/dpdk/drivers/raw/ifpga/ifpga_rawdev.c: At top level:
cc1: warning: unrecognized command line option ‘-Wno-address-of-packed-member’
  PMDINFO ifpga_rawdev.o.pmd.c
  CC ifpga_rawdev.o.pmd.o
  LD ifpga_rawdev.o
/tmp/UB1604-32_K4.4.0_GCC5.4.0/i686-native-linuxapp-gcc/fa7f4591e096456ab9618272622d34e0/dpdk/mk/rte.subdir.mk:35: recipe for target 'ifpga' failed
make[5]: *** [ifpga] Error 2
/tmp/UB1604-32_K4.4.0_GCC5.4.0/i686-native-linuxapp-gcc/fa7f4591e096456ab9618272622d34e0/dpdk/mk/rte.subdir.mk:35: recipe for target 'raw' failed
make[4]: *** [raw] Error 2
/tmp/UB1604-32_K4.4.0_GCC5.4.0/i686-native-linuxapp-gcc/fa7f4591e096456ab9618272622d34e0/dpdk/mk/rte.sdkbuild.mk:46: recipe for target 'drivers' failed
make[3]: *** [drivers] Error 2
/tmp/UB1604-32_K4.4.0_GCC5.4.0/i686-native-linuxapp-gcc/fa7f4591e096456ab9618272622d34e0/dpdk/mk/rte.sdkroot.mk:98: recipe for target 'all' failed
make[2]: *** [all] Error 2
/tmp/UB1604-32_K4.4.0_GCC5.4.0/i686-native-linuxapp-gcc/fa7f4591e096456ab9618272622d34e0/dpdk/mk/rte.sdkinstall.mk:60: recipe for target 'pre_install' failed
make[1]: *** [pre_install] Error 2
/tmp/UB1604-32_K4.4.0_GCC5.4.0/i686-native-linuxapp-gcc/fa7f4591e096456ab9618272622d34e0/dpdk/mk/rte.sdkroot.mk:77: recipe for target 'install' failed
make: *** [install] Error 2


*Make Build Failed #3:
OS: UB1904-64
Target: x86_64-native-linuxapp-gcc
  CC opae_i2c.o
  AR librte_rawdev_skeleton.a
  CC opae_at24_eeprom.o
  CC opae_eth_group.o
  INSTALL-LIB librte_rawdev_skeleton.a
/tmp/UB1904-64_K4.18.0_GCC8.3.0/x86_64-native-linuxapp-gcc/fa7f4591e096456ab9618272622d34e0/dpdk/drivers/raw/ifpga/base/opae_intel_max10.c:6:10: fatal error: libfdt.h: No such file or directory
 #include <libfdt.h>
          ^~~~~~~~~~
compilation terminated.
make[6]: *** [/tmp/UB1904-64_K4.18.0_GCC8.3.0/x86_64-native-linuxapp-gcc/fa7f4591e096456ab9618272622d34e0/dpdk/mk/internal/rte.compile-pre.mk:114: opae_intel_max10.o] Error 1
make[6]: *** Waiting for unfinished jobs....
  CC ifpga_rawdev.o
  PMDINFO ifpga_rawdev.o.pmd.c
  CC ifpga_rawdev.o.pmd.o
  LD ifpga_rawdev.o
make[5]: *** [/tmp/UB1904-64_K4.18.0_GCC8.3.0/x86_64-native-linuxapp-gcc/fa7f4591e096456ab9618272622d34e0/dpdk/mk/rte.subdir.mk:35: ifpga] Error 2
make[4]: *** [/tmp/UB1904-64_K4.18.0_GCC8.3.0/x86_64-native-linuxapp-gcc/fa7f4591e096456ab9618272622d34e0/dpdk/mk/rte.subdir.mk:37: raw] Error 2
make[3]: *** [/tmp/UB1904-64_K4.18.0_GCC8.3.0/x86_64-native-linuxapp-gcc/fa7f4591e096456ab9618272622d34e0/dpdk/mk/rte.sdkbuild.mk:46: drivers] Error 2
make[2]: *** [/tmp/UB1904-64_K4.18.0_GCC8.3.0/x86_64-native-linuxapp-gcc/fa7f4591e096456ab9618272622d34e0/dpdk/mk/rte.sdkroot.mk:99: all] Error 2
make[1]: *** [/tmp/UB1904-64_K4.18.0_GCC8.3.0/x86_64-native-linuxapp-gcc/fa7f4591e096456ab9618272622d34e0/dpdk/mk/rte.sdkinstall.mk:61: pre_install] Error 2
make: *** [/tmp/UB1904-64_K4.18.0_GCC8.3.0/x86_64-native-linuxapp-gcc/fa7f4591e096456ab9618272622d34e0/dpdk/mk/rte.sdkroot.mk:77: install] Error 2


*Make Build Failed #4:
OS: UB1804-64
Target: x86_64-native-linuxapp-icc
/tmp/UB1804-64_K4.15.0_ICC19.0.0/x86_64-native-linuxapp-icc/fa7f4591e096456ab9618272622d34e0/dpdk/drivers/raw/ifpga/base/opae_intel_max10.c(6): catastrophic error: cannot open source file "libfdt.h"
  #include <libfdt.h>
                     ^

compilation aborted for /tmp/UB1804-64_K4.15.0_ICC19.0.0/x86_64-native-linuxapp-icc/fa7f4591e096456ab9618272622d34e0/dpdk/drivers/raw/ifpga/base/opae_intel_max10.c (code 4)
/tmp/UB1804-64_K4.15.0_ICC19.0.0/x86_64-native-linuxapp-icc/fa7f4591e096456ab9618272622d34e0/dpdk/mk/internal/rte.compile-pre.mk:114: recipe for target 'opae_intel_max10.o' failed
make[6]: *** [opae_intel_max10.o] Error 4
make[6]: *** Waiting for unfinished jobs....
  PMDINFO ifpga_rawdev.o.pmd.c
  CC ifpga_rawdev.o.pmd.o
  LD ifpga_rawdev.o
/tmp/UB1804-64_K4.15.0_ICC19.0.0/x86_64-native-linuxapp-icc/fa7f4591e096456ab9618272622d34e0/dpdk/mk/rte.subdir.mk:35: recipe for target 'ifpga' failed
make[5]: *** [ifpga] Error 2
/tmp/UB1804-64_K4.15.0_ICC19.0.0/x86_64-native-linuxapp-icc/fa7f4591e096456ab9618272622d34e0/dpdk/mk/rte.subdir.mk:35: recipe for target 'raw' failed
make[4]: *** [raw] Error 2
/tmp/UB1804-64_K4.15.0_ICC19.0.0/x86_64-native-linuxapp-icc/fa7f4591e096456ab9618272622d34e0/dpdk/mk/rte.sdkbuild.mk:46: recipe for target 'drivers' failed
make[3]: *** [drivers] Error 2
/tmp/UB1804-64_K4.15.0_ICC19.0.0/x86_64-native-linuxapp-icc/fa7f4591e096456ab9618272622d34e0/dpdk/mk/rte.sdkroot.mk:98: recipe for target 'all' failed
make[2]: *** [all] Error 2
/tmp/UB1804-64_K4.15.0_ICC19.0.0/x86_64-native-linuxapp-icc/fa7f4591e096456ab9618272622d34e0/dpdk/mk/rte.sdkinstall.mk:60: recipe for target 'pre_install' failed
make[1]: *** [pre_install] Error 2
/tmp/UB1804-64_K4.15.0_ICC19.0.0/x86_64-native-linuxapp-icc/fa7f4591e096456ab9618272622d34e0/dpdk/mk/rte.sdkroot.mk:77: recipe for target 'install' failed
make: *** [install] Error 2


*Make Build Failed #5:
OS: UB1804-64
Target: x86_64-native-linuxapp-clang
  AR librte_rawdev_octeontx2_dma.a
  INSTALL-LIB librte_rawdev_octeontx2_dma.a
  CC opae_at24_eeprom.o
  CC opae_eth_group.o
  CC ifpga_rawdev.o
/tmp/UB1804-64_K4.15.0_Clang6.0.0/x86_64-native-linuxapp-clang/fa7f4591e096456ab9618272622d34e0/dpdk/drivers/raw/ifpga/base/opae_intel_max10.c:6:10: fatal error: 'libfdt.h' file not found
#include <libfdt.h>
         ^~~~~~~~~~
1 error generated.
/tmp/UB1804-64_K4.15.0_Clang6.0.0/x86_64-native-linuxapp-clang/fa7f4591e096456ab9618272622d34e0/dpdk/mk/internal/rte.compile-pre.mk:114: recipe for target 'opae_intel_max10.o' failed
make[6]: *** [opae_intel_max10.o] Error 1
make[6]: *** Waiting for unfinished jobs....
  PMDINFO ifpga_rawdev.o.pmd.c
  CC ifpga_rawdev.o.pmd.o
  LD ifpga_rawdev.o
/tmp/UB1804-64_K4.15.0_Clang6.0.0/x86_64-native-linuxapp-clang/fa7f4591e096456ab9618272622d34e0/dpdk/mk/rte.subdir.mk:35: recipe for target 'ifpga' failed
make[5]: *** [ifpga] Error 2
/tmp/UB1804-64_K4.15.0_Clang6.0.0/x86_64-native-linuxapp-clang/fa7f4591e096456ab9618272622d34e0/dpdk/mk/rte.subdir.mk:35: recipe for target 'raw' failed
make[4]: *** [raw] Error 2
/tmp/UB1804-64_K4.15.0_Clang6.0.0/x86_64-native-linuxapp-clang/fa7f4591e096456ab9618272622d34e0/dpdk/mk/rte.sdkbuild.mk:46: recipe for target 'drivers' failed
make[3]: *** [drivers] Error 2
/tmp/UB1804-64_K4.15.0_Clang6.0.0/x86_64-native-linuxapp-clang/fa7f4591e096456ab9618272622d34e0/dpdk/mk/rte.sdkroot.mk:98: recipe for target 'all' failed
make[2]: *** [all] Error 2
/tmp/UB1804-64_K4.15.0_Clang6.0.0/x86_64-native-linuxapp-clang/fa7f4591e096456ab9618272622d34e0/dpdk/mk/rte.sdkinstall.mk:60: recipe for target 'pre_install' failed
make[1]: *** [pre_install] Error 2
/tmp/UB1804-64_K4.15.0_Clang6.0.0/x86_64-native-linuxapp-clang/fa7f4591e096456ab9618272622d34e0/dpdk/mk/rte.sdkroot.mk:77: recipe for target 'install' failed
make: *** [install] Error 2


*Make Build Failed #6:
OS: SUSE15-64
Target: x86_64-native-linuxapp-gcc
  CC opae_i2c.o
  CC opae_at24_eeprom.o
  CC opae_eth_group.o
  INSTALL-LIB librte_rawdev_ioat.a
  CC ifpga_rawdev.o
/tmp/SUSE15-64_K4.12.14_GCC7.3.1/x86_64-native-linuxapp-gcc/fa7f4591e096456ab9618272622d34e0/dpdk/drivers/raw/ifpga/base/opae_intel_max10.c:6:10: fatal error: libfdt.h: No such file or directory
 #include <libfdt.h>
          ^~~~~~~~~~
compilation terminated.
make[6]: *** [/tmp/SUSE15-64_K4.12.14_GCC7.3.1/x86_64-native-linuxapp-gcc/fa7f4591e096456ab9618272622d34e0/dpdk/mk/internal/rte.compile-pre.mk:114: opae_intel_max10.o] Error 1
make[6]: *** Waiting for unfinished jobs....
  PMDINFO ifpga_rawdev.o.pmd.c
  CC ifpga_rawdev.o.pmd.o
  LD ifpga_rawdev.o
make[5]: *** [/tmp/SUSE15-64_K4.12.14_GCC7.3.1/x86_64-native-linuxapp-gcc/fa7f4591e096456ab9618272622d34e0/dpdk/mk/rte.subdir.mk:35: ifpga] Error 2
make[4]: *** [/tmp/SUSE15-64_K4.12.14_GCC7.3.1/x86_64-native-linuxapp-gcc/fa7f4591e096456ab9618272622d34e0/dpdk/mk/rte.subdir.mk:37: raw] Error 2
make[3]: *** [/tmp/SUSE15-64_K4.12.14_GCC7.3.1/x86_64-native-linuxapp-gcc/fa7f4591e096456ab9618272622d34e0/dpdk/mk/rte.sdkbuild.mk:46: drivers] Error 2
make[2]: *** [/tmp/SUSE15-64_K4.12.14_GCC7.3.1/x86_64-native-linuxapp-gcc/fa7f4591e096456ab9618272622d34e0/dpdk/mk/rte.sdkroot.mk:99: all] Error 2
make[1]: *** [/tmp/SUSE15-64_K4.12.14_GCC7.3.1/x86_64-native-linuxapp-gcc/fa7f4591e096456ab9618272622d34e0/dpdk/mk/rte.sdkinstall.mk:61: pre_install] Error 2
make: *** [/tmp/SUSE15-64_K4.12.14_GCC7.3.1/x86_64-native-linuxapp-gcc/fa7f4591e096456ab9618272622d34e0/dpdk/mk/rte.sdkroot.mk:77: install] Error 2


*Make Build Failed #7:
OS: FC30-64
Target: x86_64-native-linuxapp-gcc
  CC opae_intel_max10.o
  CC opae_i2c.o
  CC opae_at24_eeprom.o
  CC opae_eth_group.o
  CC ifpga_rawdev.o
/tmp/FC30-64_K4.20_GCC9.1.1/x86_64-native-linuxapp-gcc/fa7f4591e096456ab9618272622d34e0/dpdk/drivers/raw/ifpga/base/opae_intel_max10.c:6:10: fatal error: libfdt.h: No such file or directory
    6 | #include <libfdt.h>
      |          ^~~~~~~~~~
compilation terminated.
make[6]: *** [/tmp/FC30-64_K4.20_GCC9.1.1/x86_64-native-linuxapp-gcc/fa7f4591e096456ab9618272622d34e0/dpdk/mk/internal/rte.compile-pre.mk:114: opae_intel_max10.o] Error 1
make[6]: *** Waiting for unfinished jobs....
  PMDINFO ifpga_rawdev.o.pmd.c
  CC ifpga_rawdev.o.pmd.o
  LD ifpga_rawdev.o
make[5]: *** [/tmp/FC30-64_K4.20_GCC9.1.1/x86_64-native-linuxapp-gcc/fa7f4591e096456ab9618272622d34e0/dpdk/mk/rte.subdir.mk:35: ifpga] Error 2
make[4]: *** [/tmp/FC30-64_K4.20_GCC9.1.1/x86_64-native-linuxapp-gcc/fa7f4591e096456ab9618272622d34e0/dpdk/mk/rte.subdir.mk:37: raw] Error 2
make[3]: *** [/tmp/FC30-64_K4.20_GCC9.1.1/x86_64-native-linuxapp-gcc/fa7f4591e096456ab9618272622d34e0/dpdk/mk/rte.sdkbuild.mk:46: drivers] Error 2
make[2]: *** [/tmp/FC30-64_K4.20_GCC9.1.1/x86_64-native-linuxapp-gcc/fa7f4591e096456ab9618272622d34e0/dpdk/mk/rte.sdkroot.mk:99: all] Error 2
make[1]: *** [/tmp/FC30-64_K4.20_GCC9.1.1/x86_64-native-linuxapp-gcc/fa7f4591e096456ab9618272622d34e0/dpdk/mk/rte.sdkinstall.mk:61: pre_install] Error 2
make: *** [/tmp/FC30-64_K4.20_GCC9.1.1/x86_64-native-linuxapp-gcc/fa7f4591e096456ab9618272622d34e0/dpdk/mk/rte.sdkroot.mk:77: install] Error 2


*Make Build Failed #8:
OS: RHEL76-64
Target: x86_64-native-linuxapp-gcc
  CC opae_spi.o
  INSTALL-LIB librte_rawdev_ntb.a
  CC opae_spi_transaction.o
  CC opae_intel_max10.o
  CC opae_i2c.o
/tmp/RHEL76-64_K3.10.0_GCC4.8.5/x86_64-native-linuxapp-gcc/fa7f4591e096456ab9618272622d34e0/dpdk/drivers/raw/ifpga/base/opae_intel_max10.c:6:20: fatal error: libfdt.h: No such file or directory
 #include <libfdt.h>
                    ^
compilation terminated.
  AR librte_rawdev_skeleton.a
  CC otx2_dpi_msg.o
--
  PMDINFO dpaa2_qdma.o.pmd.c
  CC dpaa2_qdma.o.pmd.o
  LD dpaa2_qdma.o
  AR librte_rawdev_dpaa2_qdma.a
  INSTALL-LIB librte_rawdev_dpaa2_qdma.a
make[6]: *** [opae_intel_max10.o] Error 1
make[6]: *** Waiting for unfinished jobs....
  AR librte_rawdev_octeontx2_dma.a
  INSTALL-LIB librte_rawdev_octeontx2_dma.a
  PMDINFO ifpga_rawdev.o.pmd.c
  CC ifpga_rawdev.o.pmd.o
  LD ifpga_rawdev.o
make[5]: *** [ifpga] Error 2
make[4]: *** [raw] Error 2
make[3]: *** [drivers] Error 2
make[2]: *** [all] Error 2
make[1]: *** [pre_install] Error 2
make: *** [install] Error 2


*Make Build Failed #9:
OS: RHEL80-64
Target: x86_64-native-linuxapp-gcc
  CC opae_intel_max10.o
  CC opae_i2c.o
  CC opae_at24_eeprom.o
  CC opae_eth_group.o
  CC ifpga_rawdev.o
/tmp/RHEL80-64_K3.10.0_GCC8.2.1/x86_64-native-linuxapp-gcc/fa7f4591e096456ab9618272622d34e0/dpdk/drivers/raw/ifpga/base/opae_intel_max10.c:6:10: fatal error: libfdt.h: No such file or directory
 #include <libfdt.h>
          ^~~~~~~~~~
compilation terminated.
make[6]: *** [/tmp/RHEL80-64_K3.10.0_GCC8.2.1/x86_64-native-linuxapp-gcc/fa7f4591e096456ab9618272622d34e0/dpdk/mk/internal/rte.compile-pre.mk:114: opae_intel_max10.o] Error 1
make[6]: *** Waiting for unfinished jobs....
  PMDINFO ifpga_rawdev.o.pmd.c
  CC ifpga_rawdev.o.pmd.o
  LD ifpga_rawdev.o
make[5]: *** [/tmp/RHEL80-64_K3.10.0_GCC8.2.1/x86_64-native-linuxapp-gcc/fa7f4591e096456ab9618272622d34e0/dpdk/mk/rte.subdir.mk:35: ifpga] Error 2
make[4]: *** [/tmp/RHEL80-64_K3.10.0_GCC8.2.1/x86_64-native-linuxapp-gcc/fa7f4591e096456ab9618272622d34e0/dpdk/mk/rte.subdir.mk:37: raw] Error 2
make[3]: *** [/tmp/RHEL80-64_K3.10.0_GCC8.2.1/x86_64-native-linuxapp-gcc/fa7f4591e096456ab9618272622d34e0/dpdk/mk/rte.sdkbuild.mk:46: drivers] Error 2
make[2]: *** [/tmp/RHEL80-64_K3.10.0_GCC8.2.1/x86_64-native-linuxapp-gcc/fa7f4591e096456ab9618272622d34e0/dpdk/mk/rte.sdkroot.mk:99: all] Error 2
make[1]: *** [/tmp/RHEL80-64_K3.10.0_GCC8.2.1/x86_64-native-linuxapp-gcc/fa7f4591e096456ab9618272622d34e0/dpdk/mk/rte.sdkinstall.mk:61: pre_install] Error 2
make: *** [/tmp/RHEL80-64_K3.10.0_GCC8.2.1/x86_64-native-linuxapp-gcc/fa7f4591e096456ab9618272622d34e0/dpdk/mk/rte.sdkroot.mk:77: install] Error 2


*Make Build Failed #10:
OS: FC30-64
Target: x86_64-native-linuxapp-clang
  CC opae_at24_eeprom.o
  CC opae_eth_group.o
  CC ifpga_rawdev.o
  AR librte_rawdev_skeleton.a
  INSTALL-LIB librte_rawdev_skeleton.a
/tmp/FC30-64_K4.20_Clang8.0.0/x86_64-native-linuxapp-clang/fa7f4591e096456ab9618272622d34e0/dpdk/drivers/raw/ifpga/base/opae_intel_max10.c:6:10: fatal error: 'libfdt.h' file not found
#include <libfdt.h>
         ^~~~~~~~~~
1 error generated.
make[6]: *** [/tmp/FC30-64_K4.20_Clang8.0.0/x86_64-native-linuxapp-clang/fa7f4591e096456ab9618272622d34e0/dpdk/mk/internal/rte.compile-pre.mk:114: opae_intel_max10.o] Error 1
make[6]: *** Waiting for unfinished jobs....
  PMDINFO ifpga_rawdev.o.pmd.c
  CC ifpga_rawdev.o.pmd.o
  LD ifpga_rawdev.o
make[5]: *** [/tmp/FC30-64_K4.20_Clang8.0.0/x86_64-native-linuxapp-clang/fa7f4591e096456ab9618272622d34e0/dpdk/mk/rte.subdir.mk:35: ifpga] Error 2
make[4]: *** [/tmp/FC30-64_K4.20_Clang8.0.0/x86_64-native-linuxapp-clang/fa7f4591e096456ab9618272622d34e0/dpdk/mk/rte.subdir.mk:37: raw] Error 2
make[3]: *** [/tmp/FC30-64_K4.20_Clang8.0.0/x86_64-native-linuxapp-clang/fa7f4591e096456ab9618272622d34e0/dpdk/mk/rte.sdkbuild.mk:46: drivers] Error 2
make[2]: *** [/tmp/FC30-64_K4.20_Clang8.0.0/x86_64-native-linuxapp-clang/fa7f4591e096456ab9618272622d34e0/dpdk/mk/rte.sdkroot.mk:99: all] Error 2
make[1]: *** [/tmp/FC30-64_K4.20_Clang8.0.0/x86_64-native-linuxapp-clang/fa7f4591e096456ab9618272622d34e0/dpdk/mk/rte.sdkinstall.mk:61: pre_install] Error 2
make: *** [/tmp/FC30-64_K4.20_Clang8.0.0/x86_64-native-linuxapp-clang/fa7f4591e096456ab9618272622d34e0/dpdk/mk/rte.sdkroot.mk:77: install] Error 2


*Make Build Failed #11:
OS: SUSE15-64
Target: x86_64-native-linuxapp-clang
  CC opae_intel_max10.o
  CC opae_i2c.o
  CC opae_at24_eeprom.o
  CC opae_eth_group.o
  CC ifpga_rawdev.o
/tmp/SUSE15-64_K4.12.14_Clang5.0.1/x86_64-native-linuxapp-clang/fa7f4591e096456ab9618272622d34e0/dpdk/drivers/raw/ifpga/base/opae_intel_max10.c:6:10: fatal error: 'libfdt.h' file not found
#include <libfdt.h>
         ^~~~~~~~~~
1 error generated.
make[6]: *** [/tmp/SUSE15-64_K4.12.14_Clang5.0.1/x86_64-native-linuxapp-clang/fa7f4591e096456ab9618272622d34e0/dpdk/mk/internal/rte.compile-pre.mk:114: opae_intel_max10.o] Error 1
make[6]: *** Waiting for unfinished jobs....
  PMDINFO ifpga_rawdev.o.pmd.c
  CC ifpga_rawdev.o.pmd.o
  LD ifpga_rawdev.o
make[5]: *** [/tmp/SUSE15-64_K4.12.14_Clang5.0.1/x86_64-native-linuxapp-clang/fa7f4591e096456ab9618272622d34e0/dpdk/mk/rte.subdir.mk:35: ifpga] Error 2
make[4]: *** [/tmp/SUSE15-64_K4.12.14_Clang5.0.1/x86_64-native-linuxapp-clang/fa7f4591e096456ab9618272622d34e0/dpdk/mk/rte.subdir.mk:37: raw] Error 2
make[3]: *** [/tmp/SUSE15-64_K4.12.14_Clang5.0.1/x86_64-native-linuxapp-clang/fa7f4591e096456ab9618272622d34e0/dpdk/mk/rte.sdkbuild.mk:46: drivers] Error 2
make[2]: *** [/tmp/SUSE15-64_K4.12.14_Clang5.0.1/x86_64-native-linuxapp-clang/fa7f4591e096456ab9618272622d34e0/dpdk/mk/rte.sdkroot.mk:99: all] Error 2
make[1]: *** [/tmp/SUSE15-64_K4.12.14_Clang5.0.1/x86_64-native-linuxapp-clang/fa7f4591e096456ab9618272622d34e0/dpdk/mk/rte.sdkinstall.mk:61: pre_install] Error 2
make: *** [/tmp/SUSE15-64_K4.12.14_Clang5.0.1/x86_64-native-linuxapp-clang/fa7f4591e096456ab9618272622d34e0/dpdk/mk/rte.sdkroot.mk:77: install] Error 2


*Make Build Failed #12:
OS: UB1604-64
Target: x86_64-native-linuxapp-gcc
  CC opae_intel_max10.o
  CC opae_i2c.o
  CC opae_at24_eeprom.o
  CC opae_eth_group.o
  CC ifpga_rawdev.o
/tmp/UB1604-64_K4.4.0_GCC5.4.0/x86_64-native-linuxapp-gcc/fa7f4591e096456ab9618272622d34e0/dpdk/drivers/raw/ifpga/base/opae_intel_max10.c:6:20: fatal error: libfdt.h: No such file or directory
compilation terminated.
/tmp/UB1604-64_K4.4.0_GCC5.4.0/x86_64-native-linuxapp-gcc/fa7f4591e096456ab9618272622d34e0/dpdk/mk/internal/rte.compile-pre.mk:114: recipe for target 'opae_intel_max10.o' failed
make[6]: *** [opae_intel_max10.o] Error 1
make[6]: *** Waiting for unfinished jobs....
  PMDINFO ifpga_rawdev.o.pmd.c
  CC ifpga_rawdev.o.pmd.o
  LD ifpga_rawdev.o
/tmp/UB1604-64_K4.4.0_GCC5.4.0/x86_64-native-linuxapp-gcc/fa7f4591e096456ab9618272622d34e0/dpdk/mk/rte.subdir.mk:35: recipe for target 'ifpga' failed
make[5]: *** [ifpga] Error 2
/tmp/UB1604-64_K4.4.0_GCC5.4.0/x86_64-native-linuxapp-gcc/fa7f4591e096456ab9618272622d34e0/dpdk/mk/rte.subdir.mk:35: recipe for target 'raw' failed
make[4]: *** [raw] Error 2
/tmp/UB1604-64_K4.4.0_GCC5.4.0/x86_64-native-linuxapp-gcc/fa7f4591e096456ab9618272622d34e0/dpdk/mk/rte.sdkbuild.mk:46: recipe for target 'drivers' failed
make[3]: *** [drivers] Error 2
/tmp/UB1604-64_K4.4.0_GCC5.4.0/x86_64-native-linuxapp-gcc/fa7f4591e096456ab9618272622d34e0/dpdk/mk/rte.sdkroot.mk:98: recipe for target 'all' failed
make[2]: *** [all] Error 2
/tmp/UB1604-64_K4.4.0_GCC5.4.0/x86_64-native-linuxapp-gcc/fa7f4591e096456ab9618272622d34e0/dpdk/mk/rte.sdkinstall.mk:60: recipe for target 'pre_install' failed
make[1]: *** [pre_install] Error 2
/tmp/UB1604-64_K4.4.0_GCC5.4.0/x86_64-native-linuxapp-gcc/fa7f4591e096456ab9618272622d34e0/dpdk/mk/rte.sdkroot.mk:77: recipe for target 'install' failed
make: *** [install] Error 2


*Make Build Failed #13:
OS: UB1804-64
Target: x86_64-native-linuxapp-gcc
  CC opae_at24_eeprom.o
  AR librte_rawdev_ioat.a
  INSTALL-LIB librte_rawdev_ioat.a
  CC opae_eth_group.o
  CC ifpga_rawdev.o
/tmp/UB1804-64_K4.15.0_GCC7.3.0/x86_64-native-linuxapp-gcc/fa7f4591e096456ab9618272622d34e0/dpdk/drivers/raw/ifpga/base/opae_intel_max10.c:6:10: fatal error: libfdt.h: No such file or directory
 #include <libfdt.h>
          ^~~~~~~~~~
compilation terminated.
/tmp/UB1804-64_K4.15.0_GCC7.3.0/x86_64-native-linuxapp-gcc/fa7f4591e096456ab9618272622d34e0/dpdk/mk/internal/rte.compile-pre.mk:114: recipe for target 'opae_intel_max10.o' failed
make[6]: *** [opae_intel_max10.o] Error 1
make[6]: *** Waiting for unfinished jobs....
  PMDINFO ifpga_rawdev.o.pmd.c
  CC ifpga_rawdev.o.pmd.o
  LD ifpga_rawdev.o
/tmp/UB1804-64_K4.15.0_GCC7.3.0/x86_64-native-linuxapp-gcc/fa7f4591e096456ab9618272622d34e0/dpdk/mk/rte.subdir.mk:35: recipe for target 'ifpga' failed
make[5]: *** [ifpga] Error 2
/tmp/UB1804-64_K4.15.0_GCC7.3.0/x86_64-native-linuxapp-gcc/fa7f4591e096456ab9618272622d34e0/dpdk/mk/rte.subdir.mk:35: recipe for target 'raw' failed
make[4]: *** [raw] Error 2
/tmp/UB1804-64_K4.15.0_GCC7.3.0/x86_64-native-linuxapp-gcc/fa7f4591e096456ab9618272622d34e0/dpdk/mk/rte.sdkbuild.mk:46: recipe for target 'drivers' failed
make[3]: *** [drivers] Error 2
/tmp/UB1804-64_K4.15.0_GCC7.3.0/x86_64-native-linuxapp-gcc/fa7f4591e096456ab9618272622d34e0/dpdk/mk/rte.sdkroot.mk:98: recipe for target 'all' failed
make[2]: *** [all] Error 2
/tmp/UB1804-64_K4.15.0_GCC7.3.0/x86_64-native-linuxapp-gcc/fa7f4591e096456ab9618272622d34e0/dpdk/mk/rte.sdkinstall.mk:60: recipe for target 'pre_install' failed
make[1]: *** [pre_install] Error 2
/tmp/UB1804-64_K4.15.0_GCC7.3.0/x86_64-native-linuxapp-gcc/fa7f4591e096456ab9618272622d34e0/dpdk/mk/rte.sdkroot.mk:77: recipe for target 'install' failed
make: *** [install] Error 2


*Make Build Failed #14:
OS: FreeBSD12-64
Target: x86_64-native-bsdapp-gcc+shared
ipn3ke_ethdev.o: In function `ipn3ke_vswitch_probe':
ipn3ke_ethdev.c:(.text+0x659): undefined reference to `ifpga_rawdev_get'
ipn3ke_representor.o: In function `ipn3ke_rpst_init':
ipn3ke_representor.c:(.text+0x4482): undefined reference to `rte_pmd_i40e_set_switch_dev'
collect2: error: ld returned 1 exit status
gmake[6]: *** [/tmp/FreeBSD12-64_K19.02_GCC7.3.0/x86_64-native-bsdapp-gcc+shared/fa7f4591e096456ab9618272622d34e0/dpdk/mk/rte.lib.mk:102: librte_pmd_ipn3ke.so.1.1] Error 1
gmake[5]: *** [/tmp/FreeBSD12-64_K19.02_GCC7.3.0/x86_64-native-bsdapp-gcc+shared/fa7f4591e096456ab9618272622d34e0/dpdk/mk/rte.subdir.mk:35: ipn3ke] Error 2
gmake[5]: *** Waiting for unfinished jobs....
  CC ice_nvm.o
  LD librte_pmd_iavf.so.1.1
  INSTALL-LIB librte_pmd_iavf.so.1.1
  CC igb_pf.o
--
  LD ixgbe_ethdev.o
  LD librte_pmd_bnxt.so.2.1
  INSTALL-LIB librte_pmd_bnxt.so.2.1
  LD librte_pmd_ixgbe.so.2.1
  INSTALL-LIB librte_pmd_ixgbe.so.2.1
gmake[4]: *** [/tmp/FreeBSD12-64_K19.02_GCC7.3.0/x86_64-native-bsdapp-gcc+shared/fa7f4591e096456ab9618272622d34e0/dpdk/mk/rte.subdir.mk:35: net] Error 2
gmake[3]: *** [/tmp/FreeBSD12-64_K19.02_GCC7.3.0/x86_64-native-bsdapp-gcc+shared/fa7f4591e096456ab9618272622d34e0/dpdk/mk/rte.sdkbuild.mk:46: drivers] Error 2
gmake[2]: *** [/tmp/FreeBSD12-64_K19.02_GCC7.3.0/x86_64-native-bsdapp-gcc+shared/fa7f4591e096456ab9618272622d34e0/dpdk/mk/rte.sdkroot.mk:99: all] Error 2
gmake[1]: *** [/tmp/FreeBSD12-64_K19.02_GCC7.3.0/x86_64-native-bsdapp-gcc+shared/fa7f4591e096456ab9618272622d34e0/dpdk/mk/rte.sdkinstall.mk:61: pre_install] Error 2
gmake: *** [/tmp/FreeBSD12-64_K19.02_GCC7.3.0/x86_64-native-bsdapp-gcc+shared/fa7f4591e096456ab9618272622d34e0/dpdk/mk/rte.sdkroot.mk:77: install] Error 2


*Make Build Failed #15:
OS: CENTOS76-64
Target: x86_64-native-linuxapp-clang
  CC opae_intel_max10.o
  CC opae_i2c.o
  CC opae_at24_eeprom.o
  CC opae_eth_group.o
  CC ifpga_rawdev.o
/tmp/CENTOS76-64_K3.10.0_Clang3.4.2/x86_64-native-linuxapp-clang/fa7f4591e096456ab9618272622d34e0/dpdk/drivers/raw/ifpga/base/opae_intel_max10.c:6:10: fatal error: 'libfdt.h' file not found
#include <libfdt.h>
         ^
1 error generated.
make[6]: *** [opae_intel_max10.o] Error 1
make[6]: *** Waiting for unfinished jobs....
  PMDINFO ifpga_rawdev.o.pmd.c
  CC ifpga_rawdev.o.pmd.o
  LD ifpga_rawdev.o
make[5]: *** [ifpga] Error 2
make[4]: *** [raw] Error 2
make[3]: *** [drivers] Error 2
make[2]: *** [all] Error 2
make[1]: *** [pre_install] Error 2
make: *** [install] Error 2


*Make Build Failed #16:
OS: CENTOS76-64
Target: x86_64-native-linuxapp-gcc+debug
  INSTALL-LIB librte_rawdev_ntb.a
  INSTALL-LIB librte_rawdev_dpaa2_qdma.a
  CC opae_spi_transaction.o
  CC opae_intel_max10.o
  CC opae_i2c.o
/tmp/CENTOS76-64_K3.10.0_GCC4.8.5/x86_64-native-linuxapp-gcc+debug/fa7f4591e096456ab9618272622d34e0/dpdk/drivers/raw/ifpga/base/opae_intel_max10.c:6:20: fatal error: libfdt.h: No such file or directory
 #include <libfdt.h>
                    ^
compilation terminated.
  CC opae_at24_eeprom.o
  CC opae_eth_group.o
  CC ifpga_rawdev.o
  AR librte_rawdev_ioat.a
  INSTALL-LIB librte_rawdev_ioat.a
make[6]: *** [opae_intel_max10.o] Error 1
make[6]: *** Waiting for unfinished jobs....
  PMDINFO ifpga_rawdev.o.pmd.c
  CC ifpga_rawdev.o.pmd.o
  LD ifpga_rawdev.o
make[5]: *** [ifpga] Error 2
make[4]: *** [raw] Error 2
make[3]: *** [drivers] Error 2
make[2]: *** [all] Error 2
make[1]: *** [pre_install] Error 2
make: *** [install] Error 2


*Make Build Failed #17:
OS: CENTOS76-64
Target: x86_64-native-linuxapp-gcc
  AR librte_rawdev_skeleton.a
  CC opae_i2c.o
  INSTALL-LIB librte_rawdev_skeleton.a
  CC opae_at24_eeprom.o
  CC opae_eth_group.o
/tmp/CENTOS76-64_K3.10.0_GCC4.8.5/x86_64-native-linuxapp-gcc/fa7f4591e096456ab9618272622d34e0/dpdk/drivers/raw/ifpga/base/opae_intel_max10.c:6:20: fatal error: libfdt.h: No such file or directory
 #include <libfdt.h>
                    ^
compilation terminated.
  CC ifpga_rawdev.o
make[6]: *** [opae_intel_max10.o] Error 1
make[6]: *** Waiting for unfinished jobs....
  PMDINFO ifpga_rawdev.o.pmd.c
  CC ifpga_rawdev.o.pmd.o
  LD ifpga_rawdev.o
make[5]: *** [ifpga] Error 2
make[4]: *** [raw] Error 2
make[3]: *** [drivers] Error 2
make[2]: *** [all] Error 2
make[1]: *** [pre_install] Error 2
make: *** [install] Error 2


*Make Build Failed #18:
OS: FreeBSD12-64
Target: x86_64-native-bsdapp-gcc+debug
  LD testacl
  CC init.o
/tmp/FreeBSD12-64_K19.02_GCC7.3.0/x86_64-native-bsdapp-gcc+debug/fa7f4591e096456ab9618272622d34e0/dpdk/x86_64-native-bsdapp-gcc/lib/librte_pmd_ipn3ke.a(ipn3ke_ethdev.o): In function `ipn3ke_vswitch_probe':
ipn3ke_ethdev.c:(.text+0x613): undefined reference to `ifpga_rawdev_get'
collect2: error: ld returned 1 exit status
gmake[5]: *** [/tmp/FreeBSD12-64_K19.02_GCC7.3.0/x86_64-native-bsdapp-gcc+debug/fa7f4591e096456ab9618272622d34e0/dpdk/mk/rte.app.mk:428: cmdline_test] Error 1
gmake[4]: *** [/tmp/FreeBSD12-64_K19.02_GCC7.3.0/x86_64-native-bsdapp-gcc+debug/fa7f4591e096456ab9618272622d34e0/dpdk/mk/rte.subdir.mk:37: test-cmdline] Error 2
gmake[4]: *** Waiting for unfinished jobs....
  CC test_bbdev_perf.o
  CC evt_test.o
/tmp/FreeBSD12-64_K19.02_GCC7.3.0/x86_64-native-bsdapp-gcc+debug/fa7f4591e096456ab9618272622d34e0/dpdk/x86_64-native-bsdapp-gcc/lib/librte_pmd_ipn3ke.a(ipn3ke_ethdev.o): In function `ipn3ke_vswitch_probe':
ipn3ke_ethdev.c:(.text+0x613): undefined reference to `ifpga_rawdev_get'
collect2: error: ld returned 1 exit status
gmake[5]: *** [/tmp/FreeBSD12-64_K19.02_GCC7.3.0/x86_64-native-bsdapp-gcc+debug/fa7f4591e096456ab9618272622d34e0/dpdk/mk/rte.app.mk:428: dpdk-pdump] Error 1
gmake[4]: *** [/tmp/FreeBSD12-64_K19.02_GCC7.3.0/x86_64-native-bsdapp-gcc+debug/fa7f4591e096456ab9618272622d34e0/dpdk/mk/rte.subdir.mk:37: pdump] Error 2
  CC test.o
  CC comp_perf_test_verify.o
  CC runtime.o
  CC cperf_ops.o
  CC parameters.o
  CC cperf_options_parsing.o
/tmp/FreeBSD12-64_K19.02_GCC7.3.0/x86_64-native-bsdapp-gcc+debug/fa7f4591e096456ab9618272622d34e0/dpdk/x86_64-native-bsdapp-gcc/lib/librte_pmd_ipn3ke.a(ipn3ke_ethdev.o): In function `ipn3ke_vswitch_probe':
ipn3ke_ethdev.c:(.text+0x613): undefined reference to `ifpga_rawdev_get'
collect2: error: ld returned 1 exit status
gmake[5]: *** [/tmp/FreeBSD12-64_K19.02_GCC7.3.0/x86_64-native-bsdapp-gcc+debug/fa7f4591e096456ab9618272622d34e0/dpdk/mk/rte.app.mk:428: testacl] Error 1
gmake[4]: *** [/tmp/FreeBSD12-64_K19.02_GCC7.3.0/x86_64-native-bsdapp-gcc+debug/fa7f4591e096456ab9618272622d34e0/dpdk/mk/rte.subdir.mk:37: test-acl] Error 2
  CC parser.o
  CC resource.o
  CC pipeline_stub.o
  CC comp_perf_test_benchmark.o
  CC test_bbdev_vector.o
--
  CC test_atomic.o
  CC pipeline_lpm_ipv6.o
/tmp/FreeBSD12-64_K19.02_GCC7.3.0/x86_64-native-bsdapp-gcc+debug/fa7f4591e096456ab9618272622d34e0/dpdk/x86_64-native-bsdapp-gcc/lib/librte_pmd_ipn3ke.a(ipn3ke_ethdev.o): In function `ipn3ke_vswitch_probe':
ipn3ke_ethdev.c:(.text+0x613): undefined reference to `ifpga_rawdev_get'
collect2: error: ld returned 1 exit status
gmake[5]: *** [/tmp/FreeBSD12-64_K19.02_GCC7.3.0/x86_64-native-bsdapp-gcc+debug/fa7f4591e096456ab9618272622d34e0/dpdk/mk/rte.app.mk:428: dpdk-test-compress-perf] Error 1
gmake[4]: *** [/tmp/FreeBSD12-64_K19.02_GCC7.3.0/x86_64-native-bsdapp-gcc+debug/fa7f4591e096456ab9618272622d34e0/dpdk/mk/rte.subdir.mk:37: test-compress-perf] Error 2
  CC cperf_test_latency.o
  CC test_order_common.o
  CC cperf_test_pmd_cyclecount.o
  CC pipeline_acl.o
  CC test_barrier.o
--
  CC iofwd.o
  CC test_mcslock.o
/tmp/FreeBSD12-64_K19.02_GCC7.3.0/x86_64-native-bsdapp-gcc+debug/fa7f4591e096456ab9618272622d34e0/dpdk/x86_64-native-bsdapp-gcc/lib/librte_pmd_ipn3ke.a(ipn3ke_ethdev.o): In function `ipn3ke_vswitch_probe':
ipn3ke_ethdev.c:(.text+0x613): undefined reference to `ifpga_rawdev_get'
collect2: error: ld returned 1 exit status
gmake[5]: *** [/tmp/FreeBSD12-64_K19.02_GCC7.3.0/x86_64-native-bsdapp-gcc+debug/fa7f4591e096456ab9618272622d34e0/dpdk/mk/rte.app.mk:428: testpipeline] Error 1
gmake[4]: *** [/tmp/FreeBSD12-64_K19.02_GCC7.3.0/x86_64-native-bsdapp-gcc+debug/fa7f4591e096456ab9618272622d34e0/dpdk/mk/rte.subdir.mk:37: test-pipeline] Error 2
  CC test_spinlock.o
  CC test_perf_atq.o
  LD dpdk-test-crypto-perf
  CC test_ticketlock.o
  CC macfwd.o
  CC test_memzone.o
  CC test_memory.o
/tmp/FreeBSD12-64_K19.02_GCC7.3.0/x86_64-native-bsdapp-gcc+debug/fa7f4591e096456ab9618272622d34e0/dpdk/x86_64-native-bsdapp-gcc/lib/librte_pmd_ipn3ke.a(ipn3ke_ethdev.o): In function `ipn3ke_vswitch_probe':
ipn3ke_ethdev.c:(.text+0x613): undefined reference to `ifpga_rawdev_get'
collect2: error: ld returned 1 exit status
gmake[5]: *** [/tmp/FreeBSD12-64_K19.02_GCC7.3.0/x86_64-native-bsdapp-gcc+debug/fa7f4591e096456ab9618272622d34e0/dpdk/mk/rte.app.mk:428: dpdk-test-crypto-perf] Error 1
gmake[4]: *** [/tmp/FreeBSD12-64_K19.02_GCC7.3.0/x86_64-native-bsdapp-gcc+debug/fa7f4591e096456ab9618272622d34e0/dpdk/mk/rte.subdir.mk:37: test-crypto-perf] Error 2
  CC macswap.o
  CC flowgen.o
  CC test_pipeline_common.o
  CC rxonly.o
  CC test_bitmap.o
--
  CC test_external_mem.o
  CC test_rand_perf.o
/tmp/FreeBSD12-64_K19.02_GCC7.3.0/x86_64-native-bsdapp-gcc+debug/fa7f4591e096456ab9618272622d34e0/dpdk/x86_64-native-bsdapp-gcc/lib/librte_pmd_ipn3ke.a(ipn3ke_ethdev.o): In function `ipn3ke_vswitch_probe':
ipn3ke_ethdev.c:(.text+0x613): undefined reference to `ifpga_rawdev_get'
collect2: error: ld returned 1 exit status
gmake[5]: *** [/tmp/FreeBSD12-64_K19.02_GCC7.3.0/x86_64-native-bsdapp-gcc+debug/fa7f4591e096456ab9618272622d34e0/dpdk/mk/rte.app.mk:428: testbbdev] Error 1
gmake[4]: *** [/tmp/FreeBSD12-64_K19.02_GCC7.3.0/x86_64-native-bsdapp-gcc+debug/fa7f4591e096456ab9618272622d34e0/dpdk/mk/rte.subdir.mk:37: test-bbdev] Error 2
  CC test_ring_perf.o
  CC test_pmd_perf.o
  CC bpf_cmd.o
  CC noisy_vnf.o
  CC util.o
--
/tmp/FreeBSD12  CC test_flow_classify.o
-64_K19.02_GCC7.3.0/x86_64-native  CC test_rwlock.o
-bsdapp-gcc+debug/fa7f4591e096456ab9618272622d34e0/dpdk/x86_64-native-bsdapp-gcc/lib/librte_pmd_ipn3ke.a(ipn3ke_ethdev.o): In function `ipn3ke_vswitch_probe':
ipn3ke_ethdev.c:(.text+0x613): undefined reference to `ifpga_rawdev_get'
collect2: error: ld returned 1 exit status
gmake[5]: *** [/tmp/FreeBSD12-64_K19.02_GCC7.3.0/x86_64-native-bsdapp-gcc+debug/fa7f4591e096456ab9618272622d34e0/dpdk/mk/rte.app.mk:428: dpdk-test-eventdev] Error 1
gmake[4]: *** [/tmp/FreeBSD12-64_K19.02_GCC7.3.0/x86_64-native-bsdapp-gcc+debug/fa7f4591e096456ab9618272622d34e0/dpdk/mk/rte.subdir.mk:37: test-eventdev] Error 2
  CC test_stack.o
  LD testpmd
  CC test_stack_perf.o
  CC test_timer.o
  CC test_timer_perf.o
--
  CC test_mbuf.o
  CC test_logs.o
/tmp/FreeBSD12-64_K19.02_GCC7.3.0/x86_64-native-bsdapp-gcc+debug/fa7f4591e096456ab9618272622d34e0/dpdk/x86_64-native-bsdapp-gcc/lib/librte_pmd_ipn3ke.a(ipn3ke_ethdev.o): In function `ipn3ke_vswitch_probe':
ipn3ke_ethdev.c:(.text+0x613): undefined reference to `ifpga_rawdev_get'
collect2: error: ld returned 1 exit status
gmake[5]: *** [/tmp/FreeBSD12-64_K19.02_GCC7.3.0/x86_64-native-bsdapp-gcc+debug/fa7f4591e096456ab9618272622d34e0/dpdk/mk/rte.app.mk:428: testpmd] Error 1
gmake[4]: *** [/tmp/FreeBSD12-64_K19.02_GCC7.3.0/x86_64-native-bsdapp-gcc+debug/fa7f4591e096456ab9618272622d34e0/dpdk/mk/rte.subdir.mk:37: test-pmd] Error 2
  CC test_memcpy_perf.o
  CC test_member.o
  CC test_memcpy.o
  CC test_member_perf.o
  CC test_efd.o
--
  MKRES test_resource_c.res.o
  LD test
/tmp/FreeBSD12-64_K19.02_GCC7.3.0/x86_64-native-bsdapp-gcc+debug/fa7f4591e096456ab9618272622d34e0/dpdk/x86_64-native-bsdapp-gcc/lib/librte_pmd_ipn3ke.a(ipn3ke_ethdev.o): In function `ipn3ke_vswitch_probe':
ipn3ke_ethdev.c:(.text+0x613): undefined reference to `ifpga_rawdev_get'
collect2: error: ld returned 1 exit status
gmake[5]: *** [/tmp/FreeBSD12-64_K19.02_GCC7.3.0/x86_64-native-bsdapp-gcc+debug/fa7f4591e096456ab9618272622d34e0/dpdk/mk/rte.app.mk:428: test] Error 1
gmake[4]: *** [/tmp/FreeBSD12-64_K19.02_GCC7.3.0/x86_64-native-bsdapp-gcc+debug/fa7f4591e096456ab9618272622d34e0/dpdk/mk/rte.subdir.mk:37: test] Error 2
gmake[3]: *** [/tmp/FreeBSD12-64_K19.02_GCC7.3.0/x86_64-native-bsdapp-gcc+debug/fa7f4591e096456ab9618272622d34e0/dpdk/mk/rte.sdkbuild.mk:48: app] Error 2
gmake[2]: *** [/tmp/FreeBSD12-64_K19.02_GCC7.3.0/x86_64-native-bsdapp-gcc+debug/fa7f4591e096456ab9618272622d34e0/dpdk/mk/rte.sdkroot.mk:99: all] Error 2
gmake[1]: *** [/tmp/FreeBSD12-64_K19.02_GCC7.3.0/x86_64-native-bsdapp-gcc+debug/fa7f4591e096456ab9618272622d34e0/dpdk/mk/rte.sdkinstall.mk:61: pre_install] Error 2
gmake: *** [/tmp/FreeBSD12-64_K19.02_GCC7.3.0/x86_64-native-bsdapp-gcc+debug/fa7f4591e096456ab9618272622d34e0/dpdk/mk/rte.sdkroot.mk:77: install] Error 2


*Make Build Failed #19:
OS: CENTOS76-64
Target: x86_64-native-linuxapp-gcc+shared
ipn3ke_ethdev.o: In function `ipn3ke_vswitch_probe':
ipn3ke_ethdev.c:(.text+0x65b): undefined reference to `ifpga_rawdev_get'
ipn3ke_representor.o: In function `ipn3ke_rpst_init':
ipn3ke_representor.c:(.text+0x4aa2): undefined reference to `rte_pmd_i40e_set_switch_dev'
collect2: error: ld returned 1 exit status
make[6]: *** [librte_pmd_ipn3ke.so.1.1] Error 1
make[5]: *** [ipn3ke] Error 2
make[5]: *** Waiting for unfinished jobs....
  CC ice_nvm.o
  PMDINFO lio_ethdev.o.pmd.c
  CC lio_ethdev.o.pmd.o
  LD librte_pmd_iavf.so.1.1
--
  PMDINFO ixgbe_ethdev.o.pmd.c
  CC ixgbe_ethdev.o.pmd.o
  LD ixgbe_ethdev.o
  LD librte_pmd_ixgbe.so.2.1
  INSTALL-LIB librte_pmd_ixgbe.so.2.1
make[4]: *** [net] Error 2
make[3]: *** [drivers] Error 2
make[2]: *** [all] Error 2
make[1]: *** [pre_install] Error 2
make: *** [install] Error 2


*Make Build Failed #20:
OS: FreeBSD12-64
Target: x86_64-native-bsdapp-clang
Binary file /root/regression_share/results/build/FreeBSD12-64_K19.02_Clang6.0.1/x86_64-native-bsdapp-clang/fa7f4591e096456ab9618272622d34e0/Build.log matches


*Make Build Failed #21:
OS: CENTOS76-64
Target: x86_64-native-linuxapp-icc
/tmp/CENTOS76-64_K3.10.0_ICC19.0.0/x86_64-native-linuxapp-icc/fa7f4591e096456ab9618272622d34e0/dpdk/drivers/raw/ifpga/base/opae_intel_max10.c(6): catastrophic error: cannot open source file "libfdt.h"
  #include <libfdt.h>
                     ^

compilation aborted for /tmp/CENTOS76-64_K3.10.0_ICC19.0.0/x86_64-native-linuxapp-icc/fa7f4591e096456ab9618272622d34e0/dpdk/drivers/raw/ifpga/base/opae_intel_max10.c (code 4)
make[6]: *** [opae_intel_max10.o] Error 4
make[6]: *** Waiting for unfinished jobs....
  PMDINFO ifpga_rawdev.o.pmd.c
  CC ifpga_rawdev.o.pmd.o
  LD ifpga_rawdev.o
make[5]: *** [ifpga] Error 2
make[4]: *** [raw] Error 2
make[3]: *** [drivers] Error 2
make[2]: *** [all] Error 2
make[1]: *** [pre_install] Error 2
make: *** [install] Error 2


*Make Build Failed #22:
OS: FreeBSD12-64
Target: x86_64-native-bsdapp-gcc
  CC config.o
  CC commands.o
/tmp/FreeBSD12-64_K19.02_GCC7.3.0/x86_64-native-bsdapp-gcc/fa7f4591e096456ab9618272622d34e0/dpdk/x86_64-native-bsdapp-gcc/lib/librte_pmd_ipn3ke.a(ipn3ke_ethdev.o): In function `ipn3ke_vswitch_probe':
ipn3ke_ethdev.c:(.text+0x613): undefined reference to `ifpga_rawdev_get'
collect2: error: ld returned 1 exit status
gmake[5]: *** [/tmp/FreeBSD12-64_K19.02_GCC7.3.0/x86_64-native-bsdapp-gcc/fa7f4591e096456ab9618272622d34e0/dpdk/mk/rte.app.mk:428: cmdline_test] Error 1
gmake[4]: *** [/tmp/FreeBSD12-64_K19.02_GCC7.3.0/x86_64-native-bsdapp-gcc/fa7f4591e096456ab9618272622d34e0/dpdk/mk/rte.subdir.mk:37: test-cmdline] Error 2
gmake[4]: *** Waiting for unfinished jobs....
  CC test_bbdev_perf.o
  LD testacl
  CC comp_perf_options_parse.o
  CC evt_options.o
  CC cperf_ops.o
/tmp/FreeBSD12-64_K19.02_GCC7.3.0/x86_64-native-bsdapp-gcc/fa7f4591e096456ab9618272622d34e0/dpdk/x86_64-native-bsdapp-gcc/lib/librte_pmd_ipn3ke.a(ipn3ke_ethdev.o): In function `ipn3ke_vswitch_probe':
ipn3ke_ethdev.c:(.text+0x613): undefined reference to `ifpga_rawdev_get'
collect2: error: ld returned 1 exit status
gmake[5]: *** [/tmp/FreeBSD12-64_K19.02_GCC7.3.0/x86_64-native-bsdapp-gcc/fa7f4591e096456ab9618272622d34e0/dpdk/mk/rte.app.mk:428: dpdk-pdump] Error 1
gmake[4]: *** [/tmp/FreeBSD12-64_K19.02_GCC7.3.0/x86_64-native-bsdapp-gcc/fa7f4591e096456ab9618272622d34e0/dpdk/mk/rte.subdir.mk:37: pdump] Error 2
  CC test_bbdev_vector.o
  CC init.o
  CC test.o
/tmp  CC comp_perf_test_verify.o
/FreeBSD12-64_K19.02_GCC7.3.0/x86_64-native-bsdapp-gcc/fa7f4591e096456ab9618272622d34e0/dpdk/x86_64-native-bsdapp-gcc/lib/librte_pmd_ipn3ke.a(ipn3ke_ethdev.o): In function `ipn3ke_vswitch_probe':
ipn3ke_ethdev.c:(.text+0x613): undefined reference to `ifpga_rawdev_get'
collect2: error: ld returned 1 exit status
gmake[5]: *** [/tmp/FreeBSD12-64_K19.02_GCC7.3.0/x86_64-native-bsdapp-gcc/fa7f4591e096456ab9618272622d34e0/dpdk/mk/rte.app.mk:428: testacl] Error 1
gmake[4]: *** [/tmp/FreeBSD12-64_K19.02_GCC7.3.0/x86_64-native-bsdapp-gcc/fa7f4591e096456ab9618272622d34e0/dpdk/mk/rte.subdir.mk:37: test-acl] Error 2
  CC cperf_options_parsing.o
  CC resource.o
  CC parameters.o
  CC evt_test.o
  CC test_resource.o
--
  CC cmdline_mtr.o
  CC pipeline_lpm_ipv6.o
/tmp/FreeBSD12-64_K19.02_GCC7.3.0/x86_64-native-bsdapp-gcc/fa7f4591e096456ab9618272622d34e0/dpdk/x86_64-native-bsdapp-gcc/lib/librte_pmd_ipn3ke.a(ipn3ke_ethdev.o): In function `ipn3ke_vswitch_probe':
ipn3ke_ethdev.c:(.text+0x613): undefined reference to `ifpga_rawdev_get'
collect2: error: ld returned 1 exit status
gmake[5]: *** [/tmp/FreeBSD12-64_K19.02_GCC7.3.0/x86_64-native-bsdapp-gcc/fa7f4591e096456ab9618272622d34e0/dpdk/mk/rte.app.mk:428: dpdk-test-compress-perf] Error 1
gmake[4]: *** [/tmp/FreeBSD12-64_K19.02_GCC7.3.0/x86_64-native-bsdapp-gcc/fa7f4591e096456ab9618272622d34e0/dpdk/mk/rte.subdir.mk:37: test-compress-perf] Error 2
  CC test_perf_common.o
  CC pipeline_acl.o
  CC test_cycles.o
  CC cperf_test_latency.o
  CC cperf_test_pmd_cyclecount.o
--
  CC cperf_test_common.o
  CC test_perf_atq.o
/tmp/FreeBSD12-64_K19.02_GCC7.3.0/x86_64-native-bsdapp-gcc/fa7f4591e096456ab9618272622d34e0/dpdk/x86_64-native-bsdapp-gcc/lib/librte_pmd_ipn3ke.a(ipn3ke_ethdev.o): In function `ipn3ke_vswitch_probe':
ipn3ke_ethdev.c:(.text+0x613): undefined reference to `ifpga_rawdev_get'
collect2: error: ld returned 1 exit status
gmake[5]: *** [/tmp/FreeBSD12-64_K19.02_GCC7.3.0/x86_64-native-bsdapp-gcc/fa7f4591e096456ab9618272622d34e0/dpdk/mk/rte.app.mk:428: testpipeline] Error 1
gmake[4]: *** [/tmp/FreeBSD12-64_K19.02_GCC7.3.0/x86_64-native-bsdapp-gcc/fa7f4591e096456ab9618272622d34e0/dpdk/mk/rte.subdir.mk:37: test-pipeline] Error 2
  CC test_pipeline_common.o
  CC test_memory.o
  LD testbbdev
  CC test_pipeline_queue.o
  CC test_memzone.o
--
  CC test_pipeline_atq.o
  CC test_bitmap.o
/tmp/FreeBSD12-64_K19.02_GCC7.3.0/x86_64-native-bsdapp-gcc/fa7f4591e096456ab9618272622d34e0/dpdk/x86_64-native-bsdapp-gcc/lib/librte_pmd_ipn3ke.a(ipn3ke_ethdev.o): In function `ipn3ke_vswitch_probe':
ipn3ke_ethdev.c:(.text+0x613): undefined reference to `ifpga_rawdev_get'
collect2: error: ld returned 1 exit status
gmake[5]: *** [/tmp/FreeBSD12-64_K19.02_GCC7.3.0/x86_64-native-bsdapp-gcc/fa7f4591e096456ab9618272622d34e0/dpdk/mk/rte.app.mk:428: testbbdev] Error 1
gmake[4]: *** [/tmp/FreeBSD12-64_K19.02_GCC7.3.0/x86_64-native-bsdapp-gcc/fa7f4591e096456ab9618272622d34e0/dpdk/mk/rte.subdir.mk:37: test-bbdev] Error 2
  CC test_reciprocal_division.o
  LD dpdk-test-crypto-perf
  CC macfwd.o
  CC test_reciprocal_division_perf.o
  CC test_fbarray.o
--
  CC csumonly.o
  CC icmpecho.o
/tmp/FreeBSD12-64_K19.02_GCC7.3.0/x86_64-native-bsdapp-gcc/fa7f4591e096456ab9618272622d34e0/dpdk/x86_64-native-bsdapp-gcc/lib/librte_pmd_ipn3ke.a(ipn3ke_ethdev.o): In function `ipn3ke_vswitch_probe':
ipn3ke_ethdev.c:(.text+0x613): undefined reference to `ifpga_rawdev_get'
collect2: error: ld returned 1 exit status
gmake[5]: *** [/tmp/FreeBSD12-64_K19.02_GCC7.3.0/x86_64-native-bsdapp-gcc/fa7f4591e096456ab9618272622d34e0/dpdk/mk/rte.app.mk:428: dpdk-test-crypto-perf] Error 1
gmake[4]: *** [/tmp/FreeBSD12-64_K19.02_GCC7.3.0/x86_64-native-bsdapp-gcc/fa7f4591e096456ab9618272622d34e0/dpdk/mk/rte.subdir.mk:37: test-crypto-perf] Error 2
  CC noisy_vnf.o
  CC test_ring_perf.o
  CC test_pmd_perf.o
/tmp/FreeBSD12-64_K19.02_GCC7.3.0/x86_64-native-bsdapp-gcc/fa7f4591e096456ab9618272622d34e0/dpdk/x86_64-native-bsdapp-gcc/lib/librte_pmd_ipn3ke.a(ipn3ke_ethdev.o): In function `ipn3ke_vswitch_probe':
ipn3ke_ethdev.c:(.text+0x613): undefined reference to `ifpga_rawdev_get'
collect2: error: ld returned 1 exit status
gmake[5]: *** [/tmp/FreeBSD12-64_K19.02_GCC7.3.0/x86_64-native-bsdapp-gcc/fa7f4591e096456ab9618272622d34e0/dpdk/mk/rte.app.mk:428: dpdk-test-eventdev] Error 1
gmake[4]: *** [/tmp/FreeBSD12-64_K19.02_GCC7.3.0/x86_64-native-bsdapp-gcc/fa7f4591e096456ab9618272622d34e0/dpdk/mk/rte.subdir.mk:37: test-eventdev] Error 2
  CC bpf_cmd.o
  CC test_table.o
  CC test_table_pipeline.o
  CC test_table_tables.o
  CC test_table_ports.o
--
  CC test_memcpy_perf.o
  CC test_member.o
/tmp/FreeBSD12-64_K19.02_GCC7.3.0/x86_64-native-bsdapp-gcc/fa7f4591e096456ab9618272622d34e0/dpdk/x86_64-native-bsdapp-gcc/lib/librte_pmd_ipn3ke.a(ipn3ke_ethdev.o): In function `ipn3ke_vswitch_probe':
ipn3ke_ethdev.c:(.text+0x613): undefined reference to `ifpga_rawdev_get'
collect2: error: ld returned 1 exit status
gmake[5]: *** [/tmp/FreeBSD12-64_K19.02_GCC7.3.0/x86_64-native-bsdapp-gcc/fa7f4591e096456ab9618272622d34e0/dpdk/mk/rte.app.mk:428: testpmd] Error 1
gmake[4]: *** [/tmp/FreeBSD12-64_K19.02_GCC7.3.0/x86_64-native-bsdapp-gcc/fa7f4591e096456ab9618272622d34e0/dpdk/mk/rte.subdir.mk:37: test-pmd] Error 2
  CC test_member_perf.o
  CC test_efd.o
  CC test_efd_perf.o
  CC test_hash.o
  CC test_thash.o
--
  CC test_ipsec.o
  LD test
/tmp/FreeBSD12-64_K19.02_GCC7.3.0/x86_64-native-bsdapp-gcc/fa7f4591e096456ab9618272622d34e0/dpdk/x86_64-native-bsdapp-gcc/lib/librte_pmd_ipn3ke.a(ipn3ke_ethdev.o): In function `ipn3ke_vswitch_probe':
ipn3ke_ethdev.c:(.text+0x613): undefined reference to `ifpga_rawdev_get'
collect2: error: ld returned 1 exit status
gmake[5]: *** [/tmp/FreeBSD12-64_K19.02_GCC7.3.0/x86_64-native-bsdapp-gcc/fa7f4591e096456ab9618272622d34e0/dpdk/mk/rte.app.mk:428: test] Error 1
gmake[4]: *** [/tmp/FreeBSD12-64_K19.02_GCC7.3.0/x86_64-native-bsdapp-gcc/fa7f4591e096456ab9618272622d34e0/dpdk/mk/rte.subdir.mk:37: test] Error 2
gmake[3]: *** [/tmp/FreeBSD12-64_K19.02_GCC7.3.0/x86_64-native-bsdapp-gcc/fa7f4591e096456ab9618272622d34e0/dpdk/mk/rte.sdkbuild.mk:48: app] Error 2
gmake[2]: *** [/tmp/FreeBSD12-64_K19.02_GCC7.3.0/x86_64-native-bsdapp-gcc/fa7f4591e096456ab9618272622d34e0/dpdk/mk/rte.sdkroot.mk:99: all] Error 2
gmake[1]: *** [/tmp/FreeBSD12-64_K19.02_GCC7.3.0/x86_64-native-bsdapp-gcc/fa7f4591e096456ab9618272622d34e0/dpdk/mk/rte.sdkinstall.mk:61: pre_install] Error 2
gmake: *** [/tmp/FreeBSD12-64_K19.02_GCC7.3.0/x86_64-native-bsdapp-gcc/fa7f4591e096456ab9618272622d34e0/dpdk/mk/rte.sdkroot.mk:77: install] Error 2

*Meson Build Failed #1:
OS: FC30-64
Target:build-gcc-static
FAILED: drivers/a715181@@tmp_rte_pmd_ipn3ke at sta/net_ipn3ke_ipn3ke_ethdev.c.o 
gcc -Idrivers/a715181@@tmp_rte_pmd_ipn3ke at sta -Idrivers -I../drivers -Idrivers/net/ipn3ke -I../drivers/net/ipn3ke -Ilib/librte_ethdev -I../lib/librte_ethdev -I. -I../ -Iconfig -I../config -Ilib/librte_eal/common/include -I../lib/librte_eal/common/include -I../lib/librte_eal/linux/eal/include -Ilib/librte_eal/common -I../lib/librte_eal/common -Ilib/librte_eal/common/include/arch/x86 -I../lib/librte_eal/common/include/arch/x86 -Ilib/librte_eal -I../lib/librte_eal -Ilib/librte_kvargs -I../lib/librte_kvargs -Ilib/librte_net -I../lib/librte_net -Ilib/librte_mbuf -I../lib/librte_mbuf -Ilib/librte_mempool -I../lib/librte_mempool -Ilib/librte_ring -I../lib/librte_ring -Ilib/librte_meter -I../lib/librte_meter -Idrivers/bus/pci -I../drivers/bus/pci -I../drivers/bus/pci/linux -Ilib/librte_pci -I../lib/librte_pci -Idrivers/bus/vdev -I../drivers/bus/vdev -Idrivers/bus/ifpga -I../drivers/bus/ifpga -Ilib/librte_rawdev -I../lib/librte_rawdev -Ilib/librte_sched -I../lib/librte_sched -fdiagnostics-color=always -pipe -D_FILE_OFFSET_BITS=64 -Wall -Winvalid-pch -Werror -O3 -include rte_config.h -Wunused-parameter -Wsign-compare -Wcast-qual -Wno-address-of-packed-member -D_GNU_SOURCE -fPIC -march=native -mno-avx512f -Wno-format-truncation -DALLOW_EXPERIMENTAL_API -MD -MQ 'drivers/a715181@@tmp_rte_pmd_ipn3ke at sta/net_ipn3ke_ipn3ke_ethdev.c.o' -MF 'drivers/a715181@@tmp_rte_pmd_ipn3ke at sta/net_ipn3ke_ipn3ke_ethdev.c.o.d' -o 'drivers/a715181@@tmp_rte_pmd_ipn3ke at sta/net_ipn3ke_ipn3ke_ethdev.c.o' -c ../drivers/net/ipn3ke/ipn3ke_ethdev.c
../drivers/net/ipn3ke/ipn3ke_ethdev.c:22:10: fatal error: ifpga_rawdev.h: No such file or directory
   22 | #include <ifpga_rawdev.h>
      |          ^~~~~~~~~~~~~~~~
compilation terminated.
[845/1784] Compiling C object 'drivers/a715181@@tmp_rte_pmd_ice at sta/net_ice_ice_rxtx.c.o'.
[846/1784] Compiling C object 'drivers/net/ice/base/39545a2@@ice_base at sta/ice_flex_pipe.c.o'.
[847/1784] Compiling C object 'drivers/a715181@@tmp_rte_pmd_ice at sta/net_ice_ice_ethdev.c.o'.
[848/1784] Compiling C object 'drivers/a715181@@tmp_rte_pmd_ipn3ke at sta/net_ipn3ke_ipn3ke_representor.c.o'.
FAILED: drivers/a715181@@tmp_rte_pmd_ipn3ke at sta/net_ipn3ke_ipn3ke_representor.c.o 
gcc -Idrivers/a715181@@tmp_rte_pmd_ipn3ke at sta -Idrivers -I../drivers -Idrivers/net/ipn3ke -I../drivers/net/ipn3ke -Ilib/librte_ethdev -I../lib/librte_ethdev -I. -I../ -Iconfig -I../config -Ilib/librte_eal/common/include -I../lib/librte_eal/common/include -I../lib/librte_eal/linux/eal/include -Ilib/librte_eal/common -I../lib/librte_eal/common -Ilib/librte_eal/common/include/arch/x86 -I../lib/librte_eal/common/include/arch/x86 -Ilib/librte_eal -I../lib/librte_eal -Ilib/librte_kvargs -I../lib/librte_kvargs -Ilib/librte_net -I../lib/librte_net -Ilib/librte_mbuf -I../lib/librte_mbuf -Ilib/librte_mempool -I../lib/librte_mempool -Ilib/librte_ring -I../lib/librte_ring -Ilib/librte_meter -I../lib/librte_meter -Idrivers/bus/pci -I../drivers/bus/pci -I../drivers/bus/pci/linux -Ilib/librte_pci -I../lib/librte_pci -Idrivers/bus/vdev -I../drivers/bus/vdev -Idrivers/bus/ifpga -I../drivers/bus/ifpga -Ilib/librte_rawdev -I../lib/librte_rawdev -Ilib/librte_sched -I../lib/librte_sched -fdiagnostics-color=always -pipe -D_FILE_OFFSET_BITS=64 -Wall -Winvalid-pch -Werror -O3 -include rte_config.h -Wunused-parameter -Wsign-compare -Wcast-qual -Wno-address-of-packed-member -D_GNU_SOURCE -fPIC -march=native -mno-avx512f -Wno-format-truncation -DALLOW_EXPERIMENTAL_API -MD -MQ 'drivers/a715181@@tmp_rte_pmd_ipn3ke at sta/net_ipn3ke_ipn3ke_representor.c.o' -MF 'drivers/a715181@@tmp_rte_pmd_ipn3ke at sta/net_ipn3ke_ipn3ke_representor.c.o.d' -o 'drivers/a715181@@tmp_rte_pmd_ipn3ke at sta/net_ipn3ke_ipn3ke_representor.c.o' -c ../drivers/net/ipn3ke/ipn3ke_representor.c
../drivers/net/ipn3ke/ipn3ke_representor.c:23:10: fatal error: rte_pmd_i40e.h: No such file or directory
   23 | #include <rte_pmd_i40e.h>
      |          ^~~~~~~~~~~~~~~~
compilation terminated.
[849/1784] Compiling C object 'drivers/a715181@@tmp_rte_pmd_ice at sta/net_ice_ice_rxtx_vec_sse.c.o'.
[850/1784] Compiling C object 'drivers/a715181@@tmp_rte_pmd_ifc at sta/net_ifc_ifcvf_vdpa.c.o'.
[851/1784] Compiling C object 'drivers/a715181@@tmp_rte_pmd_ice at sta/net_ice_ice_rxtx_vec_avx2.c.o'.
ninja: build stopped: subcommand failed




*Meson Build Failed #2:
OS: SUSE15-64
Target:build-gcc-static
FAILED: drivers/a715181@@tmp_rte_pmd_ipn3ke at sta/net_ipn3ke_ipn3ke_ethdev.c.o 
gcc -Idrivers/a715181@@tmp_rte_pmd_ipn3ke at sta -Idrivers -I../drivers -Idrivers/net/ipn3ke -I../drivers/net/ipn3ke -Ilib/librte_ethdev -I../lib/librte_ethdev -I. -I../ -Iconfig -I../config -Ilib/librte_eal/common/include -I../lib/librte_eal/common/include -I../lib/librte_eal/linux/eal/include -Ilib/librte_eal/common -I../lib/librte_eal/common -Ilib/librte_eal/common/include/arch/x86 -I../lib/librte_eal/common/include/arch/x86 -Ilib/librte_eal -I../lib/librte_eal -Ilib/librte_kvargs -I../lib/librte_kvargs -Ilib/librte_net -I../lib/librte_net -Ilib/librte_mbuf -I../lib/librte_mbuf -Ilib/librte_mempool -I../lib/librte_mempool -Ilib/librte_ring -I../lib/librte_ring -Ilib/librte_meter -I../lib/librte_meter -Idrivers/bus/pci -I../drivers/bus/pci -I../drivers/bus/pci/linux -Ilib/librte_pci -I../lib/librte_pci -Idrivers/bus/vdev -I../drivers/bus/vdev -Idrivers/bus/ifpga -I../drivers/bus/ifpga -Ilib/librte_rawdev -I../lib/librte_rawdev -Ilib/librte_sched -I../lib/librte_sched -fdiagnostics-color=always -pipe -D_FILE_OFFSET_BITS=64 -Wall -Winvalid-pch -Werror -O3 -include rte_config.h -Wunused-parameter -Wsign-compare -Wcast-qual -D_GNU_SOURCE -fPIC -march=native -Wno-format-truncation -DALLOW_EXPERIMENTAL_API -MD -MQ 'drivers/a715181@@tmp_rte_pmd_ipn3ke at sta/net_ipn3ke_ipn3ke_ethdev.c.o' -MF 'drivers/a715181@@tmp_rte_pmd_ipn3ke at sta/net_ipn3ke_ipn3ke_ethdev.c.o.d' -o 'drivers/a715181@@tmp_rte_pmd_ipn3ke at sta/net_ipn3ke_ipn3ke_ethdev.c.o' -c ../drivers/net/ipn3ke/ipn3ke_ethdev.c
../drivers/net/ipn3ke/ipn3ke_ethdev.c:22:10: fatal error: ifpga_rawdev.h: No such file or directory
 #include <ifpga_rawdev.h>
          ^~~~~~~~~~~~~~~~
compilation terminated.
[859/1831] Compiling C object 'drivers/a715181@@tmp_rte_pmd_ipn3ke at sta/net_ipn3ke_ipn3ke_representor.c.o'.
FAILED: drivers/a715181@@tmp_rte_pmd_ipn3ke at sta/net_ipn3ke_ipn3ke_representor.c.o 
gcc -Idrivers/a715181@@tmp_rte_pmd_ipn3ke at sta -Idrivers -I../drivers -Idrivers/net/ipn3ke -I../drivers/net/ipn3ke -Ilib/librte_ethdev -I../lib/librte_ethdev -I. -I../ -Iconfig -I../config -Ilib/librte_eal/common/include -I../lib/librte_eal/common/include -I../lib/librte_eal/linux/eal/include -Ilib/librte_eal/common -I../lib/librte_eal/common -Ilib/librte_eal/common/include/arch/x86 -I../lib/librte_eal/common/include/arch/x86 -Ilib/librte_eal -I../lib/librte_eal -Ilib/librte_kvargs -I../lib/librte_kvargs -Ilib/librte_net -I../lib/librte_net -Ilib/librte_mbuf -I../lib/librte_mbuf -Ilib/librte_mempool -I../lib/librte_mempool -Ilib/librte_ring -I../lib/librte_ring -Ilib/librte_meter -I../lib/librte_meter -Idrivers/bus/pci -I../drivers/bus/pci -I../drivers/bus/pci/linux -Ilib/librte_pci -I../lib/librte_pci -Idrivers/bus/vdev -I../drivers/bus/vdev -Idrivers/bus/ifpga -I../drivers/bus/ifpga -Ilib/librte_rawdev -I../lib/librte_rawdev -Ilib/librte_sched -I../lib/librte_sched -fdiagnostics-color=always -pipe -D_FILE_OFFSET_BITS=64 -Wall -Winvalid-pch -Werror -O3 -include rte_config.h -Wunused-parameter -Wsign-compare -Wcast-qual -D_GNU_SOURCE -fPIC -march=native -Wno-format-truncation -DALLOW_EXPERIMENTAL_API -MD -MQ 'drivers/a715181@@tmp_rte_pmd_ipn3ke at sta/net_ipn3ke_ipn3ke_representor.c.o' -MF 'drivers/a715181@@tmp_rte_pmd_ipn3ke at sta/net_ipn3ke_ipn3ke_representor.c.o.d' -o 'drivers/a715181@@tmp_rte_pmd_ipn3ke at sta/net_ipn3ke_ipn3ke_representor.c.o' -c ../drivers/net/ipn3ke/ipn3ke_representor.c
../drivers/net/ipn3ke/ipn3ke_representor.c:23:10: fatal error: rte_pmd_i40e.h: No such file or directory
 #include <rte_pmd_i40e.h>
          ^~~~~~~~~~~~~~~~
compilation terminated.
[860/1831] Compiling C object 'drivers/a715181@@tmp_rte_pmd_ice at sta/net_ice_ice_rxtx_vec_avx2.c.o'.
[861/1831] Compiling C object 'drivers/a715181@@tmp_rte_pmd_ifc at sta/net_ifc_ifcvf_vdpa.c.o'.
[862/1831] Compiling C object 'drivers/a715181@@tmp_rte_pmd_ipn3ke at sta/net_ipn3ke_ipn3ke_tm.c.o'.
[863/1831] Compiling C object 'drivers/a715181@@tmp_rte_pmd_ice at sta/net_ice_ice_rxtx_vec_sse.c.o'.
[864/1831] Compiling C object 'drivers/a715181@@tmp_rte_pmd_ipn3ke at sta/net_ipn3ke_ipn3ke_flow.c.o'.
[865/1831] Compiling C object 'drivers/net/ixgbe/base/a7935d9@@ixgbe_base at sta/ixgbe_common.c.o'.
ninja: build stopped: subcommand failed




*Meson Build Failed #3:
OS: UB1604-32
Target:build-gcc-static
FAILED: drivers/a715181@@tmp_rte_pmd_ipn3ke at sta/net_ipn3ke_ipn3ke_ethdev.c.o 
gcc -Idrivers/a715181@@tmp_rte_pmd_ipn3ke at sta -Idrivers -I../drivers -Idrivers/net/ipn3ke -I../drivers/net/ipn3ke -Ilib/librte_ethdev -I../lib/librte_ethdev -I. -I../ -Iconfig -I../config -Ilib/librte_eal/common/include -I../lib/librte_eal/common/include -I../lib/librte_eal/linux/eal/include -Ilib/librte_eal/common -I../lib/librte_eal/common -Ilib/librte_eal/common/include/arch/x86 -I../lib/librte_eal/common/include/arch/x86 -Ilib/librte_eal -I../lib/librte_eal -Ilib/librte_kvargs -I../lib/librte_kvargs -Ilib/librte_net -I../lib/librte_net -Ilib/librte_mbuf -I../lib/librte_mbuf -Ilib/librte_mempool -I../lib/librte_mempool -Ilib/librte_ring -I../lib/librte_ring -Ilib/librte_meter -I../lib/librte_meter -Idrivers/bus/pci -I../drivers/bus/pci -I../drivers/bus/pci/linux -Ilib/librte_pci -I../lib/librte_pci -Idrivers/bus/vdev -I../drivers/bus/vdev -Idrivers/bus/ifpga -I../drivers/bus/ifpga -Ilib/librte_rawdev -I../lib/librte_rawdev -Ilib/librte_sched -I../lib/librte_sched -fdiagnostics-color=always -pipe -D_FILE_OFFSET_BITS=64 -Wall -Winvalid-pch -Werror -O3 -include rte_config.h -Wunused-parameter -Wsign-compare -Wcast-qual -Wno-pointer-to-int-cast -D_GNU_SOURCE -fPIC -march=native -DALLOW_EXPERIMENTAL_API -MD -MQ 'drivers/a715181@@tmp_rte_pmd_ipn3ke at sta/net_ipn3ke_ipn3ke_ethdev.c.o' -MF 'drivers/a715181@@tmp_rte_pmd_ipn3ke at sta/net_ipn3ke_ipn3ke_ethdev.c.o.d' -o 'drivers/a715181@@tmp_rte_pmd_ipn3ke at sta/net_ipn3ke_ipn3ke_ethdev.c.o' -c ../drivers/net/ipn3ke/ipn3ke_ethdev.c
../drivers/net/ipn3ke/ipn3ke_ethdev.c:22:26: fatal error: ifpga_rawdev.h: No such file or directory
compilation terminated.
[842/1656] Linking static target drivers/libtmp_rte_pmd_ifc.a.
[843/1656] Compiling C object 'drivers/a715181@@tmp_rte_pmd_ipn3ke at sta/net_ipn3ke_ipn3ke_representor.c.o'.
FAILED: drivers/a715181@@tmp_rte_pmd_ipn3ke at sta/net_ipn3ke_ipn3ke_representor.c.o 
gcc -Idrivers/a715181@@tmp_rte_pmd_ipn3ke at sta -Idrivers -I../drivers -Idrivers/net/ipn3ke -I../drivers/net/ipn3ke -Ilib/librte_ethdev -I../lib/librte_ethdev -I. -I../ -Iconfig -I../config -Ilib/librte_eal/common/include -I../lib/librte_eal/common/include -I../lib/librte_eal/linux/eal/include -Ilib/librte_eal/common -I../lib/librte_eal/common -Ilib/librte_eal/common/include/arch/x86 -I../lib/librte_eal/common/include/arch/x86 -Ilib/librte_eal -I../lib/librte_eal -Ilib/librte_kvargs -I../lib/librte_kvargs -Ilib/librte_net -I../lib/librte_net -Ilib/librte_mbuf -I../lib/librte_mbuf -Ilib/librte_mempool -I../lib/librte_mempool -Ilib/librte_ring -I../lib/librte_ring -Ilib/librte_meter -I../lib/librte_meter -Idrivers/bus/pci -I../drivers/bus/pci -I../drivers/bus/pci/linux -Ilib/librte_pci -I../lib/librte_pci -Idrivers/bus/vdev -I../drivers/bus/vdev -Idrivers/bus/ifpga -I../drivers/bus/ifpga -Ilib/librte_rawdev -I../lib/librte_rawdev -Ilib/librte_sched -I../lib/librte_sched -fdiagnostics-color=always -pipe -D_FILE_OFFSET_BITS=64 -Wall -Winvalid-pch -Werror -O3 -include rte_config.h -Wunused-parameter -Wsign-compare -Wcast-qual -Wno-pointer-to-int-cast -D_GNU_SOURCE -fPIC -march=native -DALLOW_EXPERIMENTAL_API -MD -MQ 'drivers/a715181@@tmp_rte_pmd_ipn3ke at sta/net_ipn3ke_ipn3ke_representor.c.o' -MF 'drivers/a715181@@tmp_rte_pmd_ipn3ke at sta/net_ipn3ke_ipn3ke_representor.c.o.d' -o 'drivers/a715181@@tmp_rte_pmd_ipn3ke at sta/net_ipn3ke_ipn3ke_representor.c.o' -c ../drivers/net/ipn3ke/ipn3ke_representor.c
../drivers/net/ipn3ke/ipn3ke_representor.c:23:26: fatal error: rte_pmd_i40e.h: No such file or directory
compilation terminated.
[844/1656] Compiling C object 'drivers/a715181@@tmp_rte_pmd_ice at sta/net_ice_ice_rxtx_vec_avx2.c.o'.
[845/1656] Compiling C object 'drivers/a715181@@tmp_rte_pmd_ice at sta/net_ice_ice_rxtx.c.o'.
[846/1656] Compiling C object 'drivers/a715181@@tmp_rte_pmd_ipn3ke at sta/net_ipn3ke_ipn3ke_tm.c.o'.
ninja: build stopped: subcommand failed




*Meson Build Failed #4:
OS: UB1804-64
Target:build-gcc-static
FAILED: drivers/a715181@@tmp_rte_pmd_ipn3ke at sta/net_ipn3ke_ipn3ke_ethdev.c.o 
gcc -Idrivers/a715181@@tmp_rte_pmd_ipn3ke at sta -Idrivers -I../drivers -Idrivers/net/ipn3ke -I../drivers/net/ipn3ke -Ilib/librte_ethdev -I../lib/librte_ethdev -I. -I../ -Iconfig -I../config -Ilib/librte_eal/common/include -I../lib/librte_eal/common/include -I../lib/librte_eal/linux/eal/include -Ilib/librte_eal/common -I../lib/librte_eal/common -Ilib/librte_eal/common/include/arch/x86 -I../lib/librte_eal/common/include/arch/x86 -Ilib/librte_eal -I../lib/librte_eal -Ilib/librte_kvargs -I../lib/librte_kvargs -Ilib/librte_net -I../lib/librte_net -Ilib/librte_mbuf -I../lib/librte_mbuf -Ilib/librte_mempool -I../lib/librte_mempool -Ilib/librte_ring -I../lib/librte_ring -Ilib/librte_meter -I../lib/librte_meter -Idrivers/bus/pci -I../drivers/bus/pci -I../drivers/bus/pci/linux -Ilib/librte_pci -I../lib/librte_pci -Idrivers/bus/vdev -I../drivers/bus/vdev -Idrivers/bus/ifpga -I../drivers/bus/ifpga -Ilib/librte_rawdev -I../lib/librte_rawdev -Ilib/librte_sched -I../lib/librte_sched -fdiagnostics-color=always -pipe -D_FILE_OFFSET_BITS=64 -Wall -Winvalid-pch -Werror -O3 -include rte_config.h -Wunused-parameter -Wsign-compare -Wcast-qual -D_GNU_SOURCE -fPIC -march=native -mno-avx512f -Wno-format-truncation -DALLOW_EXPERIMENTAL_API -MD -MQ 'drivers/a715181@@tmp_rte_pmd_ipn3ke at sta/net_ipn3ke_ipn3ke_ethdev.c.o' -MF 'drivers/a715181@@tmp_rte_pmd_ipn3ke at sta/net_ipn3ke_ipn3ke_ethdev.c.o.d' -o 'drivers/a715181@@tmp_rte_pmd_ipn3ke at sta/net_ipn3ke_ipn3ke_ethdev.c.o' -c ../drivers/net/ipn3ke/ipn3ke_ethdev.c
../drivers/net/ipn3ke/ipn3ke_ethdev.c:22:10: fatal error: ifpga_rawdev.h: No such file or directory
 #include <ifpga_rawdev.h>
          ^~~~~~~~~~~~~~~~
compilation terminated.
[860/1791] Compiling C object 'drivers/a715181@@tmp_rte_pmd_ice at sta/net_ice_ice_rxtx_vec_avx2.c.o'.
[861/1791] Compiling C object 'drivers/a715181@@tmp_rte_pmd_ifc at sta/net_ifc_ifcvf_vdpa.c.o'.
[862/1791] Compiling C object 'drivers/a715181@@tmp_rte_pmd_ipn3ke at sta/net_ipn3ke_ipn3ke_representor.c.o'.
FAILED: drivers/a715181@@tmp_rte_pmd_ipn3ke at sta/net_ipn3ke_ipn3ke_representor.c.o 
gcc -Idrivers/a715181@@tmp_rte_pmd_ipn3ke at sta -Idrivers -I../drivers -Idrivers/net/ipn3ke -I../drivers/net/ipn3ke -Ilib/librte_ethdev -I../lib/librte_ethdev -I. -I../ -Iconfig -I../config -Ilib/librte_eal/common/include -I../lib/librte_eal/common/include -I../lib/librte_eal/linux/eal/include -Ilib/librte_eal/common -I../lib/librte_eal/common -Ilib/librte_eal/common/include/arch/x86 -I../lib/librte_eal/common/include/arch/x86 -Ilib/librte_eal -I../lib/librte_eal -Ilib/librte_kvargs -I../lib/librte_kvargs -Ilib/librte_net -I../lib/librte_net -Ilib/librte_mbuf -I../lib/librte_mbuf -Ilib/librte_mempool -I../lib/librte_mempool -Ilib/librte_ring -I../lib/librte_ring -Ilib/librte_meter -I../lib/librte_meter -Idrivers/bus/pci -I../drivers/bus/pci -I../drivers/bus/pci/linux -Ilib/librte_pci -I../lib/librte_pci -Idrivers/bus/vdev -I../drivers/bus/vdev -Idrivers/bus/ifpga -I../drivers/bus/ifpga -Ilib/librte_rawdev -I../lib/librte_rawdev -Ilib/librte_sched -I../lib/librte_sched -fdiagnostics-color=always -pipe -D_FILE_OFFSET_BITS=64 -Wall -Winvalid-pch -Werror -O3 -include rte_config.h -Wunused-parameter -Wsign-compare -Wcast-qual -D_GNU_SOURCE -fPIC -march=native -mno-avx512f -Wno-format-truncation -DALLOW_EXPERIMENTAL_API -MD -MQ 'drivers/a715181@@tmp_rte_pmd_ipn3ke at sta/net_ipn3ke_ipn3ke_representor.c.o' -MF 'drivers/a715181@@tmp_rte_pmd_ipn3ke at sta/net_ipn3ke_ipn3ke_representor.c.o.d' -o 'drivers/a715181@@tmp_rte_pmd_ipn3ke at sta/net_ipn3ke_ipn3ke_representor.c.o' -c ../drivers/net/ipn3ke/ipn3ke_representor.c
../drivers/net/ipn3ke/ipn3ke_representor.c:23:10: fatal error: rte_pmd_i40e.h: No such file or directory
 #include <rte_pmd_i40e.h>
          ^~~~~~~~~~~~~~~~
compilation terminated.
[863/1791] Compiling C object 'drivers/a715181@@tmp_rte_pmd_ipn3ke at sta/net_ipn3ke_ipn3ke_flow.c.o'.
[864/1791] Compiling C object 'drivers/a715181@@tmp_rte_pmd_ipn3ke at sta/net_ipn3ke_ipn3ke_tm.c.o'.
ninja: build stopped: subcommand failed




*Meson Build Failed #5:
OS: FreeBSD12-64
Target:build-gcc-static
FAILED: drivers/a715181@@tmp_rte_pmd_ipn3ke at sta/net_ipn3ke_ipn3ke_representor.c.o 
ccache gcc -Idrivers/a715181@@tmp_rte_pmd_ipn3ke at sta -Idrivers -I../drivers -Idrivers/net/ipn3ke -I../drivers/net/ipn3ke -Ilib/librte_ethdev -I../lib/librte_ethdev -I. -I../ -Iconfig -I../config -Ilib/librte_eal/common/include -I../lib/librte_eal/common/include -I../lib/librte_eal/freebsd/eal/include -Ilib/librte_eal/common -I../lib/librte_eal/common -Ilib/librte_eal/common/include/arch/x86 -I../lib/librte_eal/common/include/arch/x86 -Ilib/librte_eal -I../lib/librte_eal -Ilib/librte_kvargs -I../lib/librte_kvargs -Ilib/librte_net -I../lib/librte_net -Ilib/librte_mbuf -I../lib/librte_mbuf -Ilib/librte_mempool -I../lib/librte_mempool -Ilib/librte_ring -I../lib/librte_ring -Ilib/librte_meter -I../lib/librte_meter -Idrivers/bus/pci -I../drivers/bus/pci -I../drivers/bus/pci/bsd -Ilib/librte_pci -I../lib/librte_pci -Idrivers/bus/vdev -I../drivers/bus/vdev -Idrivers/bus/ifpga -I../drivers/bus/ifpga -Ilib/librte_rawdev -I../lib/librte_rawdev -Ilib/librte_sched -I../lib/librte_sched -fdiagnostics-color=always -pipe -D_FILE_OFFSET_BITS=64 -Wall -Winvalid-pch -Werror -O3 -include rte_config.h -Wunused-parameter -Wsign-compare -Wcast-qual -D_GNU_SOURCE -D__BSD_VISIBLE -fPIC -march=native -Wno-format-truncation -DALLOW_EXPERIMENTAL_API -MD -MQ 'drivers/a715181@@tmp_rte_pmd_ipn3ke at sta/net_ipn3ke_ipn3ke_representor.c.o' -MF 'drivers/a715181@@tmp_rte_pmd_ipn3ke at sta/net_ipn3ke_ipn3ke_representor.c.o.d' -o 'drivers/a715181@@tmp_rte_pmd_ipn3ke at sta/net_ipn3ke_ipn3ke_representor.c.o' -c ../drivers/net/ipn3ke/ipn3ke_representor.c
../drivers/net/ipn3ke/ipn3ke_representor.c:23:10: fatal error: rte_pmd_i40e.h: No such file or directory
 #include <rte_pmd_i40e.h>
          ^~~~~~~~~~~~~~~~
compilation terminated.
[832/1413] Compiling C object 'drivers/a715181@@tmp_rte_pmd_liquidio at sta/net_liquidio_base_lio_23xx_vf.c.o'.
[833/1413] Compiling C object 'drivers/a715181@@tmp_rte_pmd_liquidio at sta/net_liquidio_lio_ethdev.c.o'.
[834/1413] Generating rte_pmd_ixgbe.pmd.c with a custom command.
[835/1413] Compiling C object 'drivers/a715181@@tmp_rte_pmd_ipn3ke at sta/net_ipn3ke_ipn3ke_ethdev.c.o'.
FAILED: drivers/a715181@@tmp_rte_pmd_ipn3ke at sta/net_ipn3ke_ipn3ke_ethdev.c.o 
ccache gcc -Idrivers/a715181@@tmp_rte_pmd_ipn3ke at sta -Idrivers -I../drivers -Idrivers/net/ipn3ke -I../drivers/net/ipn3ke -Ilib/librte_ethdev -I../lib/librte_ethdev -I. -I../ -Iconfig -I../config -Ilib/librte_eal/common/include -I../lib/librte_eal/common/include -I../lib/librte_eal/freebsd/eal/include -Ilib/librte_eal/common -I../lib/librte_eal/common -Ilib/librte_eal/common/include/arch/x86 -I../lib/librte_eal/common/include/arch/x86 -Ilib/librte_eal -I../lib/librte_eal -Ilib/librte_kvargs -I../lib/librte_kvargs -Ilib/librte_net -I../lib/librte_net -Ilib/librte_mbuf -I../lib/librte_mbuf -Ilib/librte_mempool -I../lib/librte_mempool -Ilib/librte_ring -I../lib/librte_ring -Ilib/librte_meter -I../lib/librte_meter -Idrivers/bus/pci -I../drivers/bus/pci -I../drivers/bus/pci/bsd -Ilib/librte_pci -I../lib/librte_pci -Idrivers/bus/vdev -I../drivers/bus/vdev -Idrivers/bus/ifpga -I../drivers/bus/ifpga -Ilib/librte_rawdev -I../lib/librte_rawdev -Ilib/librte_sched -I../lib/librte_sched -fdiagnostics-color=always -pipe -D_FILE_OFFSET_BITS=64 -Wall -Winvalid-pch -Werror -O3 -include rte_config.h -Wunused-parameter -Wsign-compare -Wcast-qual -D_GNU_SOURCE -D__BSD_VISIBLE -fPIC -march=native -Wno-format-truncation -DALLOW_EXPERIMENTAL_API -MD -MQ 'drivers/a715181@@tmp_rte_pmd_ipn3ke at sta/net_ipn3ke_ipn3ke_ethdev.c.o' -MF 'drivers/a715181@@tmp_rte_pmd_ipn3ke at sta/net_ipn3ke_ipn3ke_ethdev.c.o.d' -o 'drivers/a715181@@tmp_rte_pmd_ipn3ke at sta/net_ipn3ke_ipn3ke_ethdev.c.o' -c ../drivers/net/ipn3ke/ipn3ke_ethdev.c
../drivers/net/ipn3ke/ipn3ke_ethdev.c:22:10: fatal error: ifpga_rawdev.h: No such file or directory
 #include <ifpga_rawdev.h>
          ^~~~~~~~~~~~~~~~
compilation terminated.
[836/1413] Compiling C object 'drivers/a715181@@tmp_rte_pmd_i40e at sta/net_i40e_i40e_ethdev.c.o'.
ninja: build stopped: subcommand failed



DPDK STV team


More information about the test-report mailing list