[dpdk-test-report] |FAILURE| pw59933[v3, 1/5] net/ice: minor code clean

sys_stv at intel.com sys_stv at intel.com
Fri Sep 27 06:15:13 CEST 2019


Test-Label: Intel-compilation
Test-Status: FAILURE
http://dpdk.org/patch/59933

_Compilation issues_

Submitter: Ying Wang <ying.a.wang at intel.com>
Date: 2019-09-26 18:55:20
Reply_mail: 20190926185524.317595-2-ying.a.wang at intel.com
DPDK git baseline: Repo:dpdk-next-net-intel, CommitID: 9e695cf3ad90d1cbe3e03344376a7858aebdc39e

Makefile build Summary: 22 Builds Done, 0 Successful, 22 Failures

Meson build Summary: 7 Builds Done, 2 Successful, 5 Failures

               +==============================================+===========+==========+
               |                   Makefile                   |   Meson   | Document |
+--------------+------+-------+------+------------+-----------+-----------+----------+
| os           | gcc  | clang | icc  | gcc+shared | gcc+debug | gcc/clang | pdf/html |
+--------------+------+-------+------+------------+-----------+-----------+----------+
| RHEL76-64    | FAIL |       |      |            |           |           |          |
| CENTOS76-64  | FAIL | FAIL  | FAIL | FAIL       | FAIL      |           |          |
| UB1804-64    | FAIL | FAIL  | FAIL |            |           | FAIL      | pass     |
| UB1604-32    | FAIL |       |      |            |           | FAIL      |          |
| UB1904-64    | FAIL |       |      |            |           |           |          |
| UB1604-64    | FAIL | FAIL  |      |            |           |           |          |
| FC30-64      | FAIL | FAIL  |      |            |           | FAIL      |          |
| WIN10-64     |      |       |      |            |           | pass      |          |
| FreeBSD12-64 | FAIL | FAIL  |      | FAIL       | FAIL      | FAIL      |          |
| RHEL80-64    | FAIL |       |      |            |           |           |          |
| SUSE15-64    | FAIL | FAIL  |      |            |           | FAIL      |          |
+--------------+------+-------+------+------------+-----------+-----------+----------+

Test environment and configuration as below:

** Makefile build **


OS: RHEL76-64
	Kernel Version: 3.10.0-957.el7.x86_64
	CPU info: Intel(R) Xeon(R) CPU E5-2699 v4 @ 2.20GHz
	GCC Version: gcc (GCC) 4.8.5 20150623 (Red Hat 4.8.5-36)
	Clang Version: NA
	x86_64-native-linuxapp-gcc


OS: CENTOS76-64
	Kernel Version: 3.10.0-957.10.1.el7.x86_64
	CPU info: Intel(R) Xeon(R) CPU E5-2699 v4 @ 2.20GHz
	GCC Version: gcc (GCC) 4.8.5 20150623 (Red Hat 4.8.5-36)
	Clang Version: 3.4.2 (tags/RELEASE_34/dot2-final)
	x86_64-native-linuxapp-clang
	x86_64-native-linuxapp-gcc
	x86_64-native-linuxapp-gcc+debug
	x86_64-native-linuxapp-icc
	x86_64-native-linuxapp-gcc+shared


OS: UB1804-64
	Kernel Version: 4.15.0-20-generic
	CPU info: Intel(R) Xeon(R) CPU E5-2699 v3 @ 2.30GHz
	GCC Version: gcc (Ubuntu 7.3.0-27ubuntu1~18.04) 7.3.0
	Clang Version: 6.0.0-1ubuntu2 (tags/RELEASE_600/final)
	x86_64-native-linuxapp-icc
	x86_64-native-linuxapp-clang
	x86_64-native-linuxapp-gcc


OS: UB1904-64
	Kernel Version: 5.0.0-13-generic
	CPU info: Intel(R) Xeon(R) CPU E5-2699 v3 @ 2.30GHz
	GCC Version: gcc (Ubuntu 8.3.0-6ubuntu1) 8.3.0
	Clang Version: 8.0.0-3 (tags/RELEASE_800/final)
	x86_64-native-linuxapp-gcc


OS: UB1604-32
	Kernel Version: 4.4.0-131-generic
	CPU info: Intel(R) Xeon(R) CPU E5-2699 v3 @ 2.30GHz
	GCC Version: gcc (Ubuntu 5.4.0-6ubuntu1~16.04.11) 5.4.0 20160609
	Clang Version: 3.8.0-2ubuntu4 (tags/RELEASE_380/final)
	i686-native-linuxapp-gcc


OS: UB1604-64
	Kernel Version: 4.4.0-47-generic
	CPU info: Intel(R) Xeon(R) CPU E5-2699 v3 @ 2.30GHz
	GCC Version: gcc (Ubuntu 5.4.0-6ubuntu1~16.04.10) 5.4.0 20160609
	Clang Version: 3.8.0-2ubuntu4 (tags/RELEASE_380/final)
	x86_64-native-linuxapp-clang
	x86_64-native-linuxapp-gcc


OS: FC30-64
	Kernel Version: 5.1.7-300.fc30.x86_64
	CPU info: Intel(R) Xeon(R) CPU E5-2699 v4 @ 2.20GHz
	GCC Version: gcc (GCC) 9.1.1 20190503 (Red Hat 9.1.1-1)
	Clang Version: 8.0.0 (Fedora 8.0.0-1.fc30)
	x86_64-native-linuxapp-gcc
	x86_64-native-linuxapp-clang


OS: FreeBSD12-64
	Kernel Version: 12.0-RC3
	CPU info: Intel(R) Xeon(R) CPU E5-2699 v4 @ 2.20GHz (2194.97-MHz K8-class CPU)
	GCC Version: gcc (FreeBSD Ports Collection) 7.3.0
	Clang Version: 6.0.1 (tags/RELEASE_601/final 335540) (based on LLVM 6.0.1)
	x86_64-native-bsdapp-gcc+debug
	x86_64-native-bsdapp-gcc+shared
	x86_64-native-bsdapp-clang
	x86_64-native-bsdapp-gcc


OS: RHEL80-64
	Kernel Version: 4.18.0-80.el8.x86_64
	CPU info: Intel(R) Xeon(R) CPU E5-2699 v4 @ 2.20GHz
	GCC Version: gcc (GCC) 8.2.1 20180905 (Red Hat 8.2.1-3)
	Clang Version: 6.0.1 (tags/RELEASE_601/final)
	x86_64-native-linuxapp-gcc


OS: SUSE15-64
	Kernel Version: 4.12.14-lp150.11-default
	CPU info: Intel(R) Xeon(R) CPU E5-2699 v4 @ 2.20GHz
	GCC Version: gcc (SUSE Linux) 7.3.1 20180323 [gcc-7-branch revision 258812]
	Clang Version: 5.0.1 (tags/RELEASE_501/final 312548)
	x86_64-native-linuxapp-gcc
	x86_64-native-linuxapp-clang


** Meson build **


OS: UB1804-64
	Kernel Version: 4.15.0-20-generic
	CPU info: Intel(R) Xeon(R) CPU E5-2699 v4 @ 2.20GHz
	GCC Version: gcc (Ubuntu 7.3.0-27ubuntu1~18.04) 7.3.0
	Clang Version: 6.0.0-1ubuntu2 (tags/RELEASE_600/final)
	x86_64-native-linuxapp-doc
	build-gcc-static
	build-gcc-shared
	build-clang-static
	build-clang-shared
	build-x86-default


OS: UB1604-32
	Kernel Version: 4.4.0-131-generic
	CPU info: Intel(R) Xeon(R) CPU E5-2699 v4 @ 2.20GHz
	GCC Version: gcc (Ubuntu 5.4.0-6ubuntu1~16.04.11) 5.4.0 20160609
	Clang Version: 3.8.0-2ubuntu4 (tags/RELEASE_380/final)
	build-gcc-static
	build-gcc-shared
	build-clang-static
	build-clang-shared
	build-x86-default


OS: FC30-64
	Kernel Version: 5.0.9-301.fc30.x86_64
	CPU info: Intel(R) Xeon(R) CPU E5-2699 v4 @ 2.20GHz
	GCC Version: gcc (GCC) 9.1.1 20190503 (Red Hat 9.1.1-1)
	Clang Version: 8.0.0 (Fedora 8.0.0-1.fc30)
	build-gcc-static
	build-gcc-shared
	build-clang-static
	build-clang-shared
	build-x86-default


OS: WIN10-64
	Kernel Version: N/A
	CPU info: N/A
	GCC Version: N/A
	Clang Version: Clang 8.0.0
	x86_64-windows-clang


OS: FreeBSD12-64
	Kernel Version: 12.0-RC3
	CPU info: Intel(R) Xeon(R) CPU E5-2699 v4 @ 2.20GHz (2194.99-MHz K8-class CPU)
	GCC Version: gcc (FreeBSD Ports Collection) 7.3.0
	Clang Version: 6.0.1 (tags/RELEASE_601/final 335540) (based on LLVM 6.0.1)
	build-gcc-static
	build-gcc-shared
	build-clang-static
	build-clang-shared
	build-x86-default


OS: SUSE15-64
	Kernel Version: 4.12.14-lp150.11-default
	CPU info: Intel(R) Xeon(R) CPU E5-2699 v4 @ 2.20GHz
	GCC Version: gcc (SUSE Linux) 7.3.1 20180323 [gcc-7-branch revision 258812]
	Clang Version: 5.0.1 (tags/RELEASE_501/final 312548)
	build-gcc-static
	build-gcc-shared
	build-clang-static
	build-clang-shared
	build-x86-default


*Make Build Failed #1:
OS: UB1604-64
Target: x86_64-native-linuxapp-clang
/tmp/UB1604-64_K4.4.0_Clang3.8.0/x86_64-native-linuxapp-clang/eaf7da6477e94a7db61010a4bef17935/dpdk/x86_64-native-linuxapp-clang/include/rte_flow.h:283:2: note: 'RTE_FLOW_ITEM_TYPE_MPLS' declared here
        RTE_FLOW_ITEM_TYPE_MPLS,
        ^
5  CC i40e_pf.o
 errors generated.
/tmp/UB1604-64_K4.4.0_Clang3.8.0/x86_64-native-linuxapp-clang/eaf7da6477e94a7db61010a4bef17935/dpdk/mk/internal/rte.compile-pre.mk:114: recipe for target 'ice_switch_filter.o' failed
make[6]: *** [ice_switch_filter.o] Error 1
make[6]: *** Waiting for unfinished jobs....
  CC i40e_fdir.o
/tmp/UB1604-64_K4.4.0_Clang3.8.0/x86_64-native-linuxapp-clang/eaf7da6477e94a7db61010a4bef17935/dpdk/mk/rte.subdir.mk:35: recipe for target 'ice' failed
make[5]: *** [ice] Error 2
make[5]: *** Waiting for unfinished jobs....
  CC ixgbe_pf.o
  CC bnxt_rxq.o
  CC nfp_net.o
  PMDINFO sfc_ethdev.o.pmd.c
--
  CC medford2_nic.o
  AR librte_pmd_qede.a
  INSTALL-LIB librte_pmd_qede.a
  AR librte_pmd_sfc_efx.a
  INSTALL-LIB librte_pmd_sfc_efx.a
/tmp/UB1604-64_K4.4.0_Clang3.8.0/x86_64-native-linuxapp-clang/eaf7da6477e94a7db61010a4bef17935/dpdk/mk/rte.subdir.mk:35: recipe for target 'net' failed
make[4]: *** [net] Error 2
/tmp/UB1604-64_K4.4.0_Clang3.8.0/x86_64-native-linuxapp-clang/eaf7da6477e94a7db61010a4bef17935/dpdk/mk/rte.sdkbuild.mk:46: recipe for target 'drivers' failed
make[3]: *** [drivers] Error 2
/tmp/UB1604-64_K4.4.0_Clang3.8.0/x86_64-native-linuxapp-clang/eaf7da6477e94a7db61010a4bef17935/dpdk/mk/rte.sdkroot.mk:98: recipe for target 'all' failed
make[2]: *** [all] Error 2
/tmp/UB1604-64_K4.4.0_Clang3.8.0/x86_64-native-linuxapp-clang/eaf7da6477e94a7db61010a4bef17935/dpdk/mk/rte.sdkinstall.mk:60: recipe for target 'pre_install' failed
make[1]: *** [pre_install] Error 2
/tmp/UB1604-64_K4.4.0_Clang3.8.0/x86_64-native-linuxapp-clang/eaf7da6477e94a7db61010a4bef17935/dpdk/mk/rte.sdkroot.mk:77: recipe for target 'install' failed
make: *** [install] Error 2


*Make Build Failed #2:
OS: UB1604-32
Target: i686-native-linuxapp-gcc
/tmp/UB1604-32_K4.4.0_GCC5.4.0/i686-native-linuxapp-gcc/eaf7da6477e94a7db61010a4bef17935/dpdk/drivers/net/ice/ice_switch_filter.c:1024:19: error: ‘RTE_FLOW_ITEM_TYPE_PPPOES’ undeclared (first use in this function)
     item->type == RTE_FLOW_ITEM_TYPE_PPPOES)
                   ^
/tmp/UB1604-32_K4.4.0_GCC5.4.0/i686-native-linuxapp-gcc/eaf7da6477e94a7db61010a4bef17935/dpdk/drivers/net/ice/ice_switch_filter.c: At top level:
cc1: warning: unrecognized command line option ‘-Wno-address-of-packed-member’
/tmp/UB1604-32_K4.4.0_GCC5.4.0/i686-native-linuxapp-gcc/eaf7da6477e94a7db61010a4bef17935/dpdk/mk/internal/rte.compile-pre.mk:114: recipe for target 'ice_switch_filter.o' failed
make[6]: *** [ice_switch_filter.o] Error 1
make[6]: *** Waiting for unfinished jobs....
  CC ixgbe_hv_vf.o
  AR librte_pmd_octeontx.a
  INSTALL-LIB librte_pmd_octeontx.a
  CC ecore_dev.o
--
  CC ixgbe_dcb_82599.o
  CC ixgbe_dcb_82598.o
  CC ixgbe_mbx.o
make[6]: Warning: File 'ixgbe_ethdev.c' has modification time 17118 s in the future
  CC ixgbe_rxtx.o
/tmp/UB1604-32_K4.4.0_GCC5.4.0/i686-native-linuxapp-gcc/eaf7da6477e94a7db61010a4bef17935/dpdk/mk/rte.subdir.mk:35: recipe for target 'ice' failed
make[5]: *** [ice] Error 2
make[5]: *** Waiting for unfinished jobs....
  CC ixgbe_fdir.o
  CC ixgbe_ethdev.o
  CC ixgbe_pf.o
  PMDINFO rte_eth_ring.o.pmd.c
--
  PMDINFO qede_ethdev.o.pmd.c
  CC qede_ethdev.o.pmd.o
  LD qede_ethdev.o
  AR librte_pmd_qede.a
  INSTALL-LIB librte_pmd_qede.a
/tmp/UB1604-32_K4.4.0_GCC5.4.0/i686-native-linuxapp-gcc/eaf7da6477e94a7db61010a4bef17935/dpdk/mk/rte.subdir.mk:35: recipe for target 'net' failed
make[4]: *** [net] Error 2
/tmp/UB1604-32_K4.4.0_GCC5.4.0/i686-native-linuxapp-gcc/eaf7da6477e94a7db61010a4bef17935/dpdk/mk/rte.sdkbuild.mk:46: recipe for target 'drivers' failed
make[3]: *** [drivers] Error 2
/tmp/UB1604-32_K4.4.0_GCC5.4.0/i686-native-linuxapp-gcc/eaf7da6477e94a7db61010a4bef17935/dpdk/mk/rte.sdkroot.mk:98: recipe for target 'all' failed
make[2]: *** [all] Error 2
/tmp/UB1604-32_K4.4.0_GCC5.4.0/i686-native-linuxapp-gcc/eaf7da6477e94a7db61010a4bef17935/dpdk/mk/rte.sdkinstall.mk:60: recipe for target 'pre_install' failed
make[1]: *** [pre_install] Error 2
/tmp/UB1604-32_K4.4.0_GCC5.4.0/i686-native-linuxapp-gcc/eaf7da6477e94a7db61010a4bef17935/dpdk/mk/rte.sdkroot.mk:77: recipe for target 'install' failed
make: *** [install] Error 2


*Make Build Failed #3:
OS: UB1904-64
Target: x86_64-native-linuxapp-gcc
     item->type == RTE_FLOW_ITEM_TYPE_PPPOES)
                   ^~~~~~~~~~~~~~~~~~~~~~~~~
                   RTE_FLOW_ITEM_TYPE_MPLS
/tmp/UB1904-64_K4.18.0_GCC8.3.0/x86_64-native-linuxapp-gcc/eaf7da6477e94a7db61010a4bef17935/dpdk/drivers/net/ice/ice_switch_filter.c: At top level:
cc1: warning: unrecognized command line option ‘-Wno-address-of-packed-member’
make[6]: *** [/tmp/UB1904-64_K4.18.0_GCC8.3.0/x86_64-native-linuxapp-gcc/eaf7da6477e94a7db61010a4bef17935/dpdk/mk/internal/rte.compile-pre.mk:116: ice_switch_filter.o] Error 1
  INSTALL-LIB librte_pmd_netvsc.a
make[5]: *** [/tmp/UB1904-64_K4.18.0_GCC8.3.0/x86_64-native-linuxapp-gcc/eaf7da6477e94a7db61010a4bef17935/dpdk/mk/rte.subdir.mk:37: ice] Error 2
make[5]: *** Waiting for unfinished jobs....
  CC nfp_hwinfo.o
  CC octeontx_bgx.o
  CC ixgbe_dcb_82599.o
  CC i40e_tm.o
--
  LD otx2_ethdev.o
  AR librte_pmd_octeontx2.a
  INSTALL-LIB librte_pmd_octeontx2.a
  AR librte_pmd_qede.a
  INSTALL-LIB librte_pmd_qede.a
make[4]: *** [/tmp/UB1904-64_K4.18.0_GCC8.3.0/x86_64-native-linuxapp-gcc/eaf7da6477e94a7db61010a4bef17935/dpdk/mk/rte.subdir.mk:35: net] Error 2
make[3]: *** [/tmp/UB1904-64_K4.18.0_GCC8.3.0/x86_64-native-linuxapp-gcc/eaf7da6477e94a7db61010a4bef17935/dpdk/mk/rte.sdkbuild.mk:46: drivers] Error 2
make[2]: *** [/tmp/UB1904-64_K4.18.0_GCC8.3.0/x86_64-native-linuxapp-gcc/eaf7da6477e94a7db61010a4bef17935/dpdk/mk/rte.sdkroot.mk:99: all] Error 2
make[1]: *** [/tmp/UB1904-64_K4.18.0_GCC8.3.0/x86_64-native-linuxapp-gcc/eaf7da6477e94a7db61010a4bef17935/dpdk/mk/rte.sdkinstall.mk:61: pre_install] Error 2
make: *** [/tmp/UB1904-64_K4.18.0_GCC8.3.0/x86_64-native-linuxapp-gcc/eaf7da6477e94a7db61010a4bef17935/dpdk/mk/rte.sdkroot.mk:77: install] Error 2


*Make Build Failed #4:
OS: UB1804-64
Target: x86_64-native-linuxapp-icc
/tmp/UB1804-64_K4.15.0_ICC19.0.0/x86_64-native-linuxapp-icc/eaf7da6477e94a7db61010a4bef17935/dpdk/drivers/net/ice/ice_switch_filter.c(1024): error: identifier "RTE_FLOW_ITEM_TYPE_PPPOES" is undefined
  				item->type == RTE_FLOW_ITEM_TYPE_PPPOES)
  				              ^

compilation aborted for /tmp/UB1804-64_K4.15.0_ICC19.0.0/x86_64-native-linuxapp-icc/eaf7da6477e94a7db61010a4bef17935/dpdk/drivers/net/ice/ice_switch_filter.c (code 2)
/tmp/UB1804-64_K4.15.0_ICC19.0.0/x86_64-native-linuxapp-icc/eaf7da6477e94a7db61010a4bef17935/dpdk/mk/internal/rte.compile-pre.mk:114: recipe for target 'ice_switch_filter.o' failed
make[6]: *** [ice_switch_filter.o] Error 2
make[6]: *** Waiting for unfinished jobs....
== Build drivers/net/qede
  CC nfp_net.o
  AR librte_pmd_i40e.a
  INSTALL-LIB librte_pmd_i40e.a
make[6]: warning:  Clock skew detected.  Your build may be incomplete.
  CC bnxt_ring.o
  CC ixgbe_ethdev.o
  CC otx2_rss.o
  CC ixgbe_fdir.o
/tmp/UB1804-64_K4.15.0_ICC19.0.0/x86_64-native-linuxapp-icc/eaf7da6477e94a7db61010a4bef17935/dpdk/mk/rte.subdir.mk:35: recipe for target 'ice' failed
make[5]: *** [ice] Error 2
make[5]: *** Waiting for unfinished jobs....
  CC ixgbe_pf.o
  CC otx2_mac.o
  CC bnxt_rxq.o
  PMDINFO rte_eth_pcap.o.pmd.c
--
  PMDINFO qede_ethdev.o.pmd.c
  CC qede_ethdev.o.pmd.o
  LD qede_ethdev.o
  AR librte_pmd_qede.a
  INSTALL-LIB librte_pmd_qede.a
/tmp/UB1804-64_K4.15.0_ICC19.0.0/x86_64-native-linuxapp-icc/eaf7da6477e94a7db61010a4bef17935/dpdk/mk/rte.subdir.mk:35: recipe for target 'net' failed
make[4]: *** [net] Error 2
/tmp/UB1804-64_K4.15.0_ICC19.0.0/x86_64-native-linuxapp-icc/eaf7da6477e94a7db61010a4bef17935/dpdk/mk/rte.sdkbuild.mk:46: recipe for target 'drivers' failed
make[3]: *** [drivers] Error 2
/tmp/UB1804-64_K4.15.0_ICC19.0.0/x86_64-native-linuxapp-icc/eaf7da6477e94a7db61010a4bef17935/dpdk/mk/rte.sdkroot.mk:98: recipe for target 'all' failed
make[2]: *** [all] Error 2
/tmp/UB1804-64_K4.15.0_ICC19.0.0/x86_64-native-linuxapp-icc/eaf7da6477e94a7db61010a4bef17935/dpdk/mk/rte.sdkinstall.mk:60: recipe for target 'pre_install' failed
make[1]: *** [pre_install] Error 2
/tmp/UB1804-64_K4.15.0_ICC19.0.0/x86_64-native-linuxapp-icc/eaf7da6477e94a7db61010a4bef17935/dpdk/mk/rte.sdkroot.mk:77: recipe for target 'install' failed
make: *** [install] Error 2


*Make Build Failed #5:
OS: UB1804-64
Target: x86_64-native-linuxapp-clang
                                              RTE_FLOW_ITEM_TYPE_MPLS
/tmp/UB1804-64_K4.15.0_Clang6.0.0/x86_64-native-linuxapp-clang/eaf7da6477e94a7db61010a4bef17935/dpdk/x86_64-native-linuxapp-clang/include/rte_flow.h:283:2: note: 'RTE_FLOW_ITEM_TYPE_MPLS' declared here
        RTE_FLOW_ITEM_TYPE_MPLS,
        ^
5 errors generated.
/tmp/UB1804-64_K4.15.0_Clang6.0.0/x86_64-native-linuxapp-clang/eaf7da6477e94a7db61010a4bef17935/dpdk/mk/internal/rte.compile-pre.mk:114: recipe for target 'ice_switch_filter.o' failed
make[6]: *** [ice_switch_filter.o] Error 1
make[6]: *** Waiting for unfinished jobs....
  CC bnxt_txr.o
/tmp/UB1804-64_K4.15.0_Clang6.0.0/x86_64-native-linuxapp-clang/eaf7da6477e94a7db61010a4bef17935/dpdk/mk/rte.subdir.mk:35: recipe for target 'ice' failed
make[5]: *** [ice] Error 2
make[5]: *** Waiting for unfinished jobs....
  CC bnxt_vnic.o
  CC otx2_link.o
  CC bnxt_irq.o
  CC bnxt_util.o
--
  PMDINFO qede_ethdev.o.pmd.c
  CC qede_ethdev.o.pmd.o
  LD qede_ethdev.o
  AR librte_pmd_qede.a
  INSTALL-LIB librte_pmd_qede.a
/tmp/UB1804-64_K4.15.0_Clang6.0.0/x86_64-native-linuxapp-clang/eaf7da6477e94a7db61010a4bef17935/dpdk/mk/rte.subdir.mk:35: recipe for target 'net' failed
make[4]: *** [net] Error 2
/tmp/UB1804-64_K4.15.0_Clang6.0.0/x86_64-native-linuxapp-clang/eaf7da6477e94a7db61010a4bef17935/dpdk/mk/rte.sdkbuild.mk:46: recipe for target 'drivers' failed
make[3]: *** [drivers] Error 2
/tmp/UB1804-64_K4.15.0_Clang6.0.0/x86_64-native-linuxapp-clang/eaf7da6477e94a7db61010a4bef17935/dpdk/mk/rte.sdkroot.mk:98: recipe for target 'all' failed
make[2]: *** [all] Error 2
/tmp/UB1804-64_K4.15.0_Clang6.0.0/x86_64-native-linuxapp-clang/eaf7da6477e94a7db61010a4bef17935/dpdk/mk/rte.sdkinstall.mk:60: recipe for target 'pre_install' failed
make[1]: *** [pre_install] Error 2
/tmp/UB1804-64_K4.15.0_Clang6.0.0/x86_64-native-linuxapp-clang/eaf7da6477e94a7db61010a4bef17935/dpdk/mk/rte.sdkroot.mk:77: recipe for target 'install' failed
make: *** [install] Error 2


*Make Build Failed #6:
OS: SUSE15-64
Target: x86_64-native-linuxapp-gcc
     item->type == RTE_FLOW_ITEM_TYPE_PPPOES)
                   ^~~~~~~~~~~~~~~~~~~~~~~~~
                   RTE_FLOW_ITEM_TYPE_PPPOED
/tmp/SUSE15-64_K4.12.14_GCC7.3.1/x86_64-native-linuxapp-gcc/eaf7da6477e94a7db61010a4bef17935/dpdk/drivers/net/ice/ice_switch_filter.c: At top level:
cc1: warning: unrecognized command line option ‘-Wno-address-of-packed-member’
make[6]: *** [/tmp/SUSE15-64_K4.12.14_GCC7.3.1/x86_64-native-linuxapp-gcc/eaf7da6477e94a7db61010a4bef17935/dpdk/mk/internal/rte.compile-pre.mk:114: ice_switch_filter.o] Error 1
make[6]: *** Waiting for unfinished jobs....
  CC i40e_rxtx.o
== Build drivers/net/null
  CC lio_ethdev.o
  SYMLINK-FILE include/rte_pmd_ixgbe.h
  CC rte_eth_memif.o
  CC ixgbe_common.o
  CC hn_ethdev.o
make[5]: *** [/tmp/SUSE15-64_K4.12.14_GCC7.3.1/x86_64-native-linuxapp-gcc/eaf7da6477e94a7db61010a4bef17935/dpdk/mk/rte.subdir.mk:37: ice] Error 2
make[5]: *** Waiting for unfinished jobs....
  CC memif_socket.o
  CC nfp_cppcore.o
  SYMLINK-FILE include/rte_pmd_bnxt.h
  CC bnxt_cpr.o
--
  PMDINFO ixgbe_ethdev.o.pmd.c
  CC ixgbe_ethdev.o.pmd.o
  LD ixgbe_ethdev.o
  AR librte_pmd_ixgbe.a
  INSTALL-LIB librte_pmd_ixgbe.a
make[4]: *** [/tmp/SUSE15-64_K4.12.14_GCC7.3.1/x86_64-native-linuxapp-gcc/eaf7da6477e94a7db61010a4bef17935/dpdk/mk/rte.subdir.mk:35: net] Error 2
make[3]: *** [/tmp/SUSE15-64_K4.12.14_GCC7.3.1/x86_64-native-linuxapp-gcc/eaf7da6477e94a7db61010a4bef17935/dpdk/mk/rte.sdkbuild.mk:46: drivers] Error 2
make[2]: *** [/tmp/SUSE15-64_K4.12.14_GCC7.3.1/x86_64-native-linuxapp-gcc/eaf7da6477e94a7db61010a4bef17935/dpdk/mk/rte.sdkroot.mk:99: all] Error 2
make[1]: *** [/tmp/SUSE15-64_K4.12.14_GCC7.3.1/x86_64-native-linuxapp-gcc/eaf7da6477e94a7db61010a4bef17935/dpdk/mk/rte.sdkinstall.mk:61: pre_install] Error 2
make: *** [/tmp/SUSE15-64_K4.12.14_GCC7.3.1/x86_64-native-linuxapp-gcc/eaf7da6477e94a7db61010a4bef17935/dpdk/mk/rte.sdkroot.mk:77: install] Error 2


*Make Build Failed #7:
OS: FC30-64
Target: x86_64-native-linuxapp-gcc
/tmp/FC30-64_K4.20_GCC9.1.1/x86_64-native-linuxapp-gcc/eaf7da6477e94a7db61010a4bef17935/dpdk/drivers/net/ice/ice_switch_filter.c:1024:19: error: ‘RTE_FLOW_ITEM_TYPE_PPPOES’ undeclared (first use in this function); did you mean ‘RTE_FLOW_ITEM_TYPE_MPLS’?
 1024 |     item->type == RTE_FLOW_ITEM_TYPE_PPPOES)
      |                   ^~~~~~~~~~~~~~~~~~~~~~~~~
      |                   RTE_FLOW_ITEM_TYPE_MPLS
  CC i40e_vf_representor.o
make[6]: *** [/tmp/FC30-64_K4.20_GCC9.1.1/x86_64-native-linuxapp-gcc/eaf7da6477e94a7db61010a4bef17935/dpdk/mk/internal/rte.compile-pre.mk:114: ice_switch_filter.o] Error 1
make[6]: *** Waiting for unfinished jobs....
  CC otx2_link.o
  CC otx2_vlan.o
  CC ice_rxtx_vec_avx2.o
  CC otx2_stats.o
--
  CC ecore_dcbx.o
  AR librte_pmd_octeontx2.a
  INSTALL-LIB librte_pmd_octeontx2.a
  CC bcm_osal.o
  CC ecore_sriov.o
make[5]: *** [/tmp/FC30-64_K4.20_GCC9.1.1/x86_64-native-linuxapp-gcc/eaf7da6477e94a7db61010a4bef17935/dpdk/mk/rte.subdir.mk:35: ice] Error 2
make[5]: *** Waiting for unfinished jobs....
== Build drivers/net/sfc
  CC ecore_vf.o
  CC qede_ethdev.o
  CC qede_main.o
--
  CC hunt_nic.o
  CC medford_nic.o
  CC medford2_nic.o
  AR librte_pmd_sfc_efx.a
  INSTALL-LIB librte_pmd_sfc_efx.a
make[4]: *** [/tmp/FC30-64_K4.20_GCC9.1.1/x86_64-native-linuxapp-gcc/eaf7da6477e94a7db61010a4bef17935/dpdk/mk/rte.subdir.mk:35: net] Error 2
make[3]: *** [/tmp/FC30-64_K4.20_GCC9.1.1/x86_64-native-linuxapp-gcc/eaf7da6477e94a7db61010a4bef17935/dpdk/mk/rte.sdkbuild.mk:46: drivers] Error 2
make[2]: *** [/tmp/FC30-64_K4.20_GCC9.1.1/x86_64-native-linuxapp-gcc/eaf7da6477e94a7db61010a4bef17935/dpdk/mk/rte.sdkroot.mk:99: all] Error 2
make[1]: *** [/tmp/FC30-64_K4.20_GCC9.1.1/x86_64-native-linuxapp-gcc/eaf7da6477e94a7db61010a4bef17935/dpdk/mk/rte.sdkinstall.mk:61: pre_install] Error 2
make: *** [/tmp/FC30-64_K4.20_GCC9.1.1/x86_64-native-linuxapp-gcc/eaf7da6477e94a7db61010a4bef17935/dpdk/mk/rte.sdkroot.mk:77: install] Error 2


*Make Build Failed #8:
OS: RHEL76-64
Target: x86_64-native-linuxapp-gcc
/tmp/RHEL76-64_K3.10.0_GCC4.8.5/x86_64-native-linuxapp-gcc/eaf7da6477e94a7db61010a4bef17935/dpdk/drivers/net/ice/ice_switch_filter.c:1024:19: error: ‘RTE_FLOW_ITEM_TYPE_PPPOES’ undeclared (first use in this function)
     item->type == RTE_FLOW_ITEM_TYPE_PPPOES)
                   ^
/tmp/RHEL76-64_K3.10.0_GCC4.8.5/x86_64-native-linuxapp-gcc/eaf7da6477e94a7db61010a4bef17935/dpdk/drivers/net/ice/ice_switch_filter.c: At top level:
cc1: warning: unrecognized command line option "-Wno-address-of-packed-member" [enabled by default]
make[6]: *** [ice_switch_filter.o] Error 1
make[5]: *** [ice] Error 2
make[5]: *** Waiting for unfinished jobs....
  CC ecore_hw.o
  CC otx2_tx.o
  LD rte_eth_pcap.o
  CC sfc_ethdev.o
--
  CC medford2_nic.o
  AR librte_pmd_qede.a
  INSTALL-LIB librte_pmd_qede.a
  AR librte_pmd_sfc_efx.a
  INSTALL-LIB librte_pmd_sfc_efx.a
make[4]: *** [net] Error 2
make[3]: *** [drivers] Error 2
make[2]: *** [all] Error 2
make[1]: *** [pre_install] Error 2
make: *** [install] Error 2


*Make Build Failed #9:
OS: FC30-64
Target: x86_64-native-linuxapp-clang
                                              RTE_FLOW_ITEM_TYPE_MPLS
/tmp/FC30-64_K4.20_Clang8.0.0/x86_64-native-linuxapp-clang/eaf7da6477e94a7db61010a4bef17935/dpdk/x86_64-native-linuxapp-clang/include/rte_flow.h:283:2: note: 'RTE_FLOW_ITEM_TYPE_MPLS' declared here
        RTE_FLOW_ITEM_TYPE_MPLS,
        ^
5 errors generated.
make[6]: *** [/tmp/FC30-64_K4.20_Clang8.0.0/x86_64-native-linuxapp-clang/eaf7da6477e94a7db61010a4bef17935/dpdk/mk/internal/rte.compile-pre.mk:116: ice_switch_filter.o] Error 1
make[6]: *** Waiting for unfinished jobs....
  CC nfp_nsp.o
  CC bnxt_ring.o
  CC nfp_nsp_cmds.o
  CC nfp_nsp_eth.o
--
        ^~~~~~~~~~~~~~~~~~~~~~~~~
        RTE_FLOW_ITEM_TYPE_MPLS
/tmp/FC30-64_K4.20_Clang8.0.0/x86_64-native-linuxapp-clang/eaf7da6477e94a7db61010a4bef17935/dpdk/x86_64-native-linuxapp-clang/include/rte_flow.h:283:2: note: 'RTE_FLOW_ITEM_TYPE_MPLS' declared here
        RTE_FLOW_ITEM_TYPE_MPLS,
        ^
fatal error: too many errors emitted, stopping now [-ferror-limit=]
20 errors generated.
make[6]: *** [/tmp/FC30-64_K4.20_Clang8.0.0/x86_64-native-linuxapp-clang/eaf7da6477e94a7db61010a4bef17935/dpdk/mk/internal/rte.compile-pre.mk:116: ice_generic_flow.o] Error 1
== Build drivers/net/qede
make[5]: *** [/tmp/FC30-64_K4.20_Clang8.0.0/x86_64-native-linuxapp-clang/eaf7da6477e94a7db61010a4bef17935/dpdk/mk/rte.subdir.mk:37: ice] Error 2
make[5]: *** Waiting for unfinished jobs....
  CC otx2_tm.o
  CC rte_eth_pcap.o
  CC ixgbe_dcb_82599.o
  CC ixgbe_dcb_82598.o
--
  CC ixgbe_vf_representor.o
  AR librte_pmd_octeontx2.a
  INSTALL-LIB librte_pmd_octeontx2.a
  AR librte_pmd_ixgbe.a
  INSTALL-LIB librte_pmd_ixgbe.a
make[4]: *** [/tmp/FC30-64_K4.20_Clang8.0.0/x86_64-native-linuxapp-clang/eaf7da6477e94a7db61010a4bef17935/dpdk/mk/rte.subdir.mk:35: net] Error 2
make[3]: *** [/tmp/FC30-64_K4.20_Clang8.0.0/x86_64-native-linuxapp-clang/eaf7da6477e94a7db61010a4bef17935/dpdk/mk/rte.sdkbuild.mk:46: drivers] Error 2
make[2]: *** [/tmp/FC30-64_K4.20_Clang8.0.0/x86_64-native-linuxapp-clang/eaf7da6477e94a7db61010a4bef17935/dpdk/mk/rte.sdkroot.mk:99: all] Error 2
make[1]: *** [/tmp/FC30-64_K4.20_Clang8.0.0/x86_64-native-linuxapp-clang/eaf7da6477e94a7db61010a4bef17935/dpdk/mk/rte.sdkinstall.mk:61: pre_install] Error 2
make: *** [/tmp/FC30-64_K4.20_Clang8.0.0/x86_64-native-linuxapp-clang/eaf7da6477e94a7db61010a4bef17935/dpdk/mk/rte.sdkroot.mk:77: install] Error 2


*Make Build Failed #10:
OS: RHEL80-64
Target: x86_64-native-linuxapp-gcc
                   ^~~~~~~~~~~~~~~~~~~~~~~~~
                   RTE_FLOW_ITEM_TYPE_MPLS
/tmp/RHEL80-64_K3.10.0_GCC8.2.1/x86_64-native-linuxapp-gcc/eaf7da6477e94a7db61010a4bef17935/dpdk/drivers/net/ice/ice_switch_filter.c: At top level:
cc1: warning: unrecognized command line option ‘-Wno-address-of-packed-member’
  CC nicvf_hw.o
make[6]: *** [/tmp/RHEL80-64_K3.10.0_GCC8.2.1/x86_64-native-linuxapp-gcc/eaf7da6477e94a7db61010a4bef17935/dpdk/mk/internal/rte.compile-pre.mk:114: ice_switch_filter.o] Error 1
make[5]: *** [/tmp/RHEL80-64_K3.10.0_GCC8.2.1/x86_64-native-linuxapp-gcc/eaf7da6477e94a7db61010a4bef17935/dpdk/mk/rte.subdir.mk:35: ice] Error 2
make[5]: *** Waiting for unfinished jobs....
  CC tap_flow.o
  CC tap_netlink.o
  CC bnxt_stats.o
  CC bnxt_txq.o
--
  CC hunt_nic.o
  CC medford_nic.o
  CC medford2_nic.o
  AR librte_pmd_sfc_efx.a
  INSTALL-LIB librte_pmd_sfc_efx.a
make[4]: *** [/tmp/RHEL80-64_K3.10.0_GCC8.2.1/x86_64-native-linuxapp-gcc/eaf7da6477e94a7db61010a4bef17935/dpdk/mk/rte.subdir.mk:35: net] Error 2
make[3]: *** [/tmp/RHEL80-64_K3.10.0_GCC8.2.1/x86_64-native-linuxapp-gcc/eaf7da6477e94a7db61010a4bef17935/dpdk/mk/rte.sdkbuild.mk:46: drivers] Error 2
make[2]: *** [/tmp/RHEL80-64_K3.10.0_GCC8.2.1/x86_64-native-linuxapp-gcc/eaf7da6477e94a7db61010a4bef17935/dpdk/mk/rte.sdkroot.mk:99: all] Error 2
make[1]: *** [/tmp/RHEL80-64_K3.10.0_GCC8.2.1/x86_64-native-linuxapp-gcc/eaf7da6477e94a7db61010a4bef17935/dpdk/mk/rte.sdkinstall.mk:61: pre_install] Error 2
make: *** [/tmp/RHEL80-64_K3.10.0_GCC8.2.1/x86_64-native-linuxapp-gcc/eaf7da6477e94a7db61010a4bef17935/dpdk/mk/rte.sdkroot.mk:77: install] Error 2


*Make Build Failed #11:
OS: SUSE15-64
Target: x86_64-native-linuxapp-clang
  CC rte_eth_null.o.pmd.o
  LD rte_eth_null.o
  AR librte_pmd_null.a
  CC bnxt_hwrm.o
  INSTALL-LIB librte_pmd_null.a
make[6]: *** [/tmp/SUSE15-64_K4.12.14_Clang5.0.1/x86_64-native-linuxapp-clang/eaf7da6477e94a7db61010a4bef17935/dpdk/mk/internal/rte.compile-pre.mk:114: ice_switch_filter.o] Error 1
make[6]: *** Waiting for unfinished jobs....
  CC ice_generic_flow.o
  CC ixgbe_fdir.o
  CC otx2_tx.o
/tmp/SUSE15-64_K4.12.14_Clang5.0.1/x86_64-native-linuxapp-clang/eaf7da6477e94a7db61010a4bef17935/dpdk/drivers/net/ice/ice_generic_flow.c:1042:2: error: use of undeclared identifier 'RTE_FLOW_ITEM_TYPE_GTP_PSC'; did you mean 'RTE_FLOW_ITEM_TYPE_GTPC'?
--
        RTE_FLOW_ITEM_TYPE_MPLS
/tmp/SUSE15-64_K4.12.14_Clang5.0.1/x86_64-native-linuxapp-clang/eaf7da6477e94a7db61010a4bef17935/dpdk/x86_64-native-linuxapp-clang/include/rte_flow.h:283:2: note: 'RTE_FLOW_ITEM_TYPE_MPLS' declared here
        RTE_FLOW_ITEM_TYPE_MPLS,
        ^
  LD octeontx_pkovf.o
fatal error: too many errors emitted, stopping now [-ferror-limit=]
20 errors generated.
make[6]: *** [/tmp/SUSE15-64_K4.12.14_Clang5.0.1/x86_64-native-linuxapp-clang/eaf7da6477e94a7db61010a4bef17935/dpdk/mk/internal/rte.compile-pre.mk:116: ice_generic_flow.o] Error 1
make[5]: *** [/tmp/SUSE15-64_K4.12.14_Clang5.0.1/x86_64-native-linuxapp-clang/eaf7da6477e94a7db61010a4bef17935/dpdk/mk/rte.subdir.mk:35: ice] Error 2
make[5]: *** Waiting for unfinished jobs....
  CC rte_pmd_i40e.o
  CC octeontx_pkivf.o
  CC nfp_nsp_eth.o
  CC i40e_tm.o
--
  INSTALL-LIB librte_pmd_octeontx2.a
  AR librte_pmd_ixgbe.a
  INSTALL-LIB librte_pmd_ixgbe.a
  AR librte_pmd_bnxt.a
  INSTALL-LIB librte_pmd_bnxt.a
make[4]: *** [/tmp/SUSE15-64_K4.12.14_Clang5.0.1/x86_64-native-linuxapp-clang/eaf7da6477e94a7db61010a4bef17935/dpdk/mk/rte.subdir.mk:35: net] Error 2
make[3]: *** [/tmp/SUSE15-64_K4.12.14_Clang5.0.1/x86_64-native-linuxapp-clang/eaf7da6477e94a7db61010a4bef17935/dpdk/mk/rte.sdkbuild.mk:46: drivers] Error 2
make[2]: *** [/tmp/SUSE15-64_K4.12.14_Clang5.0.1/x86_64-native-linuxapp-clang/eaf7da6477e94a7db61010a4bef17935/dpdk/mk/rte.sdkroot.mk:99: all] Error 2
make[1]: *** [/tmp/SUSE15-64_K4.12.14_Clang5.0.1/x86_64-native-linuxapp-clang/eaf7da6477e94a7db61010a4bef17935/dpdk/mk/rte.sdkinstall.mk:61: pre_install] Error 2
make: *** [/tmp/SUSE15-64_K4.12.14_Clang5.0.1/x86_64-native-linuxapp-clang/eaf7da6477e94a7db61010a4bef17935/dpdk/mk/rte.sdkroot.mk:77: install] Error 2


*Make Build Failed #12:
OS: UB1604-64
Target: x86_64-native-linuxapp-gcc
/tmp/UB1604-64_K4.4.0_GCC5.4.0/x86_64-native-linuxapp-gcc/eaf7da6477e94a7db61010a4bef17935/dpdk/drivers/net/ice/ice_switch_filter.c:1024:19: error: ‘RTE_FLOW_ITEM_TYPE_PPPOES’ undeclared (first use in this function)
     item->type == RTE_FLOW_ITEM_TYPE_PPPOES)
                   ^
/tmp/UB1604-64_K4.4.0_GCC5.4.0/x86_64-native-linuxapp-gcc/eaf7da6477e94a7db61010a4bef17935/dpdk/drivers/net/ice/ice_switch_filter.c: At top level:
cc1: warning: unrecognized command line option ‘-Wno-address-of-packed-member’
/tmp/UB1604-64_K4.4.0_GCC5.4.0/x86_64-native-linuxapp-gcc/eaf7da6477e94a7db61010a4bef17935/dpdk/mk/internal/rte.compile-pre.mk:114: recipe for target 'ice_switch_filter.o' failed
make[6]: *** [ice_switch_filter.o] Error 1
make[6]: *** Waiting for unfinished jobs....
  CC ixgbe_dcb_82599.o
  CC ixgbe_dcb_82598.o
  CC i40e_vf_representor.o
  CC i40e_rxtx_vec_avx2.o
--
  CC ixgbe_ethdev.o
  LD ice_ethdev.o
  CC ixgbe_fdir.o
  CC rte_eth_memif.o
  CC memif_socket.o
/tmp/UB1604-64_K4.4.0_GCC5.4.0/x86_64-native-linuxapp-gcc/eaf7da6477e94a7db61010a4bef17935/dpdk/mk/rte.subdir.mk:35: recipe for target 'ice' failed
make[5]: *** [ice] Error 2
make[5]: *** Waiting for unfinished jobs....
  CC ixgbe_pf.o
  CC hn_ethdev.o
  CC nfp_cppcore.o
  AR librte_pmd_i40e.a
--
  LD nfp_net.o
  AR librte_pmd_nfp.a
  INSTALL-LIB librte_pmd_nfp.a
  AR librte_pmd_bnxt.a
  INSTALL-LIB librte_pmd_bnxt.a
/tmp/UB1604-64_K4.4.0_GCC5.4.0/x86_64-native-linuxapp-gcc/eaf7da6477e94a7db61010a4bef17935/dpdk/mk/rte.subdir.mk:35: recipe for target 'net' failed
make[4]: *** [net] Error 2
/tmp/UB1604-64_K4.4.0_GCC5.4.0/x86_64-native-linuxapp-gcc/eaf7da6477e94a7db61010a4bef17935/dpdk/mk/rte.sdkbuild.mk:46: recipe for target 'drivers' failed
make[3]: *** [drivers] Error 2
/tmp/UB1604-64_K4.4.0_GCC5.4.0/x86_64-native-linuxapp-gcc/eaf7da6477e94a7db61010a4bef17935/dpdk/mk/rte.sdkroot.mk:98: recipe for target 'all' failed
make[2]: *** [all] Error 2
/tmp/UB1604-64_K4.4.0_GCC5.4.0/x86_64-native-linuxapp-gcc/eaf7da6477e94a7db61010a4bef17935/dpdk/mk/rte.sdkinstall.mk:60: recipe for target 'pre_install' failed
make[1]: *** [pre_install] Error 2
/tmp/UB1604-64_K4.4.0_GCC5.4.0/x86_64-native-linuxapp-gcc/eaf7da6477e94a7db61010a4bef17935/dpdk/mk/rte.sdkroot.mk:77: recipe for target 'install' failed
make: *** [install] Error 2


*Make Build Failed #13:
OS: UB1804-64
Target: x86_64-native-linuxapp-gcc
     item->type == RTE_FLOW_ITEM_TYPE_PPPOES)
                   ^~~~~~~~~~~~~~~~~~~~~~~~~
                   RTE_FLOW_ITEM_TYPE_PPPOED
/tmp/UB1804-64_K4.15.0_GCC7.3.0/x86_64-native-linuxapp-gcc/eaf7da6477e94a7db61010a4bef17935/dpdk/drivers/net/ice/ice_switch_filter.c: At top level:
cc1: warning: unrecognized command line option ‘-Wno-address-of-packed-member’
/tmp/UB1804-64_K4.15.0_GCC7.3.0/x86_64-native-linuxapp-gcc/eaf7da6477e94a7db61010a4bef17935/dpdk/mk/internal/rte.compile-pre.mk:114: recipe for target 'ice_switch_filter.o' failed
make[6]: *** [ice_switch_filter.o] Error 1
make[6]: *** Waiting for unfinished jobs....
  CC ixgbe_tm.o
  AR librte_pmd_memif.a
  CC nfp_mutex.o
  INSTALL-LIB librte_pmd_memif.a
--
  CC nfp_crc.o
  CC lio_23xx_vf.o
  CC nfp_mip.o
  CC ixgbe_vf_representor.o
  CC nfp_nffw.o
/tmp/UB1804-64_K4.15.0_GCC7.3.0/x86_64-native-linuxapp-gcc/eaf7da6477e94a7db61010a4bef17935/dpdk/mk/rte.subdir.mk:35: recipe for target 'ice' failed
make[5]: *** [ice] Error 2
make[5]: *** Waiting for unfinished jobs....
  CC lio_mbox.o
  CC nfp_hwinfo.o
  CC hn_vf.o
  CC nfp_rtsym.o
--
  PMDINFO nfp_net.o.pmd.c
  CC nfp_net.o.pmd.o
  LD nfp_net.o
  AR librte_pmd_nfp.a
  INSTALL-LIB librte_pmd_nfp.a
/tmp/UB1804-64_K4.15.0_GCC7.3.0/x86_64-native-linuxapp-gcc/eaf7da6477e94a7db61010a4bef17935/dpdk/mk/rte.subdir.mk:35: recipe for target 'net' failed
make[4]: *** [net] Error 2
/tmp/UB1804-64_K4.15.0_GCC7.3.0/x86_64-native-linuxapp-gcc/eaf7da6477e94a7db61010a4bef17935/dpdk/mk/rte.sdkbuild.mk:46: recipe for target 'drivers' failed
make[3]: *** [drivers] Error 2
/tmp/UB1804-64_K4.15.0_GCC7.3.0/x86_64-native-linuxapp-gcc/eaf7da6477e94a7db61010a4bef17935/dpdk/mk/rte.sdkroot.mk:98: recipe for target 'all' failed
make[2]: *** [all] Error 2
/tmp/UB1804-64_K4.15.0_GCC7.3.0/x86_64-native-linuxapp-gcc/eaf7da6477e94a7db61010a4bef17935/dpdk/mk/rte.sdkinstall.mk:60: recipe for target 'pre_install' failed
make[1]: *** [pre_install] Error 2
/tmp/UB1804-64_K4.15.0_GCC7.3.0/x86_64-native-linuxapp-gcc/eaf7da6477e94a7db61010a4bef17935/dpdk/mk/rte.sdkroot.mk:77: recipe for target 'install' failed
make: *** [install] Error 2


*Make Build Failed #14:
OS: CENTOS76-64
Target: x86_64-native-linuxapp-clang
                                              RTE_FLOW_ITEM_TYPE_MPLS
/tmp/CENTOS76-64_K3.10.0_Clang3.4.2/x86_64-native-linuxapp-clang/eaf7da6477e94a7db61010a4bef17935/dpdk/x86_64-native-linuxapp-clang/include/rte_flow.h:283:2: note: 'RTE_FLOW_ITEM_TYPE_MPLS' declared here
        RTE_FLOW_ITEM_TYPE_MPLS,
        ^
5 errors generated.
make[6]: *** [ice_switch_filter.o] Error 1
make[6]: *** Waiting for unfinished jobs....
  CC ice_rxtx_vec_avx2.o
  CC otx2_rss.o
  CC ixgbe_fdir.o
  PMDINFO rte_eth_pcap.o.pmd.c
--
  CC ixgbe_pf.o
  CC rte_eth_ring.o
  CC otx2_flow.o
  CC ixgbe_flow.o
  CC otx2_link.o
make[5]: *** [ice] Error 2
make[5]: *** Waiting for unfinished jobs....
  CC otx2_vlan.o
  CC ecore_hw.o
  PMDINFO rte_eth_ring.o.pmd.c
  CC rte_eth_ring.o.pmd.o
--
  PMDINFO qede_ethdev.o.pmd.c
  CC qede_ethdev.o.pmd.o
  LD qede_ethdev.o
  AR librte_pmd_qede.a
  INSTALL-LIB librte_pmd_qede.a
make[4]: *** [net] Error 2
make[3]: *** [drivers] Error 2
make[2]: *** [all] Error 2
make[1]: *** [pre_install] Error 2
make: *** [install] Error 2


*Make Build Failed #15:
OS: FreeBSD12-64
Target: x86_64-native-bsdapp-gcc+debug
     item->type == RTE_FLOW_ITEM_TYPE_PPPOES)
                   ^~~~~~~~~~~~~~~~~~~~~~~~~
                   RTE_FLOW_ITEM_TYPE_PPPOED
/tmp/FreeBSD12-64_K19.02_GCC7.3.0/x86_64-native-bsdapp-gcc+debug/eaf7da6477e94a7db61010a4bef17935/dpdk/drivers/net/ice/ice_switch_filter.c: At top level:
cc1: warning: unrecognized command line option '-Wno-address-of-packed-member'
gmake[6]: *** [/tmp/FreeBSD12-64_K19.02_GCC7.3.0/x86_64-native-bsdapp-gcc+debug/eaf7da6477e94a7db61010a4bef17935/dpdk/mk/internal/rte.compile-pre.mk:116: ice_switch_filter.o] Error 1
gmake[5]: *** [/tmp/FreeBSD12-64_K19.02_GCC7.3.0/x86_64-native-bsdapp-gcc+debug/eaf7da6477e94a7db61010a4bef17935/dpdk/mk/rte.subdir.mk:35: ice] Error 2
gmake[5]: *** Waiting for unfinished jobs....
  CC i40e_vf_representor.o
  CC bnxt_txq.o
  CC ixgbe_dcb_82598.o
  CC i40e_rxtx_vec_avx2.o
--
  CC hunt_nic.o
  CC medford_nic.o
  CC medford2_nic.o
  AR librte_pmd_sfc_efx.a
  INSTALL-LIB librte_pmd_sfc_efx.a
gmake[4]: *** [/tmp/FreeBSD12-64_K19.02_GCC7.3.0/x86_64-native-bsdapp-gcc+debug/eaf7da6477e94a7db61010a4bef17935/dpdk/mk/rte.subdir.mk:35: net] Error 2
gmake[3]: *** [/tmp/FreeBSD12-64_K19.02_GCC7.3.0/x86_64-native-bsdapp-gcc+debug/eaf7da6477e94a7db61010a4bef17935/dpdk/mk/rte.sdkbuild.mk:46: drivers] Error 2
gmake[2]: *** [/tmp/FreeBSD12-64_K19.02_GCC7.3.0/x86_64-native-bsdapp-gcc+debug/eaf7da6477e94a7db61010a4bef17935/dpdk/mk/rte.sdkroot.mk:99: all] Error 2
gmake[1]: *** [/tmp/FreeBSD12-64_K19.02_GCC7.3.0/x86_64-native-bsdapp-gcc+debug/eaf7da6477e94a7db61010a4bef17935/dpdk/mk/rte.sdkinstall.mk:61: pre_install] Error 2
gmake: *** [/tmp/FreeBSD12-64_K19.02_GCC7.3.0/x86_64-native-bsdapp-gcc+debug/eaf7da6477e94a7db61010a4bef17935/dpdk/mk/rte.sdkroot.mk:77: install] Error 2


*Make Build Failed #16:
OS: CENTOS76-64
Target: x86_64-native-linuxapp-gcc
/tmp/CENTOS76-64_K3.10.0_GCC4.8.5/x86_64-native-linuxapp-gcc/eaf7da6477e94a7db61010a4bef17935/dpdk/drivers/net/ice/ice_switch_filter.c:1024:19: error: ‘RTE_FLOW_ITEM_TYPE_PPPOES’ undeclared (first use in this function)
     item->type == RTE_FLOW_ITEM_TYPE_PPPOES)
                   ^
/tmp/CENTOS76-64_K3.10.0_GCC4.8.5/x86_64-native-linuxapp-gcc/eaf7da6477e94a7db61010a4bef17935/dpdk/drivers/net/ice/ice_switch_filter.c: At top level:
cc1: warning: unrecognized command line option "-Wno-address-of-packed-member" [enabled by default]
make[6]: *** [ice_switch_filter.o] Error 1
make[6]: *** Waiting for unfinished jobs....
  CC nfp_net.o
make[5]: *** [ice] Error 2
make[5]: *** Waiting for unfinished jobs....
  CC bnxt_stats.o
  CC ixgbe_dcb.o
  CC octeontx_rxtx.o
  CC bnxt_txq.o
--
  PMDINFO otx2_ethdev.o.pmd.c
  CC otx2_ethdev.o.pmd.o
  LD otx2_ethdev.o
  AR librte_pmd_octeontx2.a
  INSTALL-LIB librte_pmd_octeontx2.a
make[4]: *** [net] Error 2
make[3]: *** [drivers] Error 2
make[2]: *** [all] Error 2
make[1]: *** [pre_install] Error 2
make: *** [install] Error 2


*Make Build Failed #17:
OS: FreeBSD12-64
Target: x86_64-native-bsdapp-gcc+shared
     item->type == RTE_FLOW_ITEM_TYPE_PPPOES)
                   ^~~~~~~~~~~~~~~~~~~~~~~~~
                   RTE_FLOW_ITEM_TYPE_PPPOED
/tmp/FreeBSD12-64_K19.02_GCC7.3.0/x86_64-native-bsdapp-gcc+shared/eaf7da6477e94a7db61010a4bef17935/dpdk/drivers/net/ice/ice_switch_filter.c: At top level:
cc1: warning: unrecognized command line option '-Wno-address-of-packed-member'
gmake[6]: *** [/tmp/FreeBSD12-64_K19.02_GCC7.3.0/x86_64-native-bsdapp-gcc+shared/eaf7da6477e94a7db61010a4bef17935/dpdk/mk/internal/rte.compile-pre.mk:116: ice_switch_filter.o] Error 1
gmake[5]: *** [/tmp/FreeBSD12-64_K19.02_GCC7.3.0/x86_64-native-bsdapp-gcc+shared/eaf7da6477e94a7db61010a4bef17935/dpdk/mk/rte.subdir.mk:35: ice] Error 2
gmake[5]: *** Waiting for unfinished jobs....
  CC ecore_dev.o
  CC i40e_tm.o
  CC em_rxtx.o
  CC rte_eth_ring.o
--
  LD qede_ethdev.o
  LD librte_pmd_ixgbe.so.2.1
  INSTALL-LIB librte_pmd_ixgbe.so.2.1
  LD librte_pmd_qede.so.1.1
  INSTALL-LIB librte_pmd_qede.so.1.1
gmake[4]: *** [/tmp/FreeBSD12-64_K19.02_GCC7.3.0/x86_64-native-bsdapp-gcc+shared/eaf7da6477e94a7db61010a4bef17935/dpdk/mk/rte.subdir.mk:35: net] Error 2
gmake[3]: *** [/tmp/FreeBSD12-64_K19.02_GCC7.3.0/x86_64-native-bsdapp-gcc+shared/eaf7da6477e94a7db61010a4bef17935/dpdk/mk/rte.sdkbuild.mk:46: drivers] Error 2
gmake[2]: *** [/tmp/FreeBSD12-64_K19.02_GCC7.3.0/x86_64-native-bsdapp-gcc+shared/eaf7da6477e94a7db61010a4bef17935/dpdk/mk/rte.sdkroot.mk:99: all] Error 2
gmake[1]: *** [/tmp/FreeBSD12-64_K19.02_GCC7.3.0/x86_64-native-bsdapp-gcc+shared/eaf7da6477e94a7db61010a4bef17935/dpdk/mk/rte.sdkinstall.mk:61: pre_install] Error 2
gmake: *** [/tmp/FreeBSD12-64_K19.02_GCC7.3.0/x86_64-native-bsdapp-gcc+shared/eaf7da6477e94a7db61010a4bef17935/dpdk/mk/rte.sdkroot.mk:77: install] Error 2


*Make Build Failed #18:
OS: FreeBSD12-64
Target: x86_64-native-bsdapp-clang
                                              RTE_FLOW_ITEM_TYPE_MPLS
/tmp/FreeBSD12-64_K19.02_Clang6.0.1/x86_64-native-bsdapp-clang/eaf7da6477e94a7db61010a4bef17935/dpdk/x86_64-native-bsdapp-clang/include/rte_flow.h:283:2: note: 'RTE_FLOW_ITEM_TYPE_MPLS' declared here
        RTE_FLOW_ITEM_TYPE_MPLS,
        ^
5 errors generated.
gmake[6]: *** [/tmp/FreeBSD12-64_K19.02_Clang6.0.1/x86_64-native-bsdapp-clang/eaf7da6477e94a7db61010a4bef17935/dpdk/mk/internal/rte.compile-pre.mk:114: ice_switch_filter.o] Error 1
gmake[6]: *** Waiting for unfinished jobs....
== Build drivers/net/ring
  PMDINFO rte_eth_pcap.o.pmd.c
  CC otx2_tx.o
  CC rte_eth_pcap.o.pmd.o
--
  CC otx2_tm.o
  CC i40e_tm.o
  CC ixgbe_dcb_82598.o
== Build drivers/net/sfc
  CC i40e_vf_representor.o
gmake[5]: *** [/tmp/FreeBSD12-64_K19.02_Clang6.0.1/x86_64-native-bsdapp-clang/eaf7da6477e94a7db61010a4bef17935/dpdk/mk/rte.subdir.mk:37: ice] Error 2
gmake[5]: *** Waiting for unfinished jobs....
  CC bnxt_util.o
  CC ixgbe_mbx.o
  CC sfc_ethdev.o
  PMDINFO rte_eth_ring.o.pmd.c
--
  CC hunt_nic.o
  CC medford2_nic.o
  CC medford_nic.o
  AR librte_pmd_sfc_efx.a
  INSTALL-LIB librte_pmd_sfc_efx.a
gmake[4]: *** [/tmp/FreeBSD12-64_K19.02_Clang6.0.1/x86_64-native-bsdapp-clang/eaf7da6477e94a7db61010a4bef17935/dpdk/mk/rte.subdir.mk:35: net] Error 2
gmake[3]: *** [/tmp/FreeBSD12-64_K19.02_Clang6.0.1/x86_64-native-bsdapp-clang/eaf7da6477e94a7db61010a4bef17935/dpdk/mk/rte.sdkbuild.mk:46: drivers] Error 2
gmake[2]: *** [/tmp/FreeBSD12-64_K19.02_Clang6.0.1/x86_64-native-bsdapp-clang/eaf7da6477e94a7db61010a4bef17935/dpdk/mk/rte.sdkroot.mk:99: all] Error 2
gmake[1]: *** [/tmp/FreeBSD12-64_K19.02_Clang6.0.1/x86_64-native-bsdapp-clang/eaf7da6477e94a7db61010a4bef17935/dpdk/mk/rte.sdkinstall.mk:61: pre_install] Error 2
gmake: *** [/tmp/FreeBSD12-64_K19.02_Clang6.0.1/x86_64-native-bsdapp-clang/eaf7da6477e94a7db61010a4bef17935/dpdk/mk/rte.sdkroot.mk:77: install] Error 2


*Make Build Failed #19:
OS: CENTOS76-64
Target: x86_64-native-linuxapp-gcc+debug
/tmp/CENTOS76-64_K3.10.0_GCC4.8.5/x86_64-native-linuxapp-gcc+debug/eaf7da6477e94a7db61010a4bef17935/dpdk/drivers/net/ice/ice_switch_filter.c:1024:19: error: ‘RTE_FLOW_ITEM_TYPE_PPPOES’ undeclared (first use in this function)
     item->type == RTE_FLOW_ITEM_TYPE_PPPOES)
                   ^
/tmp/CENTOS76-64_K3.10.0_GCC4.8.5/x86_64-native-linuxapp-gcc+debug/eaf7da6477e94a7db61010a4bef17935/dpdk/drivers/net/ice/ice_switch_filter.c: At top level:
cc1: warning: unrecognized command line option "-Wno-address-of-packed-member" [enabled by default]
make[6]: *** [ice_switch_filter.o] Error 1
make[5]: *** [ice] Error 2
make[5]: *** Waiting for unfinished jobs....
  PMDINFO i40e_ethdev_vf.o.pmd.c
  CC i40e_ethdev_vf.o.pmd.o
  CC tap_flow.o
  CC nicvf_ethdev.o
--
  CC hunt_nic.o
  CC medford_nic.o
  CC medford2_nic.o
  AR librte_pmd_sfc_efx.a
  INSTALL-LIB librte_pmd_sfc_efx.a
make[4]: *** [net] Error 2
make[3]: *** [drivers] Error 2
make[2]: *** [all] Error 2
make[1]: *** [pre_install] Error 2
make: *** [install] Error 2


*Make Build Failed #20:
OS: FreeBSD12-64
Target: x86_64-native-bsdapp-gcc
     item->type == RTE_FLOW_ITEM_TYPE_PPPOES)
                   ^~~~~~~~~~~~~~~~~~~~~~~~~
                   RTE_FLOW_ITEM_TYPE_PPPOED
/tmp/FreeBSD12-64_K19.02_GCC7.3.0/x86_64-native-bsdapp-gcc/eaf7da6477e94a7db61010a4bef17935/dpdk/drivers/net/ice/ice_switch_filter.c: At top level:
cc1: warning: unrecognized command line option '-Wno-address-of-packed-member'
gmake[6]: *** [/tmp/FreeBSD12-64_K19.02_GCC7.3.0/x86_64-native-bsdapp-gcc/eaf7da6477e94a7db61010a4bef17935/dpdk/mk/internal/rte.compile-pre.mk:116: ice_switch_filter.o] Error 1
  CC otx2_rss.o
gmake[6]: *** Waiting for unfinished jobs....
  CC ixgbe_rxtx.o
  CC bnxt_util.o
== Build drivers/net/sfc
  CC i40e_rxtx_vec_avx2.o
  SYMLINK-FILE include/rte_eth_ring.h
  CC rte_eth_ring.o
gmake[5]: *** [/tmp/FreeBSD12-64_K19.02_GCC7.3.0/x86_64-native-bsdapp-gcc/eaf7da6477e94a7db61010a4bef17935/dpdk/mk/rte.subdir.mk:37: ice] Error 2
gmake[5]: *** Waiting for unfinished jobs....
  CC otx2_mac.o
  CC otx2_ptp.o
  CC rte_pmd_bnxt.o
  CC ixgbe_ethdev.o
--
  CC hunt_nic.o
  CC medford_nic.o
  CC medford2_nic.o
  AR librte_pmd_sfc_efx.a
  INSTALL-LIB librte_pmd_sfc_efx.a
gmake[4]: *** [/tmp/FreeBSD12-64_K19.02_GCC7.3.0/x86_64-native-bsdapp-gcc/eaf7da6477e94a7db61010a4bef17935/dpdk/mk/rte.subdir.mk:35: net] Error 2
gmake[3]: *** [/tmp/FreeBSD12-64_K19.02_GCC7.3.0/x86_64-native-bsdapp-gcc/eaf7da6477e94a7db61010a4bef17935/dpdk/mk/rte.sdkbuild.mk:46: drivers] Error 2
gmake[2]: *** [/tmp/FreeBSD12-64_K19.02_GCC7.3.0/x86_64-native-bsdapp-gcc/eaf7da6477e94a7db61010a4bef17935/dpdk/mk/rte.sdkroot.mk:99: all] Error 2
gmake[1]: *** [/tmp/FreeBSD12-64_K19.02_GCC7.3.0/x86_64-native-bsdapp-gcc/eaf7da6477e94a7db61010a4bef17935/dpdk/mk/rte.sdkinstall.mk:61: pre_install] Error 2
gmake: *** [/tmp/FreeBSD12-64_K19.02_GCC7.3.0/x86_64-native-bsdapp-gcc/eaf7da6477e94a7db61010a4bef17935/dpdk/mk/rte.sdkroot.mk:77: install] Error 2


*Make Build Failed #21:
OS: CENTOS76-64
Target: x86_64-native-linuxapp-icc
/tmp/CENTOS76-64_K3.10.0_ICC19.0.0/x86_64-native-linuxapp-icc/eaf7da6477e94a7db61010a4bef17935/dpdk/drivers/net/ice/ice_switch_filter.c(1024): error: identifier "RTE_FLOW_ITEM_TYPE_PPPOES" is undefined
  				item->type == RTE_FLOW_ITEM_TYPE_PPPOES)
  				              ^

compilation aborted for /tmp/CENTOS76-64_K3.10.0_ICC19.0.0/x86_64-native-linuxapp-icc/eaf7da6477e94a7db61010a4bef17935/dpdk/drivers/net/ice/ice_switch_filter.c (code 2)
make[6]: *** [ice_switch_filter.o] Error 2
make[6]: *** Waiting for unfinished jobs....
  CC ecore_l2.o
  AR librte_pmd_bnxt.a
  INSTALL-LIB librte_pmd_bnxt.a
== Build drivers/net/virtio
  AR librte_pmd_i40e.a
  INSTALL-LIB librte_pmd_i40e.a
== Build drivers/net/vmxnet3
make[5]: *** [ice] Error 2
make[5]: *** Waiting for unfinished jobs....
  CC ecore_sp_commands.o
  CC ecore_init_fw_funcs.o
  CC nicvf_rxtx.o
  CC rte_eth_tap.o
--
  INSTALL-LIB librte_pmd_ixgbe.a
  AR librte_pmd_virtio.a
  INSTALL-LIB librte_pmd_virtio.a
  AR librte_pmd_qede.a
  INSTALL-LIB librte_pmd_qede.a
make[4]: *** [net] Error 2
make[3]: *** [drivers] Error 2
make[2]: *** [all] Error 2
make[1]: *** [pre_install] Error 2
make: *** [install] Error 2


*Make Build Failed #22:
OS: CENTOS76-64
Target: x86_64-native-linuxapp-gcc+shared
     item->type == RTE_FLOW_ITEM_TYPE_PPPOES)
                   ^
/tmp/CENTOS76-64_K3.10.0_GCC4.8.5/x86_64-native-linuxapp-gcc+shared/eaf7da6477e94a7db61010a4bef17935/dpdk/drivers/net/ice/ice_switch_filter.c: At top level:
cc1: warning: unrecognized command line option "-Wno-address-of-packed-member" [enabled by default]
  CC sfc_rx.o
make[6]: *** [ice_switch_filter.o] Error 1
make[5]: *** [ice] Error 2
make[5]: *** Waiting for unfinished jobs....
  CC sfc_tx.o
  CC nicvf_svf.o
  PMDINFO rte_eth_tap.o.pmd.c
  CC rte_eth_tap.o.pmd.o
--
  CC medford_nic.o
  CC medford2_nic.o
  INSTALL-LIB librte_pmd_ixgbe.so.2.1
  LD librte_pmd_sfc_efx.so.1.1
  INSTALL-LIB librte_pmd_sfc_efx.so.1.1
make[4]: *** [net] Error 2
make[3]: *** [drivers] Error 2
make[2]: *** [all] Error 2
make[1]: *** [pre_install] Error 2
make: *** [install] Error 2

*Meson Build Failed #1:
OS: FC30-64
Target:build-gcc-static
FAILED: drivers/a715181@@tmp_rte_pmd_ice at sta/net_ice_ice_switch_filter.c.o 
gcc -Idrivers/a715181@@tmp_rte_pmd_ice at sta -Idrivers -I../drivers -Idrivers/net/ice -I../drivers/net/ice -Idrivers/net/ice/base -I../drivers/net/ice/base -Ilib/librte_ethdev -I../lib/librte_ethdev -I. -I../ -Iconfig -I../config -Ilib/librte_eal/common/include -I../lib/librte_eal/common/include -I../lib/librte_eal/linux/eal/include -Ilib/librte_eal/common -I../lib/librte_eal/common -Ilib/librte_eal/common/include/arch/x86 -I../lib/librte_eal/common/include/arch/x86 -Ilib/librte_eal -I../lib/librte_eal -Ilib/librte_kvargs -I../lib/librte_kvargs -Ilib/librte_net -I../lib/librte_net -Ilib/librte_mbuf -I../lib/librte_mbuf -Ilib/librte_mempool -I../lib/librte_mempool -Ilib/librte_ring -I../lib/librte_ring -Ilib/librte_meter -I../lib/librte_meter -Idrivers/bus/pci -I../drivers/bus/pci -I../drivers/bus/pci/linux -Ilib/librte_pci -I../lib/librte_pci -Idrivers/bus/vdev -I../drivers/bus/vdev -Ilib/librte_hash -I../lib/librte_hash -fdiagnostics-color=always -pipe -D_FILE_OFFSET_BITS=64 -Wall -Winvalid-pch -Werror -O3 -include rte_config.h -Wunused-parameter -Wsign-compare -Wcast-qual -Wno-address-of-packed-member -D_GNU_SOURCE -fPIC -march=native -mno-avx512f -Wno-format-truncation -DALLOW_EXPERIMENTAL_API -MD -MQ 'drivers/a715181@@tmp_rte_pmd_ice at sta/net_ice_ice_switch_filter.c.o' -MF 'drivers/a715181@@tmp_rte_pmd_ice at sta/net_ice_ice_switch_filter.c.o.d' -o 'drivers/a715181@@tmp_rte_pmd_ice at sta/net_ice_ice_switch_filter.c.o' -c ../drivers/net/ice/ice_switch_filter.c
../drivers/net/ice/ice_switch_filter.c: In function ‘ice_switch_inset_get’:
../drivers/net/ice/ice_switch_filter.c:878:8: error: ‘RTE_FLOW_ITEM_TYPE_PPPOED’ undeclared (first use in this function); did you mean ‘RTE_FLOW_ITEM_TYPE_VOID’?
  878 |   case RTE_FLOW_ITEM_TYPE_PPPOED:
      |        ^~~~~~~~~~~~~~~~~~~~~~~~~
      |        RTE_FLOW_ITEM_TYPE_VOID
../drivers/net/ice/ice_switch_filter.c:878:8: note: each undeclared identifier is reported only once for each function it appears in
../drivers/net/ice/ice_switch_filter.c:879:8: error: ‘RTE_FLOW_ITEM_TYPE_PPPOES’ undeclared (first use in this function); did you mean ‘RTE_FLOW_ITEM_TYPE_MPLS’?
  879 |   case RTE_FLOW_ITEM_TYPE_PPPOES:
      |        ^~~~~~~~~~~~~~~~~~~~~~~~~
      |        RTE_FLOW_ITEM_TYPE_MPLS
../drivers/net/ice/ice_switch_filter.c: In function ‘ice_switch_parse_pattern_action’:
../drivers/net/ice/ice_switch_filter.c:1023:21: error: ‘RTE_FLOW_ITEM_TYPE_PPPOED’ undeclared (first use in this function); did you mean ‘RTE_FLOW_ITEM_TYPE_VOID’?
 1023 |   if (item->type == RTE_FLOW_ITEM_TYPE_PPPOED ||
      |                     ^~~~~~~~~~~~~~~~~~~~~~~~~
      |                     RTE_FLOW_ITEM_TYPE_VOID
../drivers/net/ice/ice_switch_filter.c:1024:19: error: ‘RTE_FLOW_ITEM_TYPE_PPPOES’ undeclared (first use in this function); did you mean ‘RTE_FLOW_ITEM_TYPE_MPLS’?
 1024 |     item->type == RTE_FLOW_ITEM_TYPE_PPPOES)
      |                   ^~~~~~~~~~~~~~~~~~~~~~~~~
      |                   RTE_FLOW_ITEM_TYPE_MPLS
[842/1784] Compiling C object 'drivers/a715181@@tmp_rte_pmd_ice at sta/net_ice_ice_generic_flow.c.o'.
FAILED: drivers/a715181@@tmp_rte_pmd_ice at sta/net_ice_ice_generic_flow.c.o 
gcc -Idrivers/a715181@@tmp_rte_pmd_ice at sta -Idrivers -I../drivers -Idrivers/net/ice -I../drivers/net/ice -Idrivers/net/ice/base -I../drivers/net/ice/base -Ilib/librte_ethdev -I../lib/librte_ethdev -I. -I../ -Iconfig -I../config -Ilib/librte_eal/common/include -I../lib/librte_eal/common/include -I../lib/librte_eal/linux/eal/include -Ilib/librte_eal/common -I../lib/librte_eal/common -Ilib/librte_eal/common/include/arch/x86 -I../lib/librte_eal/common/include/arch/x86 -Ilib/librte_eal -I../lib/librte_eal -Ilib/librte_kvargs -I../lib/librte_kvargs -Ilib/librte_net -I../lib/librte_net -Ilib/librte_mbuf -I../lib/librte_mbuf -Ilib/librte_mempool -I../lib/librte_mempool -Ilib/librte_ring -I../lib/librte_ring -Ilib/librte_meter -I../lib/librte_meter -Idrivers/bus/pci -I../drivers/bus/pci -I../drivers/bus/pci/linux -Ilib/librte_pci -I../lib/librte_pci -Idrivers/bus/vdev -I../drivers/bus/vdev -Ilib/librte_hash -I../lib/librte_hash -fdiagnostics-color=always -pipe -D_FILE_OFFSET_BITS=64 -Wall -Winvalid-pch -Werror -O3 -include rte_config.h -Wunused-parameter -Wsign-compare -Wcast-qual -Wno-address-of-packed-member -D_GNU_SOURCE -fPIC -march=native -mno-avx512f -Wno-format-truncation -DALLOW_EXPERIMENTAL_API -MD -MQ 'drivers/a715181@@tmp_rte_pmd_ice at sta/net_ice_ice_generic_flow.c.o' -MF 'drivers/a715181@@tmp_rte_pmd_ice at sta/net_ice_ice_generic_flow.c.o.d' -o 'drivers/a715181@@tmp_rte_pmd_ice at sta/net_ice_ice_generic_flow.c.o' -c ../drivers/net/ice/ice_generic_flow.c
../drivers/net/ice/ice_generic_flow.c:1042:2: error: ‘RTE_FLOW_ITEM_TYPE_GTP_PSC’ undeclared here (not in a function); did you mean ‘RTE_FLOW_ITEM_TYPE_GTPC’?
 1042 |  RTE_FLOW_ITEM_TYPE_GTP_PSC,
      |  ^~~~~~~~~~~~~~~~~~~~~~~~~~
      |  RTE_FLOW_ITEM_TYPE_GTPC
../drivers/net/ice/ice_generic_flow.c:1051:2: error: incompatible types when initializing type ‘enum rte_flow_item_type’ using type ‘enum rte_flow_item_type *’
 1051 |  RTE_FLOW_ITEM_TYPE_GTP_PSC,
      |  ^~~~~~~~~~~~~~~~~~~~~~~~~~
../drivers/net/ice/ice_generic_flow.c:1061:2: error: incompatible types when initializing type ‘enum rte_flow_item_type’ using type ‘enum rte_flow_item_type *’
 1061 |  RTE_FLOW_ITEM_TYPE_GTP_PSC,
      |  ^~~~~~~~~~~~~~~~~~~~~~~~~~
../drivers/net/ice/ice_generic_flow.c:1072:2: error: incompatible types when initializing type ‘enum rte_flow_item_type’ using type ‘enum rte_flow_item_type *’
 1072 |  RTE_FLOW_ITEM_TYPE_GTP_PSC,
      |  ^~~~~~~~~~~~~~~~~~~~~~~~~~
../drivers/net/ice/ice_generic_flow.c:1081:2: error: ‘RTE_FLOW_ITEM_TYPE_PPPOED’ undeclared here (not in a function); did you mean ‘RTE_FLOW_ITEM_TYPE_VOID’?
 1081 |  RTE_FLOW_ITEM_TYPE_PPPOED,
      |  ^~~~~~~~~~~~~~~~~~~~~~~~~
      |  RTE_FLOW_ITEM_TYPE_VOID
../drivers/net/ice/ice_generic_flow.c:1081:2: error: incompatible types when initializing type ‘enum rte_flow_item_type’ using type ‘enum rte_flow_item_type *’
../drivers/net/ice/ice_generic_flow.c:1087:2: error: incompatible types when initializing type ‘enum rte_flow_item_type’ using type ‘enum rte_flow_item_type *’
 1087 |  RTE_FLOW_ITEM_TYPE_PPPOED,
      |  ^~~~~~~~~~~~~~~~~~~~~~~~~
../drivers/net/ice/ice_generic_flow.c:1094:2: error: incompatible types when initializing type ‘enum rte_flow_item_type’ using type ‘enum rte_flow_item_type *’
 1094 |  RTE_FLOW_ITEM_TYPE_PPPOED,
      |  ^~~~~~~~~~~~~~~~~~~~~~~~~
../drivers/net/ice/ice_generic_flow.c:1099:2: error: ‘RTE_FLOW_ITEM_TYPE_PPPOES’ undeclared here (not in a function); did you mean ‘RTE_FLOW_ITEM_TYPE_MPLS’?
 1099 |  RTE_FLOW_ITEM_TYPE_PPPOES,
      |  ^~~~~~~~~~~~~~~~~~~~~~~~~
      |  RTE_FLOW_ITEM_TYPE_MPLS
../drivers/net/ice/ice_generic_flow.c:1099:2: error: incompatible types when initializing type ‘enum rte_flow_item_type’ using type ‘enum rte_flow_item_type *’
../drivers/net/ice/ice_generic_flow.c:1105:2: error: incompatible types when initializing type ‘enum rte_flow_item_type’ using type ‘enum rte_flow_item_type *’
 1105 |  RTE_FLOW_ITEM_TYPE_PPPOES,
      |  ^~~~~~~~~~~~~~~~~~~~~~~~~
../drivers/net/ice/ice_generic_flow.c:1112:2: error: incompatible types when initializing type ‘enum rte_flow_item_type’ using type ‘enum rte_flow_item_type *’
 1112 |  RTE_FLOW_ITEM_TYPE_PPPOES,
      |  ^~~~~~~~~~~~~~~~~~~~~~~~~
../drivers/net/ice/ice_generic_flow.c:1117:2: error: incompatible types when initializing type ‘enum rte_flow_item_type’ using type ‘enum rte_flow_item_type *’
 1117 |  RTE_FLOW_ITEM_TYPE_PPPOES,
      |  ^~~~~~~~~~~~~~~~~~~~~~~~~
../drivers/net/ice/ice_generic_flow.c:1124:2: error: incompatible types when initializing type ‘enum rte_flow_item_type’ using type ‘enum rte_flow_item_type *’
 1124 |  RTE_FLOW_ITEM_TYPE_PPPOES,
      |  ^~~~~~~~~~~~~~~~~~~~~~~~~
../drivers/net/ice/ice_generic_flow.c:1132:2: error: incompatible types when initializing type ‘enum rte_flow_item_type’ using type ‘enum rte_flow_item_type *’
 1132 |  RTE_FLOW_ITEM_TYPE_PPPOES,
      |  ^~~~~~~~~~~~~~~~~~~~~~~~~
../drivers/net/ice/ice_generic_flow.c:1138:2: error: incompatible types when initializing type ‘enum rte_flow_item_type’ using type ‘enum rte_flow_item_type *’
 1138 |  RTE_FLOW_ITEM_TYPE_PPPOES,
      |  ^~~~~~~~~~~~~~~~~~~~~~~~~
../drivers/net/ice/ice_generic_flow.c:1146:2: error: incompatible types when initializing type ‘enum rte_flow_item_type’ using type ‘enum rte_flow_item_type *’
 1146 |  RTE_FLOW_ITEM_TYPE_PPPOES,
      |  ^~~~~~~~~~~~~~~~~~~~~~~~~
../drivers/net/ice/ice_generic_flow.c:1155:2: error: incompatible types when initializing type ‘enum rte_flow_item_type’ using type ‘enum rte_flow_item_type *’
 1155 |  RTE_FLOW_ITEM_TYPE_PPPOES,
      |  ^~~~~~~~~~~~~~~~~~~~~~~~~
../drivers/net/ice/ice_generic_flow.c:1162:2: error: incompatible types when initializing type ‘enum rte_flow_item_type’ using type ‘enum rte_flow_item_type *’
 1162 |  RTE_FLOW_ITEM_TYPE_PPPOES,
      |  ^~~~~~~~~~~~~~~~~~~~~~~~~
../drivers/net/ice/ice_generic_flow.c:1170:2: error: incompatible types when initializing type ‘enum rte_flow_item_type’ using type ‘enum rte_flow_item_type *’
 1170 |  RTE_FLOW_ITEM_TYPE_PPPOES,
      |  ^~~~~~~~~~~~~~~~~~~~~~~~~
../drivers/net/ice/ice_generic_flow.c:1179:2: error: incompatible types when initializing type ‘enum rte_flow_item_type’ using type ‘enum rte_flow_item_type *’
 1179 |  RTE_FLOW_ITEM_TYPE_PPPOES,
      |  ^~~~~~~~~~~~~~~~~~~~~~~~~
../drivers/net/ice/ice_generic_flow.c:1186:2: error: incompatible types when initializing type ‘enum rte_flow_item_type’ using type ‘enum rte_flow_item_type *’
 1186 |  RTE_FLOW_ITEM_TYPE_PPPOES,
      |  ^~~~~~~~~~~~~~~~~~~~~~~~~
../drivers/net/ice/ice_generic_flow.c:1194:2: error: incompatible types when initializing type ‘enum rte_flow_item_type’ using type ‘enum rte_flow_item_type *’
 1194 |  RTE_FLOW_ITEM_TYPE_PPPOES,
      |  ^~~~~~~~~~~~~~~~~~~~~~~~~
../drivers/net/ice/ice_generic_flow.c:1203:2: error: incompatible types when initializing type ‘enum rte_flow_item_type’ using type ‘enum rte_flow_item_type *’
 1203 |  RTE_FLOW_ITEM_TYPE_PPPOES,
      |  ^~~~~~~~~~~~~~~~~~~~~~~~~
../drivers/net/ice/ice_generic_flow.c:1210:2: error: incompatible types when initializing type ‘enum rte_flow_item_type’ using type ‘enum rte_flow_item_type *’
 1210 |  RTE_FLOW_ITEM_TYPE_PPPOES,
      |  ^~~~~~~~~~~~~~~~~~~~~~~~~
../drivers/net/ice/ice_generic_flow.c:1218:2: error: incompatible types when initializing type ‘enum rte_flow_item_type’ using type ‘enum rte_flow_item_type *’
 1218 |  RTE_FLOW_ITEM_TYPE_PPPOES,
      |  ^~~~~~~~~~~~~~~~~~~~~~~~~
../drivers/net/ice/ice_generic_flow.c:1227:2: error: incompatible types when initializing type ‘enum rte_flow_item_type’ using type ‘enum rte_flow_item_type *’
 1227 |  RTE_FLOW_ITEM_TYPE_PPPOES,
      |  ^~~~~~~~~~~~~~~~~~~~~~~~~
../drivers/net/ice/ice_generic_flow.c:1234:2: error: incompatible types when initializing type ‘enum rte_flow_item_type’ using type ‘enum rte_flow_item_type *’
 1234 |  RTE_FLOW_ITEM_TYPE_PPPOES,
      |  ^~~~~~~~~~~~~~~~~~~~~~~~~
../drivers/net/ice/ice_generic_flow.c:1241:2: error: incompatible types when initializing type ‘enum rte_flow_item_type’ using type ‘enum rte_flow_item_type *’
 1241 |  RTE_FLOW_ITEM_TYPE_PPPOES,
      |  ^~~~~~~~~~~~~~~~~~~~~~~~~
../drivers/net/ice/ice_generic_flow.c:1249:2: error: incompatible types when initializing type ‘enum rte_flow_item_type’ using type ‘enum rte_flow_item_type *’
 1249 |  RTE_FLOW_ITEM_TYPE_PPPOES,
      |  ^~~~~~~~~~~~~~~~~~~~~~~~~
../drivers/net/ice/ice_generic_flow.c:1255:2: error: incompatible types when initializing type ‘enum rte_flow_item_type’ using type ‘enum rte_flow_item_type *’
 1255 |  RTE_FLOW_ITEM_TYPE_PPPOES,
      |  ^~~~~~~~~~~~~~~~~~~~~~~~~
../drivers/net/ice/ice_generic_flow.c:1263:2: error: incompatible types when initializing type ‘enum rte_flow_item_type’ using type ‘enum rte_flow_item_type *’
 1263 |  RTE_FLOW_ITEM_TYPE_PPPOES,
      |  ^~~~~~~~~~~~~~~~~~~~~~~~~
../drivers/net/ice/ice_generic_flow.c:1272:2: error: incompatible types when initializing type ‘enum rte_flow_item_type’ using type ‘enum rte_flow_item_type *’
 1272 |  RTE_FLOW_ITEM_TYPE_PPPOES,
      |  ^~~~~~~~~~~~~~~~~~~~~~~~~
../drivers/net/ice/ice_generic_flow.c:1279:2: error: incompatible types when initializing type ‘enum rte_flow_item_type’ using type ‘enum rte_flow_item_type *’
 1279 |  RTE_FLOW_ITEM_TYPE_PPPOES,
      |  ^~~~~~~~~~~~~~~~~~~~~~~~~
../drivers/net/ice/ice_generic_flow.c:1287:2: error: incompatible types when initializing type ‘enum rte_flow_item_type’ using type ‘enum rte_flow_item_type *’
 1287 |  RTE_FLOW_ITEM_TYPE_PPPOES,
      |  ^~~~~~~~~~~~~~~~~~~~~~~~~
../drivers/net/ice/ice_generic_flow.c:1296:2: error: incompatible types when initializing type ‘enum rte_flow_item_type’ using type ‘enum rte_flow_item_type *’
 1296 |  RTE_FLOW_ITEM_TYPE_PPPOES,
      |  ^~~~~~~~~~~~~~~~~~~~~~~~~
../drivers/net/ice/ice_generic_flow.c:1303:2: error: incompatible types when initializing type ‘enum rte_flow_item_type’ using type ‘enum rte_flow_item_type *’
 1303 |  RTE_FLOW_ITEM_TYPE_PPPOES,
      |  ^~~~~~~~~~~~~~~~~~~~~~~~~
../drivers/net/ice/ice_generic_flow.c:1311:2: error: incompatible types when initializing type ‘enum rte_flow_item_type’ using type ‘enum rte_flow_item_type *’
 1311 |  RTE_FLOW_ITEM_TYPE_PPPOES,
      |  ^~~~~~~~~~~~~~~~~~~~~~~~~
../drivers/net/ice/ice_generic_flow.c:1320:2: error: incompatible types when initializing type ‘enum rte_flow_item_type’ using type ‘enum rte_flow_item_type *’
 1320 |  RTE_FLOW_ITEM_TYPE_PPPOES,
      |  ^~~~~~~~~~~~~~~~~~~~~~~~~
../drivers/net/ice/ice_generic_flow.c:1327:2: error: incompatible types when initializing type ‘enum rte_flow_item_type’ using type ‘enum rte_flow_item_type *’
 1327 |  RTE_FLOW_ITEM_TYPE_PPPOES,
      |  ^~~~~~~~~~~~~~~~~~~~~~~~~
../drivers/net/ice/ice_generic_flow.c:1335:2: error: incompatible types when initializing type ‘enum rte_flow_item_type’ using type ‘enum rte_flow_item_type *’
 1335 |  RTE_FLOW_ITEM_TYPE_PPPOES,
      |  ^~~~~~~~~~~~~~~~~~~~~~~~~
../drivers/net/ice/ice_generic_flow.c:1344:2: error: incompatible types when initializing type ‘enum rte_flow_item_type’ using type ‘enum rte_flow_item_type *’
 1344 |  RTE_FLOW_ITEM_TYPE_PPPOES,
      |  ^~~~~~~~~~~~~~~~~~~~~~~~~
[843/1784] Compiling C object 'drivers/a715181@@tmp_rte_pmd_ifc at sta/net_ifc_base_ifcvf.c.o'.
[844/1784] Compiling C object 'drivers/a715181@@tmp_rte_pmd_ice at sta/net_ice_ice_ethdev.c.o'.
[845/1784] Compiling C object 'drivers/net/ice/base/39545a2@@ice_base at sta/ice_switch.c.o'.
[846/1784] Compiling C object 'drivers/a715181@@tmp_rte_pmd_ice at sta/net_ice_ice_rxtx.c.o'.
[847/1784] Compiling C object 'drivers/a715181@@tmp_rte_pmd_ice at sta/net_ice_ice_rxtx_vec_avx2.c.o'.
[848/1784] Compiling C object 'drivers/a715181@@tmp_rte_pmd_ice at sta/net_ice_ice_rxtx_vec_sse.c.o'.
ninja: build stopped: subcommand failed




*Meson Build Failed #2:
OS: SUSE15-64
Target:build-gcc-static
FAILED: drivers/a715181@@tmp_rte_pmd_ice at sta/net_ice_ice_switch_filter.c.o 
gcc -Idrivers/a715181@@tmp_rte_pmd_ice at sta -Idrivers -I../drivers -Idrivers/net/ice -I../drivers/net/ice -Idrivers/net/ice/base -I../drivers/net/ice/base -Ilib/librte_ethdev -I../lib/librte_ethdev -I. -I../ -Iconfig -I../config -Ilib/librte_eal/common/include -I../lib/librte_eal/common/include -I../lib/librte_eal/linux/eal/include -Ilib/librte_eal/common -I../lib/librte_eal/common -Ilib/librte_eal/common/include/arch/x86 -I../lib/librte_eal/common/include/arch/x86 -Ilib/librte_eal -I../lib/librte_eal -Ilib/librte_kvargs -I../lib/librte_kvargs -Ilib/librte_net -I../lib/librte_net -Ilib/librte_mbuf -I../lib/librte_mbuf -Ilib/librte_mempool -I../lib/librte_mempool -Ilib/librte_ring -I../lib/librte_ring -Ilib/librte_meter -I../lib/librte_meter -Idrivers/bus/pci -I../drivers/bus/pci -I../drivers/bus/pci/linux -Ilib/librte_pci -I../lib/librte_pci -Idrivers/bus/vdev -I../drivers/bus/vdev -Ilib/librte_hash -I../lib/librte_hash -fdiagnostics-color=always -pipe -D_FILE_OFFSET_BITS=64 -Wall -Winvalid-pch -Werror -O3 -include rte_config.h -Wunused-parameter -Wsign-compare -Wcast-qual -D_GNU_SOURCE -fPIC -march=native -Wno-format-truncation -DALLOW_EXPERIMENTAL_API -MD -MQ 'drivers/a715181@@tmp_rte_pmd_ice at sta/net_ice_ice_switch_filter.c.o' -MF 'drivers/a715181@@tmp_rte_pmd_ice at sta/net_ice_ice_switch_filter.c.o.d' -o 'drivers/a715181@@tmp_rte_pmd_ice at sta/net_ice_ice_switch_filter.c.o' -c ../drivers/net/ice/ice_switch_filter.c
../drivers/net/ice/ice_switch_filter.c: In function ‘ice_switch_inset_get’:
../drivers/net/ice/ice_switch_filter.c:878:8: error: ‘RTE_FLOW_ITEM_TYPE_PPPOED’ undeclared (first use in this function); did you mean ‘RTE_FLOW_ITEM_TYPE_VOID’?
   case RTE_FLOW_ITEM_TYPE_PPPOED:
        ^~~~~~~~~~~~~~~~~~~~~~~~~
        RTE_FLOW_ITEM_TYPE_VOID
../drivers/net/ice/ice_switch_filter.c:878:8: note: each undeclared identifier is reported only once for each function it appears in
../drivers/net/ice/ice_switch_filter.c:879:8: error: ‘RTE_FLOW_ITEM_TYPE_PPPOES’ undeclared (first use in this function); did you mean ‘RTE_FLOW_ITEM_TYPE_PPPOED’?
   case RTE_FLOW_ITEM_TYPE_PPPOES:
        ^~~~~~~~~~~~~~~~~~~~~~~~~
        RTE_FLOW_ITEM_TYPE_PPPOED
../drivers/net/ice/ice_switch_filter.c: In function ‘ice_switch_parse_pattern_action’:
../drivers/net/ice/ice_switch_filter.c:1023:21: error: ‘RTE_FLOW_ITEM_TYPE_PPPOED’ undeclared (first use in this function); did you mean ‘RTE_FLOW_ITEM_TYPE_VOID’?
   if (item->type == RTE_FLOW_ITEM_TYPE_PPPOED ||
                     ^~~~~~~~~~~~~~~~~~~~~~~~~
                     RTE_FLOW_ITEM_TYPE_VOID
../drivers/net/ice/ice_switch_filter.c:1024:19: error: ‘RTE_FLOW_ITEM_TYPE_PPPOES’ undeclared (first use in this function); did you mean ‘RTE_FLOW_ITEM_TYPE_PPPOED’?
     item->type == RTE_FLOW_ITEM_TYPE_PPPOES)
                   ^~~~~~~~~~~~~~~~~~~~~~~~~
                   RTE_FLOW_ITEM_TYPE_PPPOED
[850/1831] Compiling C object 'drivers/a715181@@tmp_rte_pmd_ice at sta/net_ice_ice_generic_flow.c.o'.
FAILED: drivers/a715181@@tmp_rte_pmd_ice at sta/net_ice_ice_generic_flow.c.o 
gcc -Idrivers/a715181@@tmp_rte_pmd_ice at sta -Idrivers -I../drivers -Idrivers/net/ice -I../drivers/net/ice -Idrivers/net/ice/base -I../drivers/net/ice/base -Ilib/librte_ethdev -I../lib/librte_ethdev -I. -I../ -Iconfig -I../config -Ilib/librte_eal/common/include -I../lib/librte_eal/common/include -I../lib/librte_eal/linux/eal/include -Ilib/librte_eal/common -I../lib/librte_eal/common -Ilib/librte_eal/common/include/arch/x86 -I../lib/librte_eal/common/include/arch/x86 -Ilib/librte_eal -I../lib/librte_eal -Ilib/librte_kvargs -I../lib/librte_kvargs -Ilib/librte_net -I../lib/librte_net -Ilib/librte_mbuf -I../lib/librte_mbuf -Ilib/librte_mempool -I../lib/librte_mempool -Ilib/librte_ring -I../lib/librte_ring -Ilib/librte_meter -I../lib/librte_meter -Idrivers/bus/pci -I../drivers/bus/pci -I../drivers/bus/pci/linux -Ilib/librte_pci -I../lib/librte_pci -Idrivers/bus/vdev -I../drivers/bus/vdev -Ilib/librte_hash -I../lib/librte_hash -fdiagnostics-color=always -pipe -D_FILE_OFFSET_BITS=64 -Wall -Winvalid-pch -Werror -O3 -include rte_config.h -Wunused-parameter -Wsign-compare -Wcast-qual -D_GNU_SOURCE -fPIC -march=native -Wno-format-truncation -DALLOW_EXPERIMENTAL_API -MD -MQ 'drivers/a715181@@tmp_rte_pmd_ice at sta/net_ice_ice_generic_flow.c.o' -MF 'drivers/a715181@@tmp_rte_pmd_ice at sta/net_ice_ice_generic_flow.c.o.d' -o 'drivers/a715181@@tmp_rte_pmd_ice at sta/net_ice_ice_generic_flow.c.o' -c ../drivers/net/ice/ice_generic_flow.c
../drivers/net/ice/ice_generic_flow.c:1042:2: error: ‘RTE_FLOW_ITEM_TYPE_GTP_PSC’ undeclared here (not in a function); did you mean ‘RTE_FLOW_ITEM_TYPE_GTPC’?
  RTE_FLOW_ITEM_TYPE_GTP_PSC,
  ^~~~~~~~~~~~~~~~~~~~~~~~~~
  RTE_FLOW_ITEM_TYPE_GTPC
../drivers/net/ice/ice_generic_flow.c:1051:2: error: incompatible types when initializing type ‘enum rte_flow_item_type’ using type ‘enum rte_flow_item_type *’
  RTE_FLOW_ITEM_TYPE_GTP_PSC,
  ^~~~~~~~~~~~~~~~~~~~~~~~~~
../drivers/net/ice/ice_generic_flow.c:1061:2: error: incompatible types when initializing type ‘enum rte_flow_item_type’ using type ‘enum rte_flow_item_type *’
  RTE_FLOW_ITEM_TYPE_GTP_PSC,
  ^~~~~~~~~~~~~~~~~~~~~~~~~~
../drivers/net/ice/ice_generic_flow.c:1072:2: error: incompatible types when initializing type ‘enum rte_flow_item_type’ using type ‘enum rte_flow_item_type *’
  RTE_FLOW_ITEM_TYPE_GTP_PSC,
  ^~~~~~~~~~~~~~~~~~~~~~~~~~
../drivers/net/ice/ice_generic_flow.c:1081:2: error: ‘RTE_FLOW_ITEM_TYPE_PPPOED’ undeclared here (not in a function); did you mean ‘RTE_FLOW_ITEM_TYPE_VOID’?
  RTE_FLOW_ITEM_TYPE_PPPOED,
  ^~~~~~~~~~~~~~~~~~~~~~~~~
  RTE_FLOW_ITEM_TYPE_VOID
../drivers/net/ice/ice_generic_flow.c:1081:2: error: incompatible types when initializing type ‘enum rte_flow_item_type’ using type ‘enum rte_flow_item_type *’
../drivers/net/ice/ice_generic_flow.c:1087:2: error: incompatible types when initializing type ‘enum rte_flow_item_type’ using type ‘enum rte_flow_item_type *’
  RTE_FLOW_ITEM_TYPE_PPPOED,
  ^~~~~~~~~~~~~~~~~~~~~~~~~
../drivers/net/ice/ice_generic_flow.c:1094:2: error: incompatible types when initializing type ‘enum rte_flow_item_type’ using type ‘enum rte_flow_item_type *’
  RTE_FLOW_ITEM_TYPE_PPPOED,
  ^~~~~~~~~~~~~~~~~~~~~~~~~
../drivers/net/ice/ice_generic_flow.c:1099:2: error: ‘RTE_FLOW_ITEM_TYPE_PPPOES’ undeclared here (not in a function); did you mean ‘RTE_FLOW_ITEM_TYPE_PPPOED’?
  RTE_FLOW_ITEM_TYPE_PPPOES,
  ^~~~~~~~~~~~~~~~~~~~~~~~~
  RTE_FLOW_ITEM_TYPE_PPPOED
../drivers/net/ice/ice_generic_flow.c:1099:2: error: incompatible types when initializing type ‘enum rte_flow_item_type’ using type ‘enum rte_flow_item_type *’
../drivers/net/ice/ice_generic_flow.c:1105:2: error: incompatible types when initializing type ‘enum rte_flow_item_type’ using type ‘enum rte_flow_item_type *’
  RTE_FLOW_ITEM_TYPE_PPPOES,
  ^~~~~~~~~~~~~~~~~~~~~~~~~
../drivers/net/ice/ice_generic_flow.c:1112:2: error: incompatible types when initializing type ‘enum rte_flow_item_type’ using type ‘enum rte_flow_item_type *’
  RTE_FLOW_ITEM_TYPE_PPPOES,
  ^~~~~~~~~~~~~~~~~~~~~~~~~
../drivers/net/ice/ice_generic_flow.c:1117:2: error: incompatible types when initializing type ‘enum rte_flow_item_type’ using type ‘enum rte_flow_item_type *’
  RTE_FLOW_ITEM_TYPE_PPPOES,
  ^~~~~~~~~~~~~~~~~~~~~~~~~
../drivers/net/ice/ice_generic_flow.c:1124:2: error: incompatible types when initializing type ‘enum rte_flow_item_type’ using type ‘enum rte_flow_item_type *’
  RTE_FLOW_ITEM_TYPE_PPPOES,
  ^~~~~~~~~~~~~~~~~~~~~~~~~
../drivers/net/ice/ice_generic_flow.c:1132:2: error: incompatible types when initializing type ‘enum rte_flow_item_type’ using type ‘enum rte_flow_item_type *’
  RTE_FLOW_ITEM_TYPE_PPPOES,
  ^~~~~~~~~~~~~~~~~~~~~~~~~
../drivers/net/ice/ice_generic_flow.c:1138:2: error: incompatible types when initializing type ‘enum rte_flow_item_type’ using type ‘enum rte_flow_item_type *’
  RTE_FLOW_ITEM_TYPE_PPPOES,
  ^~~~~~~~~~~~~~~~~~~~~~~~~
../drivers/net/ice/ice_generic_flow.c:1146:2: error: incompatible types when initializing type ‘enum rte_flow_item_type’ using type ‘enum rte_flow_item_type *’
  RTE_FLOW_ITEM_TYPE_PPPOES,
  ^~~~~~~~~~~~~~~~~~~~~~~~~
../drivers/net/ice/ice_generic_flow.c:1155:2: error: incompatible types when initializing type ‘enum rte_flow_item_type’ using type ‘enum rte_flow_item_type *’
  RTE_FLOW_ITEM_TYPE_PPPOES,
  ^~~~~~~~~~~~~~~~~~~~~~~~~
../drivers/net/ice/ice_generic_flow.c:1162:2: error: incompatible types when initializing type ‘enum rte_flow_item_type’ using type ‘enum rte_flow_item_type *’
  RTE_FLOW_ITEM_TYPE_PPPOES,
  ^~~~~~~~~~~~~~~~~~~~~~~~~
../drivers/net/ice/ice_generic_flow.c:1170:2: error: incompatible types when initializing type ‘enum rte_flow_item_type’ using type ‘enum rte_flow_item_type *’
  RTE_FLOW_ITEM_TYPE_PPPOES,
  ^~~~~~~~~~~~~~~~~~~~~~~~~
../drivers/net/ice/ice_generic_flow.c:1179:2: error: incompatible types when initializing type ‘enum rte_flow_item_type’ using type ‘enum rte_flow_item_type *’
  RTE_FLOW_ITEM_TYPE_PPPOES,
  ^~~~~~~~~~~~~~~~~~~~~~~~~
../drivers/net/ice/ice_generic_flow.c:1186:2: error: incompatible types when initializing type ‘enum rte_flow_item_type’ using type ‘enum rte_flow_item_type *’
  RTE_FLOW_ITEM_TYPE_PPPOES,
  ^~~~~~~~~~~~~~~~~~~~~~~~~
../drivers/net/ice/ice_generic_flow.c:1194:2: error: incompatible types when initializing type ‘enum rte_flow_item_type’ using type ‘enum rte_flow_item_type *’
  RTE_FLOW_ITEM_TYPE_PPPOES,
  ^~~~~~~~~~~~~~~~~~~~~~~~~
../drivers/net/ice/ice_generic_flow.c:1203:2: error: incompatible types when initializing type ‘enum rte_flow_item_type’ using type ‘enum rte_flow_item_type *’
  RTE_FLOW_ITEM_TYPE_PPPOES,
  ^~~~~~~~~~~~~~~~~~~~~~~~~
../drivers/net/ice/ice_generic_flow.c:1210:2: error: incompatible types when initializing type ‘enum rte_flow_item_type’ using type ‘enum rte_flow_item_type *’
  RTE_FLOW_ITEM_TYPE_PPPOES,
  ^~~~~~~~~~~~~~~~~~~~~~~~~
../drivers/net/ice/ice_generic_flow.c:1218:2: error: incompatible types when initializing type ‘enum rte_flow_item_type’ using type ‘enum rte_flow_item_type *’
  RTE_FLOW_ITEM_TYPE_PPPOES,
  ^~~~~~~~~~~~~~~~~~~~~~~~~
../drivers/net/ice/ice_generic_flow.c:1227:2: error: incompatible types when initializing type ‘enum rte_flow_item_type’ using type ‘enum rte_flow_item_type *’
  RTE_FLOW_ITEM_TYPE_PPPOES,
  ^~~~~~~~~~~~~~~~~~~~~~~~~
../drivers/net/ice/ice_generic_flow.c:1234:2: error: incompatible types when initializing type ‘enum rte_flow_item_type’ using type ‘enum rte_flow_item_type *’
  RTE_FLOW_ITEM_TYPE_PPPOES,
  ^~~~~~~~~~~~~~~~~~~~~~~~~
../drivers/net/ice/ice_generic_flow.c:1241:2: error: incompatible types when initializing type ‘enum rte_flow_item_type’ using type ‘enum rte_flow_item_type *’
  RTE_FLOW_ITEM_TYPE_PPPOES,
  ^~~~~~~~~~~~~~~~~~~~~~~~~
../drivers/net/ice/ice_generic_flow.c:1249:2: error: incompatible types when initializing type ‘enum rte_flow_item_type’ using type ‘enum rte_flow_item_type *’
  RTE_FLOW_ITEM_TYPE_PPPOES,
  ^~~~~~~~~~~~~~~~~~~~~~~~~
../drivers/net/ice/ice_generic_flow.c:1255:2: error: incompatible types when initializing type ‘enum rte_flow_item_type’ using type ‘enum rte_flow_item_type *’
  RTE_FLOW_ITEM_TYPE_PPPOES,
  ^~~~~~~~~~~~~~~~~~~~~~~~~
../drivers/net/ice/ice_generic_flow.c:1263:2: error: incompatible types when initializing type ‘enum rte_flow_item_type’ using type ‘enum rte_flow_item_type *’
  RTE_FLOW_ITEM_TYPE_PPPOES,
  ^~~~~~~~~~~~~~~~~~~~~~~~~
../drivers/net/ice/ice_generic_flow.c:1272:2: error: incompatible types when initializing type ‘enum rte_flow_item_type’ using type ‘enum rte_flow_item_type *’
  RTE_FLOW_ITEM_TYPE_PPPOES,
  ^~~~~~~~~~~~~~~~~~~~~~~~~
../drivers/net/ice/ice_generic_flow.c:1279:2: error: incompatible types when initializing type ‘enum rte_flow_item_type’ using type ‘enum rte_flow_item_type *’
  RTE_FLOW_ITEM_TYPE_PPPOES,
  ^~~~~~~~~~~~~~~~~~~~~~~~~
../drivers/net/ice/ice_generic_flow.c:1287:2: error: incompatible types when initializing type ‘enum rte_flow_item_type’ using type ‘enum rte_flow_item_type *’
  RTE_FLOW_ITEM_TYPE_PPPOES,
  ^~~~~~~~~~~~~~~~~~~~~~~~~
../drivers/net/ice/ice_generic_flow.c:1296:2: error: incompatible types when initializing type ‘enum rte_flow_item_type’ using type ‘enum rte_flow_item_type *’
  RTE_FLOW_ITEM_TYPE_PPPOES,
  ^~~~~~~~~~~~~~~~~~~~~~~~~
../drivers/net/ice/ice_generic_flow.c:1303:2: error: incompatible types when initializing type ‘enum rte_flow_item_type’ using type ‘enum rte_flow_item_type *’
  RTE_FLOW_ITEM_TYPE_PPPOES,
  ^~~~~~~~~~~~~~~~~~~~~~~~~
../drivers/net/ice/ice_generic_flow.c:1311:2: error: incompatible types when initializing type ‘enum rte_flow_item_type’ using type ‘enum rte_flow_item_type *’
  RTE_FLOW_ITEM_TYPE_PPPOES,
  ^~~~~~~~~~~~~~~~~~~~~~~~~
../drivers/net/ice/ice_generic_flow.c:1320:2: error: incompatible types when initializing type ‘enum rte_flow_item_type’ using type ‘enum rte_flow_item_type *’
  RTE_FLOW_ITEM_TYPE_PPPOES,
  ^~~~~~~~~~~~~~~~~~~~~~~~~
../drivers/net/ice/ice_generic_flow.c:1327:2: error: incompatible types when initializing type ‘enum rte_flow_item_type’ using type ‘enum rte_flow_item_type *’
  RTE_FLOW_ITEM_TYPE_PPPOES,
  ^~~~~~~~~~~~~~~~~~~~~~~~~
../drivers/net/ice/ice_generic_flow.c:1335:2: error: incompatible types when initializing type ‘enum rte_flow_item_type’ using type ‘enum rte_flow_item_type *’
  RTE_FLOW_ITEM_TYPE_PPPOES,
  ^~~~~~~~~~~~~~~~~~~~~~~~~
../drivers/net/ice/ice_generic_flow.c:1344:2: error: incompatible types when initializing type ‘enum rte_flow_item_type’ using type ‘enum rte_flow_item_type *’
  RTE_FLOW_ITEM_TYPE_PPPOES,
  ^~~~~~~~~~~~~~~~~~~~~~~~~
[851/1831] Compiling C object 'drivers/net/ice/base/39545a2@@ice_base at sta/ice_switch.c.o'.
[852/1831] Compiling C object 'drivers/net/ice/base/39545a2@@ice_base at sta/ice_sched.c.o'.
[853/1831] Compiling C object 'drivers/a715181@@tmp_rte_pmd_ice at sta/net_ice_ice_rxtx_vec_sse.c.o'.
[854/1831] Compiling C object 'drivers/a715181@@tmp_rte_pmd_ice at sta/net_ice_ice_ethdev.c.o'.
[855/1831] Compiling C object 'drivers/net/ice/base/39545a2@@ice_base at sta/ice_flex_pipe.c.o'.
[856/1831] Compiling C object 'drivers/a715181@@tmp_rte_pmd_ice at sta/net_ice_ice_rxtx.c.o'.
ninja: build stopped: subcommand failed




*Meson Build Failed #3:
OS: UB1604-32
Target:build-gcc-static
FAILED: drivers/a715181@@tmp_rte_pmd_ice at sta/net_ice_ice_switch_filter.c.o 
gcc -Idrivers/a715181@@tmp_rte_pmd_ice at sta -Idrivers -I../drivers -Idrivers/net/ice -I../drivers/net/ice -Idrivers/net/ice/base -I../drivers/net/ice/base -Ilib/librte_ethdev -I../lib/librte_ethdev -I. -I../ -Iconfig -I../config -Ilib/librte_eal/common/include -I../lib/librte_eal/common/include -I../lib/librte_eal/linux/eal/include -Ilib/librte_eal/common -I../lib/librte_eal/common -Ilib/librte_eal/common/include/arch/x86 -I../lib/librte_eal/common/include/arch/x86 -Ilib/librte_eal -I../lib/librte_eal -Ilib/librte_kvargs -I../lib/librte_kvargs -Ilib/librte_net -I../lib/librte_net -Ilib/librte_mbuf -I../lib/librte_mbuf -Ilib/librte_mempool -I../lib/librte_mempool -Ilib/librte_ring -I../lib/librte_ring -Ilib/librte_meter -I../lib/librte_meter -Idrivers/bus/pci -I../drivers/bus/pci -I../drivers/bus/pci/linux -Ilib/librte_pci -I../lib/librte_pci -Idrivers/bus/vdev -I../drivers/bus/vdev -Ilib/librte_hash -I../lib/librte_hash -fdiagnostics-color=always -pipe -D_FILE_OFFSET_BITS=64 -Wall -Winvalid-pch -Werror -O3 -include rte_config.h -Wunused-parameter -Wsign-compare -Wcast-qual -Wno-pointer-to-int-cast -D_GNU_SOURCE -fPIC -march=native -DALLOW_EXPERIMENTAL_API -MD -MQ 'drivers/a715181@@tmp_rte_pmd_ice at sta/net_ice_ice_switch_filter.c.o' -MF 'drivers/a715181@@tmp_rte_pmd_ice at sta/net_ice_ice_switch_filter.c.o.d' -o 'drivers/a715181@@tmp_rte_pmd_ice at sta/net_ice_ice_switch_filter.c.o' -c ../drivers/net/ice/ice_switch_filter.c
../drivers/net/ice/ice_switch_filter.c: In function ‘ice_switch_inset_get’:
../drivers/net/ice/ice_switch_filter.c:878:8: error: ‘RTE_FLOW_ITEM_TYPE_PPPOED’ undeclared (first use in this function)
   case RTE_FLOW_ITEM_TYPE_PPPOED:
        ^
../drivers/net/ice/ice_switch_filter.c:878:8: note: each undeclared identifier is reported only once for each function it appears in
../drivers/net/ice/ice_switch_filter.c:879:8: error: ‘RTE_FLOW_ITEM_TYPE_PPPOES’ undeclared (first use in this function)
   case RTE_FLOW_ITEM_TYPE_PPPOES:
        ^
../drivers/net/ice/ice_switch_filter.c: In function ‘ice_switch_parse_pattern_action’:
../drivers/net/ice/ice_switch_filter.c:1023:21: error: ‘RTE_FLOW_ITEM_TYPE_PPPOED’ undeclared (first use in this function)
   if (item->type == RTE_FLOW_ITEM_TYPE_PPPOED ||
                     ^
../drivers/net/ice/ice_switch_filter.c:1024:19: error: ‘RTE_FLOW_ITEM_TYPE_PPPOES’ undeclared (first use in this function)
     item->type == RTE_FLOW_ITEM_TYPE_PPPOES)
                   ^
[818/1656] Compiling C object 'drivers/a715181@@tmp_rte_pmd_iavf at sta/net_iavf_iavf_rxtx_vec_sse.c.o'.
[819/1656] Compiling C object 'drivers/net/ice/base/39545a2@@ice_base at sta/ice_controlq.c.o'.
[820/1656] Compiling C object 'drivers/a715181@@tmp_rte_pmd_iavf at sta/net_iavf_iavf_rxtx.c.o'.
[821/1656] Compiling C object 'drivers/net/ice/base/39545a2@@ice_base at sta/ice_common.c.o'.
[822/1656] Compiling C object 'drivers/net/ice/base/39545a2@@ice_base at sta/ice_sched.c.o'.
ninja: build stopped: subcommand failed




*Meson Build Failed #4:
OS: UB1804-64
Target:build-gcc-static
FAILED: drivers/a715181@@tmp_rte_pmd_ice at sta/net_ice_ice_switch_filter.c.o 
gcc -Idrivers/a715181@@tmp_rte_pmd_ice at sta -Idrivers -I../drivers -Idrivers/net/ice -I../drivers/net/ice -Idrivers/net/ice/base -I../drivers/net/ice/base -Ilib/librte_ethdev -I../lib/librte_ethdev -I. -I../ -Iconfig -I../config -Ilib/librte_eal/common/include -I../lib/librte_eal/common/include -I../lib/librte_eal/linux/eal/include -Ilib/librte_eal/common -I../lib/librte_eal/common -Ilib/librte_eal/common/include/arch/x86 -I../lib/librte_eal/common/include/arch/x86 -Ilib/librte_eal -I../lib/librte_eal -Ilib/librte_kvargs -I../lib/librte_kvargs -Ilib/librte_net -I../lib/librte_net -Ilib/librte_mbuf -I../lib/librte_mbuf -Ilib/librte_mempool -I../lib/librte_mempool -Ilib/librte_ring -I../lib/librte_ring -Ilib/librte_meter -I../lib/librte_meter -Idrivers/bus/pci -I../drivers/bus/pci -I../drivers/bus/pci/linux -Ilib/librte_pci -I../lib/librte_pci -Idrivers/bus/vdev -I../drivers/bus/vdev -Ilib/librte_hash -I../lib/librte_hash -fdiagnostics-color=always -pipe -D_FILE_OFFSET_BITS=64 -Wall -Winvalid-pch -Werror -O3 -include rte_config.h -Wunused-parameter -Wsign-compare -Wcast-qual -D_GNU_SOURCE -fPIC -march=native -mno-avx512f -Wno-format-truncation -DALLOW_EXPERIMENTAL_API -MD -MQ 'drivers/a715181@@tmp_rte_pmd_ice at sta/net_ice_ice_switch_filter.c.o' -MF 'drivers/a715181@@tmp_rte_pmd_ice at sta/net_ice_ice_switch_filter.c.o.d' -o 'drivers/a715181@@tmp_rte_pmd_ice at sta/net_ice_ice_switch_filter.c.o' -c ../drivers/net/ice/ice_switch_filter.c
../drivers/net/ice/ice_switch_filter.c: In function ‘ice_switch_inset_get’:
../drivers/net/ice/ice_switch_filter.c:878:8: error: ‘RTE_FLOW_ITEM_TYPE_PPPOED’ undeclared (first use in this function); did you mean ‘RTE_FLOW_ITEM_TYPE_VOID’?
   case RTE_FLOW_ITEM_TYPE_PPPOED:
        ^~~~~~~~~~~~~~~~~~~~~~~~~
        RTE_FLOW_ITEM_TYPE_VOID
../drivers/net/ice/ice_switch_filter.c:878:8: note: each undeclared identifier is reported only once for each function it appears in
../drivers/net/ice/ice_switch_filter.c:879:8: error: ‘RTE_FLOW_ITEM_TYPE_PPPOES’ undeclared (first use in this function); did you mean ‘RTE_FLOW_ITEM_TYPE_PPPOED’?
   case RTE_FLOW_ITEM_TYPE_PPPOES:
        ^~~~~~~~~~~~~~~~~~~~~~~~~
        RTE_FLOW_ITEM_TYPE_PPPOED
../drivers/net/ice/ice_switch_filter.c: In function ‘ice_switch_parse_pattern_action’:
../drivers/net/ice/ice_switch_filter.c:1023:21: error: ‘RTE_FLOW_ITEM_TYPE_PPPOED’ undeclared (first use in this function); did you mean ‘RTE_FLOW_ITEM_TYPE_VOID’?
   if (item->type == RTE_FLOW_ITEM_TYPE_PPPOED ||
                     ^~~~~~~~~~~~~~~~~~~~~~~~~
                     RTE_FLOW_ITEM_TYPE_VOID
../drivers/net/ice/ice_switch_filter.c:1024:19: error: ‘RTE_FLOW_ITEM_TYPE_PPPOES’ undeclared (first use in this function); did you mean ‘RTE_FLOW_ITEM_TYPE_PPPOED’?
     item->type == RTE_FLOW_ITEM_TYPE_PPPOES)
                   ^~~~~~~~~~~~~~~~~~~~~~~~~
                   RTE_FLOW_ITEM_TYPE_PPPOED
[852/1791] Compiling C object 'drivers/net/ice/base/39545a2@@ice_base at sta/ice_flex_pipe.c.o'.
[853/1791] Compiling C object 'drivers/a715181@@tmp_rte_pmd_ice at sta/net_ice_ice_generic_flow.c.o'.
FAILED: drivers/a715181@@tmp_rte_pmd_ice at sta/net_ice_ice_generic_flow.c.o 
gcc -Idrivers/a715181@@tmp_rte_pmd_ice at sta -Idrivers -I../drivers -Idrivers/net/ice -I../drivers/net/ice -Idrivers/net/ice/base -I../drivers/net/ice/base -Ilib/librte_ethdev -I../lib/librte_ethdev -I. -I../ -Iconfig -I../config -Ilib/librte_eal/common/include -I../lib/librte_eal/common/include -I../lib/librte_eal/linux/eal/include -Ilib/librte_eal/common -I../lib/librte_eal/common -Ilib/librte_eal/common/include/arch/x86 -I../lib/librte_eal/common/include/arch/x86 -Ilib/librte_eal -I../lib/librte_eal -Ilib/librte_kvargs -I../lib/librte_kvargs -Ilib/librte_net -I../lib/librte_net -Ilib/librte_mbuf -I../lib/librte_mbuf -Ilib/librte_mempool -I../lib/librte_mempool -Ilib/librte_ring -I../lib/librte_ring -Ilib/librte_meter -I../lib/librte_meter -Idrivers/bus/pci -I../drivers/bus/pci -I../drivers/bus/pci/linux -Ilib/librte_pci -I../lib/librte_pci -Idrivers/bus/vdev -I../drivers/bus/vdev -Ilib/librte_hash -I../lib/librte_hash -fdiagnostics-color=always -pipe -D_FILE_OFFSET_BITS=64 -Wall -Winvalid-pch -Werror -O3 -include rte_config.h -Wunused-parameter -Wsign-compare -Wcast-qual -D_GNU_SOURCE -fPIC -march=native -mno-avx512f -Wno-format-truncation -DALLOW_EXPERIMENTAL_API -MD -MQ 'drivers/a715181@@tmp_rte_pmd_ice at sta/net_ice_ice_generic_flow.c.o' -MF 'drivers/a715181@@tmp_rte_pmd_ice at sta/net_ice_ice_generic_flow.c.o.d' -o 'drivers/a715181@@tmp_rte_pmd_ice at sta/net_ice_ice_generic_flow.c.o' -c ../drivers/net/ice/ice_generic_flow.c
../drivers/net/ice/ice_generic_flow.c:1042:2: error: ‘RTE_FLOW_ITEM_TYPE_GTP_PSC’ undeclared here (not in a function); did you mean ‘RTE_FLOW_ITEM_TYPE_GTPC’?
  RTE_FLOW_ITEM_TYPE_GTP_PSC,
  ^~~~~~~~~~~~~~~~~~~~~~~~~~
  RTE_FLOW_ITEM_TYPE_GTPC
../drivers/net/ice/ice_generic_flow.c:1051:2: error: incompatible types when initializing type ‘enum rte_flow_item_type’ using type ‘enum rte_flow_item_type *’
  RTE_FLOW_ITEM_TYPE_GTP_PSC,
  ^~~~~~~~~~~~~~~~~~~~~~~~~~
../drivers/net/ice/ice_generic_flow.c:1061:2: error: incompatible types when initializing type ‘enum rte_flow_item_type’ using type ‘enum rte_flow_item_type *’
  RTE_FLOW_ITEM_TYPE_GTP_PSC,
  ^~~~~~~~~~~~~~~~~~~~~~~~~~
../drivers/net/ice/ice_generic_flow.c:1072:2: error: incompatible types when initializing type ‘enum rte_flow_item_type’ using type ‘enum rte_flow_item_type *’
  RTE_FLOW_ITEM_TYPE_GTP_PSC,
  ^~~~~~~~~~~~~~~~~~~~~~~~~~
../drivers/net/ice/ice_generic_flow.c:1081:2: error: ‘RTE_FLOW_ITEM_TYPE_PPPOED’ undeclared here (not in a function); did you mean ‘RTE_FLOW_ITEM_TYPE_VOID’?
  RTE_FLOW_ITEM_TYPE_PPPOED,
  ^~~~~~~~~~~~~~~~~~~~~~~~~
  RTE_FLOW_ITEM_TYPE_VOID
../drivers/net/ice/ice_generic_flow.c:1081:2: error: incompatible types when initializing type ‘enum rte_flow_item_type’ using type ‘enum rte_flow_item_type *’
../drivers/net/ice/ice_generic_flow.c:1087:2: error: incompatible types when initializing type ‘enum rte_flow_item_type’ using type ‘enum rte_flow_item_type *’
  RTE_FLOW_ITEM_TYPE_PPPOED,
  ^~~~~~~~~~~~~~~~~~~~~~~~~
../drivers/net/ice/ice_generic_flow.c:1094:2: error: incompatible types when initializing type ‘enum rte_flow_item_type’ using type ‘enum rte_flow_item_type *’
  RTE_FLOW_ITEM_TYPE_PPPOED,
  ^~~~~~~~~~~~~~~~~~~~~~~~~
../drivers/net/ice/ice_generic_flow.c:1099:2: error: ‘RTE_FLOW_ITEM_TYPE_PPPOES’ undeclared here (not in a function); did you mean ‘RTE_FLOW_ITEM_TYPE_PPPOED’?
  RTE_FLOW_ITEM_TYPE_PPPOES,
  ^~~~~~~~~~~~~~~~~~~~~~~~~
  RTE_FLOW_ITEM_TYPE_PPPOED
../drivers/net/ice/ice_generic_flow.c:1099:2: error: incompatible types when initializing type ‘enum rte_flow_item_type’ using type ‘enum rte_flow_item_type *’
../drivers/net/ice/ice_generic_flow.c:1105:2: error: incompatible types when initializing type ‘enum rte_flow_item_type’ using type ‘enum rte_flow_item_type *’
  RTE_FLOW_ITEM_TYPE_PPPOES,
  ^~~~~~~~~~~~~~~~~~~~~~~~~
../drivers/net/ice/ice_generic_flow.c:1112:2: error: incompatible types when initializing type ‘enum rte_flow_item_type’ using type ‘enum rte_flow_item_type *’
  RTE_FLOW_ITEM_TYPE_PPPOES,
  ^~~~~~~~~~~~~~~~~~~~~~~~~
../drivers/net/ice/ice_generic_flow.c:1117:2: error: incompatible types when initializing type ‘enum rte_flow_item_type’ using type ‘enum rte_flow_item_type *’
  RTE_FLOW_ITEM_TYPE_PPPOES,
  ^~~~~~~~~~~~~~~~~~~~~~~~~
../drivers/net/ice/ice_generic_flow.c:1124:2: error: incompatible types when initializing type ‘enum rte_flow_item_type’ using type ‘enum rte_flow_item_type *’
  RTE_FLOW_ITEM_TYPE_PPPOES,
  ^~~~~~~~~~~~~~~~~~~~~~~~~
../drivers/net/ice/ice_generic_flow.c:1132:2: error: incompatible types when initializing type ‘enum rte_flow_item_type’ using type ‘enum rte_flow_item_type *’
  RTE_FLOW_ITEM_TYPE_PPPOES,
  ^~~~~~~~~~~~~~~~~~~~~~~~~
../drivers/net/ice/ice_generic_flow.c:1138:2: error: incompatible types when initializing type ‘enum rte_flow_item_type’ using type ‘enum rte_flow_item_type *’
  RTE_FLOW_ITEM_TYPE_PPPOES,
  ^~~~~~~~~~~~~~~~~~~~~~~~~
../drivers/net/ice/ice_generic_flow.c:1146:2: error: incompatible types when initializing type ‘enum rte_flow_item_type’ using type ‘enum rte_flow_item_type *’
  RTE_FLOW_ITEM_TYPE_PPPOES,
  ^~~~~~~~~~~~~~~~~~~~~~~~~
../drivers/net/ice/ice_generic_flow.c:1155:2: error: incompatible types when initializing type ‘enum rte_flow_item_type’ using type ‘enum rte_flow_item_type *’
  RTE_FLOW_ITEM_TYPE_PPPOES,
  ^~~~~~~~~~~~~~~~~~~~~~~~~
../drivers/net/ice/ice_generic_flow.c:1162:2: error: incompatible types when initializing type ‘enum rte_flow_item_type’ using type ‘enum rte_flow_item_type *’
  RTE_FLOW_ITEM_TYPE_PPPOES,
  ^~~~~~~~~~~~~~~~~~~~~~~~~
../drivers/net/ice/ice_generic_flow.c:1170:2: error: incompatible types when initializing type ‘enum rte_flow_item_type’ using type ‘enum rte_flow_item_type *’
  RTE_FLOW_ITEM_TYPE_PPPOES,
  ^~~~~~~~~~~~~~~~~~~~~~~~~
../drivers/net/ice/ice_generic_flow.c:1179:2: error: incompatible types when initializing type ‘enum rte_flow_item_type’ using type ‘enum rte_flow_item_type *’
  RTE_FLOW_ITEM_TYPE_PPPOES,
  ^~~~~~~~~~~~~~~~~~~~~~~~~
../drivers/net/ice/ice_generic_flow.c:1186:2: error: incompatible types when initializing type ‘enum rte_flow_item_type’ using type ‘enum rte_flow_item_type *’
  RTE_FLOW_ITEM_TYPE_PPPOES,
  ^~~~~~~~~~~~~~~~~~~~~~~~~
../drivers/net/ice/ice_generic_flow.c:1194:2: error: incompatible types when initializing type ‘enum rte_flow_item_type’ using type ‘enum rte_flow_item_type *’
  RTE_FLOW_ITEM_TYPE_PPPOES,
  ^~~~~~~~~~~~~~~~~~~~~~~~~
../drivers/net/ice/ice_generic_flow.c:1203:2: error: incompatible types when initializing type ‘enum rte_flow_item_type’ using type ‘enum rte_flow_item_type *’
  RTE_FLOW_ITEM_TYPE_PPPOES,
  ^~~~~~~~~~~~~~~~~~~~~~~~~
../drivers/net/ice/ice_generic_flow.c:1210:2: error: incompatible types when initializing type ‘enum rte_flow_item_type’ using type ‘enum rte_flow_item_type *’
  RTE_FLOW_ITEM_TYPE_PPPOES,
  ^~~~~~~~~~~~~~~~~~~~~~~~~
../drivers/net/ice/ice_generic_flow.c:1218:2: error: incompatible types when initializing type ‘enum rte_flow_item_type’ using type ‘enum rte_flow_item_type *’
  RTE_FLOW_ITEM_TYPE_PPPOES,
  ^~~~~~~~~~~~~~~~~~~~~~~~~
../drivers/net/ice/ice_generic_flow.c:1227:2: error: incompatible types when initializing type ‘enum rte_flow_item_type’ using type ‘enum rte_flow_item_type *’
  RTE_FLOW_ITEM_TYPE_PPPOES,
  ^~~~~~~~~~~~~~~~~~~~~~~~~
../drivers/net/ice/ice_generic_flow.c:1234:2: error: incompatible types when initializing type ‘enum rte_flow_item_type’ using type ‘enum rte_flow_item_type *’
  RTE_FLOW_ITEM_TYPE_PPPOES,
  ^~~~~~~~~~~~~~~~~~~~~~~~~
../drivers/net/ice/ice_generic_flow.c:1241:2: error: incompatible types when initializing type ‘enum rte_flow_item_type’ using type ‘enum rte_flow_item_type *’
  RTE_FLOW_ITEM_TYPE_PPPOES,
  ^~~~~~~~~~~~~~~~~~~~~~~~~
../drivers/net/ice/ice_generic_flow.c:1249:2: error: incompatible types when initializing type ‘enum rte_flow_item_type’ using type ‘enum rte_flow_item_type *’
  RTE_FLOW_ITEM_TYPE_PPPOES,
  ^~~~~~~~~~~~~~~~~~~~~~~~~
../drivers/net/ice/ice_generic_flow.c:1255:2: error: incompatible types when initializing type ‘enum rte_flow_item_type’ using type ‘enum rte_flow_item_type *’
  RTE_FLOW_ITEM_TYPE_PPPOES,
  ^~~~~~~~~~~~~~~~~~~~~~~~~
../drivers/net/ice/ice_generic_flow.c:1263:2: error: incompatible types when initializing type ‘enum rte_flow_item_type’ using type ‘enum rte_flow_item_type *’
  RTE_FLOW_ITEM_TYPE_PPPOES,
  ^~~~~~~~~~~~~~~~~~~~~~~~~
../drivers/net/ice/ice_generic_flow.c:1272:2: error: incompatible types when initializing type ‘enum rte_flow_item_type’ using type ‘enum rte_flow_item_type *’
  RTE_FLOW_ITEM_TYPE_PPPOES,
  ^~~~~~~~~~~~~~~~~~~~~~~~~
../drivers/net/ice/ice_generic_flow.c:1279:2: error: incompatible types when initializing type ‘enum rte_flow_item_type’ using type ‘enum rte_flow_item_type *’
  RTE_FLOW_ITEM_TYPE_PPPOES,
  ^~~~~~~~~~~~~~~~~~~~~~~~~
../drivers/net/ice/ice_generic_flow.c:1287:2: error: incompatible types when initializing type ‘enum rte_flow_item_type’ using type ‘enum rte_flow_item_type *’
  RTE_FLOW_ITEM_TYPE_PPPOES,
  ^~~~~~~~~~~~~~~~~~~~~~~~~
../drivers/net/ice/ice_generic_flow.c:1296:2: error: incompatible types when initializing type ‘enum rte_flow_item_type’ using type ‘enum rte_flow_item_type *’
  RTE_FLOW_ITEM_TYPE_PPPOES,
  ^~~~~~~~~~~~~~~~~~~~~~~~~
../drivers/net/ice/ice_generic_flow.c:1303:2: error: incompatible types when initializing type ‘enum rte_flow_item_type’ using type ‘enum rte_flow_item_type *’
  RTE_FLOW_ITEM_TYPE_PPPOES,
  ^~~~~~~~~~~~~~~~~~~~~~~~~
../drivers/net/ice/ice_generic_flow.c:1311:2: error: incompatible types when initializing type ‘enum rte_flow_item_type’ using type ‘enum rte_flow_item_type *’
  RTE_FLOW_ITEM_TYPE_PPPOES,
  ^~~~~~~~~~~~~~~~~~~~~~~~~
../drivers/net/ice/ice_generic_flow.c:1320:2: error: incompatible types when initializing type ‘enum rte_flow_item_type’ using type ‘enum rte_flow_item_type *’
  RTE_FLOW_ITEM_TYPE_PPPOES,
  ^~~~~~~~~~~~~~~~~~~~~~~~~
../drivers/net/ice/ice_generic_flow.c:1327:2: error: incompatible types when initializing type ‘enum rte_flow_item_type’ using type ‘enum rte_flow_item_type *’
  RTE_FLOW_ITEM_TYPE_PPPOES,
  ^~~~~~~~~~~~~~~~~~~~~~~~~
../drivers/net/ice/ice_generic_flow.c:1335:2: error: incompatible types when initializing type ‘enum rte_flow_item_type’ using type ‘enum rte_flow_item_type *’
  RTE_FLOW_ITEM_TYPE_PPPOES,
  ^~~~~~~~~~~~~~~~~~~~~~~~~
../drivers/net/ice/ice_generic_flow.c:1344:2: error: incompatible types when initializing type ‘enum rte_flow_item_type’ using type ‘enum rte_flow_item_type *’
  RTE_FLOW_ITEM_TYPE_PPPOES,
  ^~~~~~~~~~~~~~~~~~~~~~~~~
[854/1791] Compiling C object 'drivers/a715181@@tmp_rte_pmd_ice at sta/net_ice_ice_ethdev.c.o'.
[855/1791] Compiling C object 'drivers/a715181@@tmp_rte_pmd_ice at sta/net_ice_ice_rxtx.c.o'.
[856/1791] Compiling C object 'drivers/a715181@@tmp_rte_pmd_ice at sta/net_ice_ice_rxtx_vec_sse.c.o'.
ninja: build stopped: subcommand failed




*Meson Build Failed #5:
OS: FreeBSD12-64
Target:build-gcc-static
FAILED: drivers/a715181@@tmp_rte_pmd_ice at sta/net_ice_ice_switch_filter.c.o 
ccache gcc -Idrivers/a715181@@tmp_rte_pmd_ice at sta -Idrivers -I../drivers -Idrivers/net/ice -I../drivers/net/ice -Idrivers/net/ice/base -I../drivers/net/ice/base -Ilib/librte_ethdev -I../lib/librte_ethdev -I. -I../ -Iconfig -I../config -Ilib/librte_eal/common/include -I../lib/librte_eal/common/include -I../lib/librte_eal/freebsd/eal/include -Ilib/librte_eal/common -I../lib/librte_eal/common -Ilib/librte_eal/common/include/arch/x86 -I../lib/librte_eal/common/include/arch/x86 -Ilib/librte_eal -I../lib/librte_eal -Ilib/librte_kvargs -I../lib/librte_kvargs -Ilib/librte_net -I../lib/librte_net -Ilib/librte_mbuf -I../lib/librte_mbuf -Ilib/librte_mempool -I../lib/librte_mempool -Ilib/librte_ring -I../lib/librte_ring -Ilib/librte_meter -I../lib/librte_meter -Idrivers/bus/pci -I../drivers/bus/pci -I../drivers/bus/pci/bsd -Ilib/librte_pci -I../lib/librte_pci -Idrivers/bus/vdev -I../drivers/bus/vdev -Ilib/librte_hash -I../lib/librte_hash -fdiagnostics-color=always -pipe -D_FILE_OFFSET_BITS=64 -Wall -Winvalid-pch -Werror -O3 -include rte_config.h -Wunused-parameter -Wsign-compare -Wcast-qual -D_GNU_SOURCE -D__BSD_VISIBLE -fPIC -march=native -Wno-format-truncation -DALLOW_EXPERIMENTAL_API -MD -MQ 'drivers/a715181@@tmp_rte_pmd_ice at sta/net_ice_ice_switch_filter.c.o' -MF 'drivers/a715181@@tmp_rte_pmd_ice at sta/net_ice_ice_switch_filter.c.o.d' -o 'drivers/a715181@@tmp_rte_pmd_ice at sta/net_ice_ice_switch_filter.c.o' -c ../drivers/net/ice/ice_switch_filter.c
../drivers/net/ice/ice_switch_filter.c: In function 'ice_switch_inset_get':
../drivers/net/ice/ice_switch_filter.c:878:8: error: 'RTE_FLOW_ITEM_TYPE_PPPOED' undeclared (first use in this function); did you mean 'RTE_FLOW_ITEM_TYPE_VOID'?
   case RTE_FLOW_ITEM_TYPE_PPPOED:
        ^~~~~~~~~~~~~~~~~~~~~~~~~
        RTE_FLOW_ITEM_TYPE_VOID
../drivers/net/ice/ice_switch_filter.c:878:8: note: each undeclared identifier is reported only once for each function it appears in
../drivers/net/ice/ice_switch_filter.c:879:8: error: 'RTE_FLOW_ITEM_TYPE_PPPOES' undeclared (first use in this function); did you mean 'RTE_FLOW_ITEM_TYPE_PPPOED'?
   case RTE_FLOW_ITEM_TYPE_PPPOES:
        ^~~~~~~~~~~~~~~~~~~~~~~~~
        RTE_FLOW_ITEM_TYPE_PPPOED
../drivers/net/ice/ice_switch_filter.c: In function 'ice_switch_parse_pattern_action':
../drivers/net/ice/ice_switch_filter.c:1023:21: error: 'RTE_FLOW_ITEM_TYPE_PPPOED' undeclared (first use in this function); did you mean 'RTE_FLOW_ITEM_TYPE_VOID'?
   if (item->type == RTE_FLOW_ITEM_TYPE_PPPOED ||
                     ^~~~~~~~~~~~~~~~~~~~~~~~~
                     RTE_FLOW_ITEM_TYPE_VOID
../drivers/net/ice/ice_switch_filter.c:1024:19: error: 'RTE_FLOW_ITEM_TYPE_PPPOES' undeclared (first use in this function); did you mean 'RTE_FLOW_ITEM_TYPE_PPPOED'?
     item->type == RTE_FLOW_ITEM_TYPE_PPPOES)
                   ^~~~~~~~~~~~~~~~~~~~~~~~~
                   RTE_FLOW_ITEM_TYPE_PPPOED
[797/1413] Compiling C object 'drivers/a715181@@tmp_rte_pmd_ice at sta/net_ice_ice_generic_flow.c.o'.
FAILED: drivers/a715181@@tmp_rte_pmd_ice at sta/net_ice_ice_generic_flow.c.o 
ccache gcc -Idrivers/a715181@@tmp_rte_pmd_ice at sta -Idrivers -I../drivers -Idrivers/net/ice -I../drivers/net/ice -Idrivers/net/ice/base -I../drivers/net/ice/base -Ilib/librte_ethdev -I../lib/librte_ethdev -I. -I../ -Iconfig -I../config -Ilib/librte_eal/common/include -I../lib/librte_eal/common/include -I../lib/librte_eal/freebsd/eal/include -Ilib/librte_eal/common -I../lib/librte_eal/common -Ilib/librte_eal/common/include/arch/x86 -I../lib/librte_eal/common/include/arch/x86 -Ilib/librte_eal -I../lib/librte_eal -Ilib/librte_kvargs -I../lib/librte_kvargs -Ilib/librte_net -I../lib/librte_net -Ilib/librte_mbuf -I../lib/librte_mbuf -Ilib/librte_mempool -I../lib/librte_mempool -Ilib/librte_ring -I../lib/librte_ring -Ilib/librte_meter -I../lib/librte_meter -Idrivers/bus/pci -I../drivers/bus/pci -I../drivers/bus/pci/bsd -Ilib/librte_pci -I../lib/librte_pci -Idrivers/bus/vdev -I../drivers/bus/vdev -Ilib/librte_hash -I../lib/librte_hash -fdiagnostics-color=always -pipe -D_FILE_OFFSET_BITS=64 -Wall -Winvalid-pch -Werror -O3 -include rte_config.h -Wunused-parameter -Wsign-compare -Wcast-qual -D_GNU_SOURCE -D__BSD_VISIBLE -fPIC -march=native -Wno-format-truncation -DALLOW_EXPERIMENTAL_API -MD -MQ 'drivers/a715181@@tmp_rte_pmd_ice at sta/net_ice_ice_generic_flow.c.o' -MF 'drivers/a715181@@tmp_rte_pmd_ice at sta/net_ice_ice_generic_flow.c.o.d' -o 'drivers/a715181@@tmp_rte_pmd_ice at sta/net_ice_ice_generic_flow.c.o' -c ../drivers/net/ice/ice_generic_flow.c
../drivers/net/ice/ice_generic_flow.c:1042:2: error: 'RTE_FLOW_ITEM_TYPE_GTP_PSC' undeclared here (not in a function); did you mean 'RTE_FLOW_ITEM_TYPE_GTPC'?
  RTE_FLOW_ITEM_TYPE_GTP_PSC,
  ^~~~~~~~~~~~~~~~~~~~~~~~~~
  RTE_FLOW_ITEM_TYPE_GTPC
../drivers/net/ice/ice_generic_flow.c:1051:2: error: incompatible types when initializing type 'enum rte_flow_item_type' using type 'enum rte_flow_item_type *'
  RTE_FLOW_ITEM_TYPE_GTP_PSC,
  ^~~~~~~~~~~~~~~~~~~~~~~~~~
../drivers/net/ice/ice_generic_flow.c:1061:2: error: incompatible types when initializing type 'enum rte_flow_item_type' using type 'enum rte_flow_item_type *'
  RTE_FLOW_ITEM_TYPE_GTP_PSC,
  ^~~~~~~~~~~~~~~~~~~~~~~~~~
../drivers/net/ice/ice_generic_flow.c:1072:2: error: incompatible types when initializing type 'enum rte_flow_item_type' using type 'enum rte_flow_item_type *'
  RTE_FLOW_ITEM_TYPE_GTP_PSC,
  ^~~~~~~~~~~~~~~~~~~~~~~~~~
../drivers/net/ice/ice_generic_flow.c:1081:2: error: 'RTE_FLOW_ITEM_TYPE_PPPOED' undeclared here (not in a function); did you mean 'RTE_FLOW_ITEM_TYPE_VOID'?
  RTE_FLOW_ITEM_TYPE_PPPOED,
  ^~~~~~~~~~~~~~~~~~~~~~~~~
  RTE_FLOW_ITEM_TYPE_VOID
../drivers/net/ice/ice_generic_flow.c:1081:2: error: incompatible types when initializing type 'enum rte_flow_item_type' using type 'enum rte_flow_item_type *'
../drivers/net/ice/ice_generic_flow.c:1087:2: error: incompatible types when initializing type 'enum rte_flow_item_type' using type 'enum rte_flow_item_type *'
  RTE_FLOW_ITEM_TYPE_PPPOED,
  ^~~~~~~~~~~~~~~~~~~~~~~~~
../drivers/net/ice/ice_generic_flow.c:1094:2: error: incompatible types when initializing type 'enum rte_flow_item_type' using type 'enum rte_flow_item_type *'
  RTE_FLOW_ITEM_TYPE_PPPOED,
  ^~~~~~~~~~~~~~~~~~~~~~~~~
../drivers/net/ice/ice_generic_flow.c:1099:2: error: 'RTE_FLOW_ITEM_TYPE_PPPOES' undeclared here (not in a function); did you mean 'RTE_FLOW_ITEM_TYPE_PPPOED'?
  RTE_FLOW_ITEM_TYPE_PPPOES,
  ^~~~~~~~~~~~~~~~~~~~~~~~~
  RTE_FLOW_ITEM_TYPE_PPPOED
../drivers/net/ice/ice_generic_flow.c:1099:2: error: incompatible types when initializing type 'enum rte_flow_item_type' using type 'enum rte_flow_item_type *'
../drivers/net/ice/ice_generic_flow.c:1105:2: error: incompatible types when initializing type 'enum rte_flow_item_type' using type 'enum rte_flow_item_type *'
  RTE_FLOW_ITEM_TYPE_PPPOES,
  ^~~~~~~~~~~~~~~~~~~~~~~~~
../drivers/net/ice/ice_generic_flow.c:1112:2: error: incompatible types when initializing type 'enum rte_flow_item_type' using type 'enum rte_flow_item_type *'
  RTE_FLOW_ITEM_TYPE_PPPOES,
  ^~~~~~~~~~~~~~~~~~~~~~~~~
../drivers/net/ice/ice_generic_flow.c:1117:2: error: incompatible types when initializing type 'enum rte_flow_item_type' using type 'enum rte_flow_item_type *'
  RTE_FLOW_ITEM_TYPE_PPPOES,
  ^~~~~~~~~~~~~~~~~~~~~~~~~
../drivers/net/ice/ice_generic_flow.c:1124:2: error: incompatible types when initializing type 'enum rte_flow_item_type' using type 'enum rte_flow_item_type *'
  RTE_FLOW_ITEM_TYPE_PPPOES,
  ^~~~~~~~~~~~~~~~~~~~~~~~~
../drivers/net/ice/ice_generic_flow.c:1132:2: error: incompatible types when initializing type 'enum rte_flow_item_type' using type 'enum rte_flow_item_type *'
  RTE_FLOW_ITEM_TYPE_PPPOES,
  ^~~~~~~~~~~~~~~~~~~~~~~~~
../drivers/net/ice/ice_generic_flow.c:1138:2: error: incompatible types when initializing type 'enum rte_flow_item_type' using type 'enum rte_flow_item_type *'
  RTE_FLOW_ITEM_TYPE_PPPOES,
  ^~~~~~~~~~~~~~~~~~~~~~~~~
../drivers/net/ice/ice_generic_flow.c:1146:2: error: incompatible types when initializing type 'enum rte_flow_item_type' using type 'enum rte_flow_item_type *'
  RTE_FLOW_ITEM_TYPE_PPPOES,
  ^~~~~~~~~~~~~~~~~~~~~~~~~
../drivers/net/ice/ice_generic_flow.c:1155:2: error: incompatible types when initializing type 'enum rte_flow_item_type' using type 'enum rte_flow_item_type *'
  RTE_FLOW_ITEM_TYPE_PPPOES,
  ^~~~~~~~~~~~~~~~~~~~~~~~~
../drivers/net/ice/ice_generic_flow.c:1162:2: error: incompatible types when initializing type 'enum rte_flow_item_type' using type 'enum rte_flow_item_type *'
  RTE_FLOW_ITEM_TYPE_PPPOES,
  ^~~~~~~~~~~~~~~~~~~~~~~~~
../drivers/net/ice/ice_generic_flow.c:1170:2: error: incompatible types when initializing type 'enum rte_flow_item_type' using type 'enum rte_flow_item_type *'
  RTE_FLOW_ITEM_TYPE_PPPOES,
  ^~~~~~~~~~~~~~~~~~~~~~~~~
../drivers/net/ice/ice_generic_flow.c:1179:2: error: incompatible types when initializing type 'enum rte_flow_item_type' using type 'enum rte_flow_item_type *'
  RTE_FLOW_ITEM_TYPE_PPPOES,
  ^~~~~~~~~~~~~~~~~~~~~~~~~
../drivers/net/ice/ice_generic_flow.c:1186:2: error: incompatible types when initializing type 'enum rte_flow_item_type' using type 'enum rte_flow_item_type *'
  RTE_FLOW_ITEM_TYPE_PPPOES,
  ^~~~~~~~~~~~~~~~~~~~~~~~~
../drivers/net/ice/ice_generic_flow.c:1194:2: error: incompatible types when initializing type 'enum rte_flow_item_type' using type 'enum rte_flow_item_type *'
  RTE_FLOW_ITEM_TYPE_PPPOES,
  ^~~~~~~~~~~~~~~~~~~~~~~~~
../drivers/net/ice/ice_generic_flow.c:1203:2: error: incompatible types when initializing type 'enum rte_flow_item_type' using type 'enum rte_flow_item_type *'
  RTE_FLOW_ITEM_TYPE_PPPOES,
  ^~~~~~~~~~~~~~~~~~~~~~~~~
../drivers/net/ice/ice_generic_flow.c:1210:2: error: incompatible types when initializing type 'enum rte_flow_item_type' using type 'enum rte_flow_item_type *'
  RTE_FLOW_ITEM_TYPE_PPPOES,
  ^~~~~~~~~~~~~~~~~~~~~~~~~
../drivers/net/ice/ice_generic_flow.c:1218:2: error: incompatible types when initializing type 'enum rte_flow_item_type' using type 'enum rte_flow_item_type *'
  RTE_FLOW_ITEM_TYPE_PPPOES,
  ^~~~~~~~~~~~~~~~~~~~~~~~~
../drivers/net/ice/ice_generic_flow.c:1227:2: error: incompatible types when initializing type 'enum rte_flow_item_type' using type 'enum rte_flow_item_type *'
  RTE_FLOW_ITEM_TYPE_PPPOES,
  ^~~~~~~~~~~~~~~~~~~~~~~~~
../drivers/net/ice/ice_generic_flow.c:1234:2: error: incompatible types when initializing type 'enum rte_flow_item_type' using type 'enum rte_flow_item_type *'
  RTE_FLOW_ITEM_TYPE_PPPOES,
  ^~~~~~~~~~~~~~~~~~~~~~~~~
../drivers/net/ice/ice_generic_flow.c:1241:2: error: incompatible types when initializing type 'enum rte_flow_item_type' using type 'enum rte_flow_item_type *'
  RTE_FLOW_ITEM_TYPE_PPPOES,
  ^~~~~~~~~~~~~~~~~~~~~~~~~
../drivers/net/ice/ice_generic_flow.c:1249:2: error: incompatible types when initializing type 'enum rte_flow_item_type' using type 'enum rte_flow_item_type *'
  RTE_FLOW_ITEM_TYPE_PPPOES,
  ^~~~~~~~~~~~~~~~~~~~~~~~~
../drivers/net/ice/ice_generic_flow.c:1255:2: error: incompatible types when initializing type 'enum rte_flow_item_type' using type 'enum rte_flow_item_type *'
  RTE_FLOW_ITEM_TYPE_PPPOES,
  ^~~~~~~~~~~~~~~~~~~~~~~~~
../drivers/net/ice/ice_generic_flow.c:1263:2: error: incompatible types when initializing type 'enum rte_flow_item_type' using type 'enum rte_flow_item_type *'
  RTE_FLOW_ITEM_TYPE_PPPOES,
  ^~~~~~~~~~~~~~~~~~~~~~~~~
../drivers/net/ice/ice_generic_flow.c:1272:2: error: incompatible types when initializing type 'enum rte_flow_item_type' using type 'enum rte_flow_item_type *'
  RTE_FLOW_ITEM_TYPE_PPPOES,
  ^~~~~~~~~~~~~~~~~~~~~~~~~
../drivers/net/ice/ice_generic_flow.c:1279:2: error: incompatible types when initializing type 'enum rte_flow_item_type' using type 'enum rte_flow_item_type *'
  RTE_FLOW_ITEM_TYPE_PPPOES,
  ^~~~~~~~~~~~~~~~~~~~~~~~~
../drivers/net/ice/ice_generic_flow.c:1287:2: error: incompatible types when initializing type 'enum rte_flow_item_type' using type 'enum rte_flow_item_type *'
  RTE_FLOW_ITEM_TYPE_PPPOES,
  ^~~~~~~~~~~~~~~~~~~~~~~~~
../drivers/net/ice/ice_generic_flow.c:1296:2: error: incompatible types when initializing type 'enum rte_flow_item_type' using type 'enum rte_flow_item_type *'
  RTE_FLOW_ITEM_TYPE_PPPOES,
  ^~~~~~~~~~~~~~~~~~~~~~~~~
../drivers/net/ice/ice_generic_flow.c:1303:2: error: incompatible types when initializing type 'enum rte_flow_item_type' using type 'enum rte_flow_item_type *'
  RTE_FLOW_ITEM_TYPE_PPPOES,
  ^~~~~~~~~~~~~~~~~~~~~~~~~
../drivers/net/ice/ice_generic_flow.c:1311:2: error: incompatible types when initializing type 'enum rte_flow_item_type' using type 'enum rte_flow_item_type *'
  RTE_FLOW_ITEM_TYPE_PPPOES,
  ^~~~~~~~~~~~~~~~~~~~~~~~~
../drivers/net/ice/ice_generic_flow.c:1320:2: error: incompatible types when initializing type 'enum rte_flow_item_type' using type 'enum rte_flow_item_type *'
  RTE_FLOW_ITEM_TYPE_PPPOES,
  ^~~~~~~~~~~~~~~~~~~~~~~~~
../drivers/net/ice/ice_generic_flow.c:1327:2: error: incompatible types when initializing type 'enum rte_flow_item_type' using type 'enum rte_flow_item_type *'
  RTE_FLOW_ITEM_TYPE_PPPOES,
  ^~~~~~~~~~~~~~~~~~~~~~~~~
../drivers/net/ice/ice_generic_flow.c:1335:2: error: incompatible types when initializing type 'enum rte_flow_item_type' using type 'enum rte_flow_item_type *'
  RTE_FLOW_ITEM_TYPE_PPPOES,
  ^~~~~~~~~~~~~~~~~~~~~~~~~
../drivers/net/ice/ice_generic_flow.c:1344:2: error: incompatible types when initializing type 'enum rte_flow_item_type' using type 'enum rte_flow_item_type *'
  RTE_FLOW_ITEM_TYPE_PPPOES,
  ^~~~~~~~~~~~~~~~~~~~~~~~~
[798/1413] Compiling C object 'drivers/a715181@@tmp_rte_pmd_ice at sta/net_ice_ice_rxtx_vec_sse.c.o'.
[799/1413] Compiling C object 'drivers/a715181@@tmp_rte_pmd_ice at sta/net_ice_ice_rxtx_vec_avx2.c.o'.
[800/1413] Compiling C object 'drivers/a715181@@tmp_rte_pmd_ice at sta/net_ice_ice_rxtx.c.o'.
[801/1413] Compiling C object 'drivers/a715181@@tmp_rte_pmd_ice at sta/net_ice_ice_ethdev.c.o'.
ninja: build stopped: subcommand failed



DPDK STV team


More information about the test-report mailing list