[dpdk-test-report] |FAILURE| pw59969[5/6] event/dpaa2: add selftest cases

sys_stv at intel.com sys_stv at intel.com
Fri Sep 27 10:50:57 CEST 2019


Test-Label: Intel-compilation
Test-Status: FAILURE
http://dpdk.org/patch/59969

_Compilation issues_

Submitter: Hemant Agrawal <hemant.agrawal at nxp.com>
Date: 2019-09-27 07:58:40
Reply_mail: 20190927075841.21841-6-hemant.agrawal at nxp.com
DPDK git baseline: Repo:dpdk-next-eventdev, CommitID: c7d6d5178c425cd294b790d7bb3c83fe4b0e58db

Makefile build Summary: 22 Builds Done, 21 Successful, 1 Failures

Meson build Summary: 7 Builds Done, 3 Successful, 4 Failures

               +==============================================+===========+==========+
               |                   Makefile                   |   Meson   | Document |
+--------------+------+-------+------+------------+-----------+-----------+----------+
| os           | gcc  | clang | icc  | gcc+shared | gcc+debug | gcc/clang | pdf/html |
+--------------+------+-------+------+------------+-----------+-----------+----------+
| RHEL76-64    | pass |       |      |            |           |           |          |
| CENTOS76-64  | pass | pass  | pass | FAIL       | pass      |           |          |
| UB1804-64    | pass | pass  | pass |            |           | FAIL      | pass     |
| UB1604-32    | pass |       |      |            |           | FAIL      |          |
| UB1904-64    | pass |       |      |            |           |           |          |
| UB1604-64    | pass | pass  |      |            |           |           |          |
| FC30-64      | pass | pass  |      |            |           | FAIL      |          |
| WIN10-64     |      |       |      |            |           | pass      |          |
| FreeBSD12-64 | pass | pass  |      | pass       | pass      | pass      |          |
| RHEL80-64    | pass |       |      |            |           |           |          |
| SUSE15-64    | pass | pass  |      |            |           | FAIL      |          |
+--------------+------+-------+------+------------+-----------+-----------+----------+

Test environment and configuration as below:

** Makefile build **


OS: RHEL76-64
	Kernel Version: 3.10.0-957.el7.x86_64
	CPU info: Intel(R) Xeon(R) CPU E5-2699 v4 @ 2.20GHz
	GCC Version: gcc (GCC) 4.8.5 20150623 (Red Hat 4.8.5-36)
	Clang Version: NA
	x86_64-native-linuxapp-gcc


OS: CENTOS76-64
	Kernel Version: 3.10.0-957.10.1.el7.x86_64
	CPU info: Intel(R) Xeon(R) CPU E5-2699 v4 @ 2.20GHz
	GCC Version: gcc (GCC) 4.8.5 20150623 (Red Hat 4.8.5-36)
	Clang Version: 3.4.2 (tags/RELEASE_34/dot2-final)
	x86_64-native-linuxapp-clang
	x86_64-native-linuxapp-gcc+debug
	x86_64-native-linuxapp-gcc
	x86_64-native-linuxapp-gcc+shared
	x86_64-native-linuxapp-icc


OS: UB1804-64
	Kernel Version: 4.15.0-20-generic
	CPU info: Intel(R) Xeon(R) CPU E5-2699 v3 @ 2.30GHz
	GCC Version: gcc (Ubuntu 7.3.0-16ubuntu3) 7.3.0
	Clang Version: 6.0.0-1ubuntu2 (tags/RELEASE_600/final)
	x86_64-native-linuxapp-clang
	x86_64-native-linuxapp-icc
	x86_64-native-linuxapp-gcc


OS: UB1904-64
	Kernel Version: 5.0.0-13-generic
	CPU info: Intel(R) Xeon(R) CPU E5-2699 v3 @ 2.30GHz
	GCC Version: gcc (Ubuntu 8.3.0-6ubuntu1) 8.3.0
	Clang Version: 8.0.0-3 (tags/RELEASE_800/final)
	x86_64-native-linuxapp-gcc


OS: UB1604-32
	Kernel Version: 4.4.0-131-generic
	CPU info: Intel(R) Xeon(R) CPU E5-2699 v3 @ 2.30GHz
	GCC Version: gcc (Ubuntu 5.4.0-6ubuntu1~16.04.11) 5.4.0 20160609
	Clang Version: 3.8.0-2ubuntu4 (tags/RELEASE_380/final)
	i686-native-linuxapp-gcc


OS: UB1604-64
	Kernel Version: 4.4.0-47-generic
	CPU info: Intel(R) Xeon(R) CPU E5-2699 v3 @ 2.30GHz
	GCC Version: gcc (Ubuntu 5.4.0-6ubuntu1~16.04.10) 5.4.0 20160609
	Clang Version: 3.8.0-2ubuntu4 (tags/RELEASE_380/final)
	x86_64-native-linuxapp-clang
	x86_64-native-linuxapp-gcc


OS: FC30-64
	Kernel Version: 5.1.7-300.fc30.x86_64
	CPU info: Intel(R) Xeon(R) CPU E5-2699 v4 @ 2.20GHz
	GCC Version: gcc (GCC) 9.1.1 20190503 (Red Hat 9.1.1-1)
	Clang Version: 8.0.0 (Fedora 8.0.0-1.fc30)
	x86_64-native-linuxapp-gcc
	x86_64-native-linuxapp-clang


OS: FreeBSD12-64
	Kernel Version: 12.0-RC3
	CPU info: Intel(R) Xeon(R) CPU E5-2699 v4 @ 2.20GHz (2194.97-MHz K8-class CPU)
	GCC Version: gcc (FreeBSD Ports Collection) 7.3.0
	Clang Version: 6.0.1 (tags/RELEASE_601/final 335540) (based on LLVM 6.0.1)
	x86_64-native-bsdapp-gcc+shared
	x86_64-native-bsdapp-gcc+debug
	x86_64-native-bsdapp-clang
	x86_64-native-bsdapp-gcc


OS: RHEL80-64
	Kernel Version: 4.18.0-80.el8.x86_64
	CPU info: Intel(R) Xeon(R) CPU E5-2699 v4 @ 2.20GHz
	GCC Version: gcc (GCC) 8.2.1 20180905 (Red Hat 8.2.1-3)
	Clang Version: 6.0.1 (tags/RELEASE_601/final)
	x86_64-native-linuxapp-gcc


OS: SUSE15-64
	Kernel Version: 4.12.14-lp150.11-default
	CPU info: Intel(R) Xeon(R) CPU E5-2699 v4 @ 2.20GHz
	GCC Version: gcc (SUSE Linux) 7.3.1 20180323 [gcc-7-branch revision 258812]
	Clang Version: 5.0.1 (tags/RELEASE_501/final 312548)
	x86_64-native-linuxapp-gcc
	x86_64-native-linuxapp-clang


** Meson build **


OS: UB1804-64
	Kernel Version: 4.15.0-20-generic
	CPU info: Intel(R) Xeon(R) CPU E5-2699 v4 @ 2.20GHz
	GCC Version: gcc (Ubuntu 7.3.0-27ubuntu1~18.04) 7.3.0
	Clang Version: 6.0.0-1ubuntu2 (tags/RELEASE_600/final)
	x86_64-native-linuxapp-doc
	build-gcc-static
	build-gcc-shared
	build-clang-static
	build-clang-shared
	build-x86-default


OS: UB1604-32
	Kernel Version: 4.4.0-131-generic
	CPU info: Intel(R) Xeon(R) CPU E5-2699 v4 @ 2.20GHz
	GCC Version: gcc (Ubuntu 5.4.0-6ubuntu1~16.04.11) 5.4.0 20160609
	Clang Version: 3.8.0-2ubuntu4 (tags/RELEASE_380/final)
	build-gcc-static
	build-gcc-shared
	build-clang-static
	build-clang-shared
	build-x86-default


OS: FC30-64
	Kernel Version: 5.0.9-301.fc30.x86_64
	CPU info: Intel(R) Xeon(R) CPU E5-2699 v4 @ 2.20GHz
	GCC Version: gcc (GCC) 9.1.1 20190503 (Red Hat 9.1.1-1)
	Clang Version: 8.0.0 (Fedora 8.0.0-1.fc30)
	build-gcc-static
	build-gcc-shared
	build-clang-static
	build-clang-shared
	build-x86-default


OS: WIN10-64
	Kernel Version: N/A
	CPU info: N/A
	GCC Version: N/A
	Clang Version: Clang 8.0.0
	x86_64-windows-clang


OS: FreeBSD12-64
	Kernel Version: 12.0-RC3
	CPU info: Intel(R) Xeon(R) CPU E5-2699 v4 @ 2.20GHz (2194.99-MHz K8-class CPU)
	GCC Version: gcc (FreeBSD Ports Collection) 7.3.0
	Clang Version: 6.0.1 (tags/RELEASE_601/final 335540) (based on LLVM 6.0.1)
	build-gcc-static
	build-gcc-shared
	build-clang-static
	build-clang-shared
	build-x86-default


OS: SUSE15-64
	Kernel Version: 4.12.14-lp150.11-default
	CPU info: Intel(R) Xeon(R) CPU E5-2699 v4 @ 2.20GHz
	GCC Version: gcc (SUSE Linux) 7.3.1 20180323 [gcc-7-branch revision 258812]
	Clang Version: 5.0.1 (tags/RELEASE_501/final 312548)
	build-gcc-static
	build-gcc-shared
	build-clang-static
	build-clang-shared
	build-x86-default


*Make Build Failed #1:
OS: CENTOS76-64
Target: x86_64-native-linuxapp-gcc+shared
dpaa2_eventdev_selftest.o: In function `_eventdev_setup':
dpaa2_eventdev_selftest.c:(.text+0x3bf0): undefined reference to `rte_pktmbuf_pool_create'
dpaa2_eventdev_selftest.o: In function `eventdev_teardown':
dpaa2_eventdev_selftest.c:(.text+0x410e): undefined reference to `rte_mempool_free'
collect2: error: ld returned 1 exit status
make[6]: *** [librte_pmd_dpaa2_event.so.2.1] Error 1
make[5]: *** [dpaa2] Error 2
make[5]: *** Waiting for unfinished jobs....
  PMDINFO sw_evdev.o.pmd.c
  PMDINFO opdl_evdev.o.pmd.c
  LD librte_pmd_dpaa_event.so.1.1
  CC ssovf_evdev.o
--
  LD otx2_evdev.o
  LD librte_pmd_sw_event.so.1.1
  INSTALL-LIB librte_pmd_sw_event.so.1.1
  LD librte_pmd_octeontx2_event.so.1.1
  INSTALL-LIB librte_pmd_octeontx2_event.so.1.1
make[4]: *** [event] Error 2
make[3]: *** [drivers] Error 2
make[2]: *** [all] Error 2
make[1]: *** [pre_install] Error 2
make: *** [install] Error 2

*Meson Build Failed #1:
OS: SUSE15-64
Target:build-gcc-static
Unknown option --path
rm -f build/cmdline build/cmdline-static build/cmdline-shared
test -d build && rmdir -p build || true
ccache gcc -O3 -include rte_config.h -march=nehalem -I/tmp/SUSE15-64_K4.12.14_GCC7.3.1/x86_64-native-linuxapp-gcc/1c9745ce7f774ddb83b185d1e2da3325/dpdk/build-x86-default/install-root/usr/local/include main.c commands.c parse_obj_list.c -o build/cmdline-shared  -L/tmp/SUSE15-64_K4.12.14_GCC7.3.1/x86_64-native-linuxapp-gcc/1c9745ce7f774ddb83b185d1e2da3325/dpdk/build-x86-default/install-root/usr/local/lib -lrte_bpf -lrte_flow_classify -lrte_pipeline -lrte_table -lrte_port -lrte_ipsec -lrte_vhost -lrte_stack -lrte_security -lrte_sched -lrte_reorder -lrte_rcu -lrte_rawdev -lrte_pdump -lrte_power -lrte_member -lrte_lpm -lrte_latencystats -lrte_kni -lrte_jobstats -lrte_ip_frag -lrte_gso -lrte_gro -lrte_eventdev -lrte_efd -lrte_distributor -lrte_cryptodev -lrte_compressdev -lrte_cfgfile -lrte_bitratestats -lrte_bbdev -lrte_acl -lrte_timer -lrte_hash -lrte_metrics -lrte_cmdline -lrte_pci -lrte_ethdev -lrte_meter -lrte_net -lrte_mbuf -lrte_mempool -lrte_ring -lrte_eal -lrte_kvargs
gmake: ccache: Command not found
gmake: *** [Makefile:28: build/cmdline-shared] Error 127
gmake: Leaving directory '/tmp/SUSE15-64_K4.12.14_GCC7.3.1/x86_64-native-linuxapp-gcc/1c9745ce7f774ddb83b185d1e2da3325/dpdk/build-x86-default/install-root/usr/local/share/dpdk/examples/cmdline'
## Building helloworld
gmake: Entering directory '/tmp/SUSE15-64_K4.12.14_GCC7.3.1/x86_64-native-linuxapp-gcc/1c9745ce7f774ddb83b185d1e2da3325/dpdk/build-x86-default/install-root/usr/local/share/dpdk/examples/helloworld'
Unknown option --path
rm -f build/helloworld build/helloworld-static build/helloworld-shared
test -d build && rmdir -p build || true
ccache gcc -O3 -include rte_config.h -march=nehalem -I/tmp/SUSE15-64_K4.12.14_GCC7.3.1/x86_64-native-linuxapp-gcc/1c9745ce7f774ddb83b185d1e2da3325/dpdk/build-x86-default/install-root/usr/local/include main.c -o build/helloworld-shared  -L/tmp/SUSE15-64_K4.12.14_GCC7.3.1/x86_64-native-linuxapp-gcc/1c9745ce7f774ddb83b185d1e2da3325/dpdk/build-x86-default/install-root/usr/local/lib -lrte_bpf -lrte_flow_classify -lrte_pipeline -lrte_table -lrte_port -lrte_ipsec -lrte_vhost -lrte_stack -lrte_security -lrte_sched -lrte_reorder -lrte_rcu -lrte_rawdev -lrte_pdump -lrte_power -lrte_member -lrte_lpm -lrte_latencystats -lrte_kni -lrte_jobstats -lrte_ip_frag -lrte_gso -lrte_gro -lrte_eventdev -lrte_efd -lrte_distributor -lrte_cryptodev -lrte_compressdev -lrte_cfgfile -lrte_bitratestats -lrte_bbdev -lrte_acl -lrte_timer -lrte_hash -lrte_metrics -lrte_cmdline -lrte_pci -lrte_ethdev -lrte_meter -lrte_net -lrte_mbuf -lrte_mempool -lrte_ring -lrte_eal -lrte_kvargs
gmake: ccache: Command not found
gmake: *** [Makefile:28: build/helloworld-shared] Error 127
gmake: Leaving directory '/tmp/SUSE15-64_K4.12.14_GCC7.3.1/x86_64-native-linuxapp-gcc/1c9745ce7f774ddb83b185d1e2da3325/dpdk/build-x86-default/install-root/usr/local/share/dpdk/examples/helloworld'
## Building l2fwd
gmake: Entering directory '/tmp/SUSE15-64_K4.12.14_GCC7.3.1/x86_64-native-linuxapp-gcc/1c9745ce7f774ddb83b185d1e2da3325/dpdk/build-x86-default/install-root/usr/local/share/dpdk/examples/l2fwd'
Unknown option --path
rm -f build/l2fwd build/l2fwd-static build/l2fwd-shared
test -d build && rmdir -p build || true
ccache gcc -O3 -include rte_config.h -march=nehalem -I/tmp/SUSE15-64_K4.12.14_GCC7.3.1/x86_64-native-linuxapp-gcc/1c9745ce7f774ddb83b185d1e2da3325/dpdk/build-x86-default/install-root/usr/local/include main.c -o build/l2fwd-shared  -L/tmp/SUSE15-64_K4.12.14_GCC7.3.1/x86_64-native-linuxapp-gcc/1c9745ce7f774ddb83b185d1e2da3325/dpdk/build-x86-default/install-root/usr/local/lib -lrte_bpf -lrte_flow_classify -lrte_pipeline -lrte_table -lrte_port -lrte_ipsec -lrte_vhost -lrte_stack -lrte_security -lrte_sched -lrte_reorder -lrte_rcu -lrte_rawdev -lrte_pdump -lrte_power -lrte_member -lrte_lpm -lrte_latencystats -lrte_kni -lrte_jobstats -lrte_ip_frag -lrte_gso -lrte_gro -lrte_eventdev -lrte_efd -lrte_distributor -lrte_cryptodev -lrte_compressdev -lrte_cfgfile -lrte_bitratestats -lrte_bbdev -lrte_acl -lrte_timer -lrte_hash -lrte_metrics -lrte_cmdline -lrte_pci -lrte_ethdev -lrte_meter -lrte_net -lrte_mbuf -lrte_mempool -lrte_ring -lrte_eal -lrte_kvargs
gmake: ccache: Command not found
gmake: *** [Makefile:28: build/l2fwd-shared] Error 127
gmake: Leaving directory '/tmp/SUSE15-64_K4.12.14_GCC7.3.1/x86_64-native-linuxapp-gcc/1c9745ce7f774ddb83b185d1e2da3325/dpdk/build-x86-default/install-root/usr/local/share/dpdk/examples/l2fwd'
## Building l3fwd
gmake: Entering directory '/tmp/SUSE15-64_K4.12.14_GCC7.3.1/x86_64-native-linuxapp-gcc/1c9745ce7f774ddb83b185d1e2da3325/dpdk/build-x86-default/install-root/usr/local/share/dpdk/examples/l3fwd'
Unknown option --path
rm -f build/l3fwd build/l3fwd-static build/l3fwd-shared
test -d build && rmdir -p build || true
ccache gcc -O3 -include rte_config.h -march=nehalem -I/tmp/SUSE15-64_K4.12.14_GCC7.3.1/x86_64-native-linuxapp-gcc/1c9745ce7f774ddb83b185d1e2da3325/dpdk/build-x86-default/install-root/usr/local/include main.c l3fwd_lpm.c l3fwd_em.c -o build/l3fwd-shared  -L/tmp/SUSE15-64_K4.12.14_GCC7.3.1/x86_64-native-linuxapp-gcc/1c9745ce7f774ddb83b185d1e2da3325/dpdk/build-x86-default/install-root/usr/local/lib -lrte_bpf -lrte_flow_classify -lrte_pipeline -lrte_table -lrte_port -lrte_ipsec -lrte_vhost -lrte_stack -lrte_security -lrte_sched -lrte_reorder -lrte_rcu -lrte_rawdev -lrte_pdump -lrte_power -lrte_member -lrte_lpm -lrte_latencystats -lrte_kni -lrte_jobstats -lrte_ip_frag -lrte_gso -lrte_gro -lrte_eventdev -lrte_efd -lrte_distributor -lrte_cryptodev -lrte_compressdev -lrte_cfgfile -lrte_bitratestats -lrte_bbdev -lrte_acl -lrte_timer -lrte_hash -lrte_metrics -lrte_cmdline -lrte_pci -lrte_ethdev -lrte_meter -lrte_net -lrte_mbuf -lrte_mempool -lrte_ring -lrte_eal -lrte_kvargs
gmake: ccache: Command not found
gmake: *** [Makefile:28: build/l3fwd-shared] Error 127
gmake: Leaving directory '/tmp/SUSE15-64_K4.12.14_GCC7.3.1/x86_64-native-linuxapp-gcc/1c9745ce7f774ddb83b185d1e2da3325/dpdk/build-x86-default/install-root/usr/local/share/dpdk/examples/l3fwd'
## Building skeleton
gmake: Entering directory '/tmp/SUSE15-64_K4.12.14_GCC7.3.1/x86_64-native-linuxapp-gcc/1c9745ce7f774ddb83b185d1e2da3325/dpdk/build-x86-default/install-root/usr/local/share/dpdk/examples/skeleton'
Unknown option --path
rm -f build/basicfwd build/basicfwd-static build/basicfwd-shared
test -d build && rmdir -p build || true
ccache gcc -O3 -include rte_config.h -march=nehalem -I/tmp/SUSE15-64_K4.12.14_GCC7.3.1/x86_64-native-linuxapp-gcc/1c9745ce7f774ddb83b185d1e2da3325/dpdk/build-x86-default/install-root/usr/local/include basicfwd.c -o build/basicfwd-shared  -L/tmp/SUSE15-64_K4.12.14_GCC7.3.1/x86_64-native-linuxapp-gcc/1c9745ce7f774ddb83b185d1e2da3325/dpdk/build-x86-default/install-root/usr/local/lib -lrte_bpf -lrte_flow_classify -lrte_pipeline -lrte_table -lrte_port -lrte_ipsec -lrte_vhost -lrte_stack -lrte_security -lrte_sched -lrte_reorder -lrte_rcu -lrte_rawdev -lrte_pdump -lrte_power -lrte_member -lrte_lpm -lrte_latencystats -lrte_kni -lrte_jobstats -lrte_ip_frag -lrte_gso -lrte_gro -lrte_eventdev -lrte_efd -lrte_distributor -lrte_cryptodev -lrte_compressdev -lrte_cfgfile -lrte_bitratestats -lrte_bbdev -lrte_acl -lrte_timer -lrte_hash -lrte_metrics -lrte_cmdline -lrte_pci -lrte_ethdev -lrte_meter -lrte_net -lrte_mbuf -lrte_mempool -lrte_ring -lrte_eal -lrte_kvargs
gmake: ccache: Command not found
gmake: *** [Makefile:28: build/basicfwd-shared] Error 127
gmake: Leaving directory '/tmp/SUSE15-64_K4.12.14_GCC7.3.1/x86_64-native-linuxapp-gcc/1c9745ce7f774ddb83b185d1e2da3325/dpdk/build-x86-default/install-root/usr/local/share/dpdk/examples/skeleton'
## Building timer
gmake: Entering directory '/tmp/SUSE15-64_K4.12.14_GCC7.3.1/x86_64-native-linuxapp-gcc/1c9745ce7f774ddb83b185d1e2da3325/dpdk/build-x86-default/install-root/usr/local/share/dpdk/examples/timer'
Unknown option --path
rm -f build/timer build/timer-static build/timer-shared
test -d build && rmdir -p build || true
ccache gcc -O3 -include rte_config.h -march=nehalem -I/tmp/SUSE15-64_K4.12.14_GCC7.3.1/x86_64-native-linuxapp-gcc/1c9745ce7f774ddb83b185d1e2da3325/dpdk/build-x86-default/install-root/usr/local/include main.c -o build/timer-shared  -L/tmp/SUSE15-64_K4.12.14_GCC7.3.1/x86_64-native-linuxapp-gcc/1c9745ce7f774ddb83b185d1e2da3325/dpdk/build-x86-default/install-root/usr/local/lib -lrte_bpf -lrte_flow_classify -lrte_pipeline -lrte_table -lrte_port -lrte_ipsec -lrte_vhost -lrte_stack -lrte_security -lrte_sched -lrte_reorder -lrte_rcu -lrte_rawdev -lrte_pdump -lrte_power -lrte_member -lrte_lpm -lrte_latencystats -lrte_kni -lrte_jobstats -lrte_ip_frag -lrte_gso -lrte_gro -lrte_eventdev -lrte_efd -lrte_distributor -lrte_cryptodev -lrte_compressdev -lrte_cfgfile -lrte_bitratestats -lrte_bbdev -lrte_acl -lrte_timer -lrte_hash -lrte_metrics -lrte_cmdline -lrte_pci -lrte_ethdev -lrte_meter -lrte_net -lrte_mbuf -lrte_mempool -lrte_ring -lrte_eal -lrte_kvargs
gmake: ccache: Command not found
gmake: *** [Makefile:28: build/timer-shared] Error 127
gmake: Leaving directory '/tmp/SUSE15-64_K4.12.14_GCC7.3.1/x86_64-native-linuxapp-gcc/1c9745ce7f774ddb83b185d1e2da3325/dpdk/build-x86-default/install-root/usr/local/share/dpdk/examples/timer'


*Meson Build Failed #2:
OS: FC30-64
Target:build-gcc-static
gmake: Entering directory '/tmp/FC30-64_K4.20_GCC9.1.1/x86_64-native-linuxapp-gcc/1c9745ce7f774ddb83b185d1e2da3325/dpdk/build-x86-default/install-root/usr/local/share/dpdk/examples/cmdline'
rm -f build/cmdline build/cmdline-static build/cmdline-shared
test -d build && rmdir -p build || true
ccache gcc -O3 -I/tmp/FC30-64_K4.20_GCC9.1.1/x86_64-native-linuxapp-gcc/1c9745ce7f774ddb83b185d1e2da3325/dpdk/build-x86-default/install-root/usr/local/include -include rte_config.h -march=nehalem -mno-avx512f  main.c commands.c parse_obj_list.c -o build/cmdline-shared  -L/tmp/FC30-64_K4.20_GCC9.1.1/x86_64-native-linuxapp-gcc/1c9745ce7f774ddb83b185d1e2da3325/dpdk/build-x86-default/install-root/usr/local/lib -lrte_bpf -lrte_flow_classify -lrte_pipeline -lrte_table -lrte_port -lrte_ipsec -lrte_vhost -lrte_stack -lrte_security -lrte_sched -lrte_reorder -lrte_rcu -lrte_rawdev -lrte_pdump -lrte_power -lrte_member -lrte_lpm -lrte_latencystats -lrte_kni -lrte_jobstats -lrte_ip_frag -lrte_gso -lrte_gro -lrte_eventdev -lrte_efd -lrte_distributor -lrte_cryptodev -lrte_compressdev -lrte_cfgfile -lrte_bitratestats -lrte_bbdev -lrte_acl -lrte_timer -lrte_hash -lrte_metrics -lrte_cmdline -lrte_pci -lrte_ethdev -lrte_meter -lrte_net -lrte_mbuf -lrte_mempool -lrte_ring -lrte_eal -lrte_kvargs 
gmake: ccache: Command not found
gmake: *** [Makefile:28: build/cmdline-shared] Error 127
gmake: Leaving directory '/tmp/FC30-64_K4.20_GCC9.1.1/x86_64-native-linuxapp-gcc/1c9745ce7f774ddb83b185d1e2da3325/dpdk/build-x86-default/install-root/usr/local/share/dpdk/examples/cmdline'
## Building helloworld
gmake: Entering directory '/tmp/FC30-64_K4.20_GCC9.1.1/x86_64-native-linuxapp-gcc/1c9745ce7f774ddb83b185d1e2da3325/dpdk/build-x86-default/install-root/usr/local/share/dpdk/examples/helloworld'
rm -f build/helloworld build/helloworld-static build/helloworld-shared
test -d build && rmdir -p build || true
ccache gcc -O3 -I/tmp/FC30-64_K4.20_GCC9.1.1/x86_64-native-linuxapp-gcc/1c9745ce7f774ddb83b185d1e2da3325/dpdk/build-x86-default/install-root/usr/local/include -include rte_config.h -march=nehalem -mno-avx512f  main.c -o build/helloworld-shared  -L/tmp/FC30-64_K4.20_GCC9.1.1/x86_64-native-linuxapp-gcc/1c9745ce7f774ddb83b185d1e2da3325/dpdk/build-x86-default/install-root/usr/local/lib -lrte_bpf -lrte_flow_classify -lrte_pipeline -lrte_table -lrte_port -lrte_ipsec -lrte_vhost -lrte_stack -lrte_security -lrte_sched -lrte_reorder -lrte_rcu -lrte_rawdev -lrte_pdump -lrte_power -lrte_member -lrte_lpm -lrte_latencystats -lrte_kni -lrte_jobstats -lrte_ip_frag -lrte_gso -lrte_gro -lrte_eventdev -lrte_efd -lrte_distributor -lrte_cryptodev -lrte_compressdev -lrte_cfgfile -lrte_bitratestats -lrte_bbdev -lrte_acl -lrte_timer -lrte_hash -lrte_metrics -lrte_cmdline -lrte_pci -lrte_ethdev -lrte_meter -lrte_net -lrte_mbuf -lrte_mempool -lrte_ring -lrte_eal -lrte_kvargs 
gmake: ccache: Command not found
gmake: *** [Makefile:28: build/helloworld-shared] Error 127
gmake: Leaving directory '/tmp/FC30-64_K4.20_GCC9.1.1/x86_64-native-linuxapp-gcc/1c9745ce7f774ddb83b185d1e2da3325/dpdk/build-x86-default/install-root/usr/local/share/dpdk/examples/helloworld'
## Building l2fwd
gmake: Entering directory '/tmp/FC30-64_K4.20_GCC9.1.1/x86_64-native-linuxapp-gcc/1c9745ce7f774ddb83b185d1e2da3325/dpdk/build-x86-default/install-root/usr/local/share/dpdk/examples/l2fwd'
rm -f build/l2fwd build/l2fwd-static build/l2fwd-shared
test -d build && rmdir -p build || true
ccache gcc -O3 -I/tmp/FC30-64_K4.20_GCC9.1.1/x86_64-native-linuxapp-gcc/1c9745ce7f774ddb83b185d1e2da3325/dpdk/build-x86-default/install-root/usr/local/include -include rte_config.h -march=nehalem -mno-avx512f  main.c -o build/l2fwd-shared  -L/tmp/FC30-64_K4.20_GCC9.1.1/x86_64-native-linuxapp-gcc/1c9745ce7f774ddb83b185d1e2da3325/dpdk/build-x86-default/install-root/usr/local/lib -lrte_bpf -lrte_flow_classify -lrte_pipeline -lrte_table -lrte_port -lrte_ipsec -lrte_vhost -lrte_stack -lrte_security -lrte_sched -lrte_reorder -lrte_rcu -lrte_rawdev -lrte_pdump -lrte_power -lrte_member -lrte_lpm -lrte_latencystats -lrte_kni -lrte_jobstats -lrte_ip_frag -lrte_gso -lrte_gro -lrte_eventdev -lrte_efd -lrte_distributor -lrte_cryptodev -lrte_compressdev -lrte_cfgfile -lrte_bitratestats -lrte_bbdev -lrte_acl -lrte_timer -lrte_hash -lrte_metrics -lrte_cmdline -lrte_pci -lrte_ethdev -lrte_meter -lrte_net -lrte_mbuf -lrte_mempool -lrte_ring -lrte_eal -lrte_kvargs 
gmake: ccache: Command not found
gmake: *** [Makefile:28: build/l2fwd-shared] Error 127
gmake: Leaving directory '/tmp/FC30-64_K4.20_GCC9.1.1/x86_64-native-linuxapp-gcc/1c9745ce7f774ddb83b185d1e2da3325/dpdk/build-x86-default/install-root/usr/local/share/dpdk/examples/l2fwd'
## Building l3fwd
gmake: Entering directory '/tmp/FC30-64_K4.20_GCC9.1.1/x86_64-native-linuxapp-gcc/1c9745ce7f774ddb83b185d1e2da3325/dpdk/build-x86-default/install-root/usr/local/share/dpdk/examples/l3fwd'
rm -f build/l3fwd build/l3fwd-static build/l3fwd-shared
test -d build && rmdir -p build || true
ccache gcc -O3 -I/tmp/FC30-64_K4.20_GCC9.1.1/x86_64-native-linuxapp-gcc/1c9745ce7f774ddb83b185d1e2da3325/dpdk/build-x86-default/install-root/usr/local/include -include rte_config.h -march=nehalem -mno-avx512f  main.c l3fwd_lpm.c l3fwd_em.c -o build/l3fwd-shared  -L/tmp/FC30-64_K4.20_GCC9.1.1/x86_64-native-linuxapp-gcc/1c9745ce7f774ddb83b185d1e2da3325/dpdk/build-x86-default/install-root/usr/local/lib -lrte_bpf -lrte_flow_classify -lrte_pipeline -lrte_table -lrte_port -lrte_ipsec -lrte_vhost -lrte_stack -lrte_security -lrte_sched -lrte_reorder -lrte_rcu -lrte_rawdev -lrte_pdump -lrte_power -lrte_member -lrte_lpm -lrte_latencystats -lrte_kni -lrte_jobstats -lrte_ip_frag -lrte_gso -lrte_gro -lrte_eventdev -lrte_efd -lrte_distributor -lrte_cryptodev -lrte_compressdev -lrte_cfgfile -lrte_bitratestats -lrte_bbdev -lrte_acl -lrte_timer -lrte_hash -lrte_metrics -lrte_cmdline -lrte_pci -lrte_ethdev -lrte_meter -lrte_net -lrte_mbuf -lrte_mempool -lrte_ring -lrte_eal -lrte_kvargs 
gmake: ccache: Command not found
gmake: *** [Makefile:28: build/l3fwd-shared] Error 127
gmake: Leaving directory '/tmp/FC30-64_K4.20_GCC9.1.1/x86_64-native-linuxapp-gcc/1c9745ce7f774ddb83b185d1e2da3325/dpdk/build-x86-default/install-root/usr/local/share/dpdk/examples/l3fwd'
## Building skeleton
gmake: Entering directory '/tmp/FC30-64_K4.20_GCC9.1.1/x86_64-native-linuxapp-gcc/1c9745ce7f774ddb83b185d1e2da3325/dpdk/build-x86-default/install-root/usr/local/share/dpdk/examples/skeleton'
rm -f build/basicfwd build/basicfwd-static build/basicfwd-shared
test -d build && rmdir -p build || true
ccache gcc -O3 -I/tmp/FC30-64_K4.20_GCC9.1.1/x86_64-native-linuxapp-gcc/1c9745ce7f774ddb83b185d1e2da3325/dpdk/build-x86-default/install-root/usr/local/include -include rte_config.h -march=nehalem -mno-avx512f  basicfwd.c -o build/basicfwd-shared  -L/tmp/FC30-64_K4.20_GCC9.1.1/x86_64-native-linuxapp-gcc/1c9745ce7f774ddb83b185d1e2da3325/dpdk/build-x86-default/install-root/usr/local/lib -lrte_bpf -lrte_flow_classify -lrte_pipeline -lrte_table -lrte_port -lrte_ipsec -lrte_vhost -lrte_stack -lrte_security -lrte_sched -lrte_reorder -lrte_rcu -lrte_rawdev -lrte_pdump -lrte_power -lrte_member -lrte_lpm -lrte_latencystats -lrte_kni -lrte_jobstats -lrte_ip_frag -lrte_gso -lrte_gro -lrte_eventdev -lrte_efd -lrte_distributor -lrte_cryptodev -lrte_compressdev -lrte_cfgfile -lrte_bitratestats -lrte_bbdev -lrte_acl -lrte_timer -lrte_hash -lrte_metrics -lrte_cmdline -lrte_pci -lrte_ethdev -lrte_meter -lrte_net -lrte_mbuf -lrte_mempool -lrte_ring -lrte_eal -lrte_kvargs 
gmake: ccache: Command not found
gmake: *** [Makefile:28: build/basicfwd-shared] Error 127
gmake: Leaving directory '/tmp/FC30-64_K4.20_GCC9.1.1/x86_64-native-linuxapp-gcc/1c9745ce7f774ddb83b185d1e2da3325/dpdk/build-x86-default/install-root/usr/local/share/dpdk/examples/skeleton'
## Building timer
gmake: Entering directory '/tmp/FC30-64_K4.20_GCC9.1.1/x86_64-native-linuxapp-gcc/1c9745ce7f774ddb83b185d1e2da3325/dpdk/build-x86-default/install-root/usr/local/share/dpdk/examples/timer'
rm -f build/timer build/timer-static build/timer-shared
test -d build && rmdir -p build || true
ccache gcc -O3 -I/tmp/FC30-64_K4.20_GCC9.1.1/x86_64-native-linuxapp-gcc/1c9745ce7f774ddb83b185d1e2da3325/dpdk/build-x86-default/install-root/usr/local/include -include rte_config.h -march=nehalem -mno-avx512f  main.c -o build/timer-shared  -L/tmp/FC30-64_K4.20_GCC9.1.1/x86_64-native-linuxapp-gcc/1c9745ce7f774ddb83b185d1e2da3325/dpdk/build-x86-default/install-root/usr/local/lib -lrte_bpf -lrte_flow_classify -lrte_pipeline -lrte_table -lrte_port -lrte_ipsec -lrte_vhost -lrte_stack -lrte_security -lrte_sched -lrte_reorder -lrte_rcu -lrte_rawdev -lrte_pdump -lrte_power -lrte_member -lrte_lpm -lrte_latencystats -lrte_kni -lrte_jobstats -lrte_ip_frag -lrte_gso -lrte_gro -lrte_eventdev -lrte_efd -lrte_distributor -lrte_cryptodev -lrte_compressdev -lrte_cfgfile -lrte_bitratestats -lrte_bbdev -lrte_acl -lrte_timer -lrte_hash -lrte_metrics -lrte_cmdline -lrte_pci -lrte_ethdev -lrte_meter -lrte_net -lrte_mbuf -lrte_mempool -lrte_ring -lrte_eal -lrte_kvargs 
gmake: ccache: Command not found
gmake: *** [Makefile:28: build/timer-shared] Error 127
gmake: Leaving directory '/tmp/FC30-64_K4.20_GCC9.1.1/x86_64-native-linuxapp-gcc/1c9745ce7f774ddb83b185d1e2da3325/dpdk/build-x86-default/install-root/usr/local/share/dpdk/examples/timer'


*Meson Build Failed #3:
OS: UB1604-32
Target:build-gcc-static
Unknown option --path
rm -f build/cmdline build/cmdline-static build/cmdline-shared
test -d build && rmdir -p build || true
ccache gcc -O3 -include rte_config.h -march=nehalem -I/tmp/UB1604-32_K4.4.0_GCC5.4.0/i686-native-linuxapp-gcc/1c9745ce7f774ddb83b185d1e2da3325/dpdk/build-x86-default/install-root/usr/local/include main.c commands.c parse_obj_list.c -o build/cmdline-shared  -L/tmp/UB1604-32_K4.4.0_GCC5.4.0/i686-native-linuxapp-gcc/1c9745ce7f774ddb83b185d1e2da3325/dpdk/build-x86-default/install-root/usr/local/lib -lrte_bpf -lrte_flow_classify -lrte_pipeline -lrte_table -lrte_port -lrte_ipsec -lrte_vhost -lrte_stack -lrte_security -lrte_sched -lrte_reorder -lrte_rcu -lrte_rawdev -lrte_pdump -lrte_power -lrte_member -lrte_lpm -lrte_latencystats -lrte_jobstats -lrte_ip_frag -lrte_gso -lrte_gro -lrte_eventdev -lrte_efd -lrte_distributor -lrte_cryptodev -lrte_compressdev -lrte_cfgfile -lrte_bitratestats -lrte_bbdev -lrte_acl -lrte_timer -lrte_hash -lrte_metrics -lrte_cmdline -lrte_pci -lrte_ethdev -lrte_meter -lrte_net -lrte_mbuf -lrte_mempool -lrte_ring -lrte_eal -lrte_kvargs
make: ccache: Command not found
Makefile:28: recipe for target 'build/cmdline-shared' failed
make: *** [build/cmdline-shared] Error 127
make: Leaving directory '/tmp/UB1604-32_K4.4.0_GCC5.4.0/i686-native-linuxapp-gcc/1c9745ce7f774ddb83b185d1e2da3325/dpdk/build-x86-default/install-root/usr/local/share/dpdk/examples/cmdline'
## Building helloworld
make: Entering directory '/tmp/UB1604-32_K4.4.0_GCC5.4.0/i686-native-linuxapp-gcc/1c9745ce7f774ddb83b185d1e2da3325/dpdk/build-x86-default/install-root/usr/local/share/dpdk/examples/helloworld'
Unknown option --path
rm -f build/helloworld build/helloworld-static build/helloworld-shared
test -d build && rmdir -p build || true
ccache gcc -O3 -include rte_config.h -march=nehalem -I/tmp/UB1604-32_K4.4.0_GCC5.4.0/i686-native-linuxapp-gcc/1c9745ce7f774ddb83b185d1e2da3325/dpdk/build-x86-default/install-root/usr/local/include main.c -o build/helloworld-shared  -L/tmp/UB1604-32_K4.4.0_GCC5.4.0/i686-native-linuxapp-gcc/1c9745ce7f774ddb83b185d1e2da3325/dpdk/build-x86-default/install-root/usr/local/lib -lrte_bpf -lrte_flow_classify -lrte_pipeline -lrte_table -lrte_port -lrte_ipsec -lrte_vhost -lrte_stack -lrte_security -lrte_sched -lrte_reorder -lrte_rcu -lrte_rawdev -lrte_pdump -lrte_power -lrte_member -lrte_lpm -lrte_latencystats -lrte_jobstats -lrte_ip_frag -lrte_gso -lrte_gro -lrte_eventdev -lrte_efd -lrte_distributor -lrte_cryptodev -lrte_compressdev -lrte_cfgfile -lrte_bitratestats -lrte_bbdev -lrte_acl -lrte_timer -lrte_hash -lrte_metrics -lrte_cmdline -lrte_pci -lrte_ethdev -lrte_meter -lrte_net -lrte_mbuf -lrte_mempool -lrte_ring -lrte_eal -lrte_kvargs
make: ccache: Command not found
Makefile:28: recipe for target 'build/helloworld-shared' failed
make: *** [build/helloworld-shared] Error 127
make: Leaving directory '/tmp/UB1604-32_K4.4.0_GCC5.4.0/i686-native-linuxapp-gcc/1c9745ce7f774ddb83b185d1e2da3325/dpdk/build-x86-default/install-root/usr/local/share/dpdk/examples/helloworld'
## Building l2fwd
make: Entering directory '/tmp/UB1604-32_K4.4.0_GCC5.4.0/i686-native-linuxapp-gcc/1c9745ce7f774ddb83b185d1e2da3325/dpdk/build-x86-default/install-root/usr/local/share/dpdk/examples/l2fwd'
Unknown option --path
rm -f build/l2fwd build/l2fwd-static build/l2fwd-shared
test -d build && rmdir -p build || true
ccache gcc -O3 -include rte_config.h -march=nehalem -I/tmp/UB1604-32_K4.4.0_GCC5.4.0/i686-native-linuxapp-gcc/1c9745ce7f774ddb83b185d1e2da3325/dpdk/build-x86-default/install-root/usr/local/include main.c -o build/l2fwd-shared  -L/tmp/UB1604-32_K4.4.0_GCC5.4.0/i686-native-linuxapp-gcc/1c9745ce7f774ddb83b185d1e2da3325/dpdk/build-x86-default/install-root/usr/local/lib -lrte_bpf -lrte_flow_classify -lrte_pipeline -lrte_table -lrte_port -lrte_ipsec -lrte_vhost -lrte_stack -lrte_security -lrte_sched -lrte_reorder -lrte_rcu -lrte_rawdev -lrte_pdump -lrte_power -lrte_member -lrte_lpm -lrte_latencystats -lrte_jobstats -lrte_ip_frag -lrte_gso -lrte_gro -lrte_eventdev -lrte_efd -lrte_distributor -lrte_cryptodev -lrte_compressdev -lrte_cfgfile -lrte_bitratestats -lrte_bbdev -lrte_acl -lrte_timer -lrte_hash -lrte_metrics -lrte_cmdline -lrte_pci -lrte_ethdev -lrte_meter -lrte_net -lrte_mbuf -lrte_mempool -lrte_ring -lrte_eal -lrte_kvargs
make: ccache: Command not found
Makefile:28: recipe for target 'build/l2fwd-shared' failed
make: *** [build/l2fwd-shared] Error 127
make: Leaving directory '/tmp/UB1604-32_K4.4.0_GCC5.4.0/i686-native-linuxapp-gcc/1c9745ce7f774ddb83b185d1e2da3325/dpdk/build-x86-default/install-root/usr/local/share/dpdk/examples/l2fwd'
## Building l3fwd
make: Entering directory '/tmp/UB1604-32_K4.4.0_GCC5.4.0/i686-native-linuxapp-gcc/1c9745ce7f774ddb83b185d1e2da3325/dpdk/build-x86-default/install-root/usr/local/share/dpdk/examples/l3fwd'
Unknown option --path
rm -f build/l3fwd build/l3fwd-static build/l3fwd-shared
test -d build && rmdir -p build || true
ccache gcc -O3 -include rte_config.h -march=nehalem -I/tmp/UB1604-32_K4.4.0_GCC5.4.0/i686-native-linuxapp-gcc/1c9745ce7f774ddb83b185d1e2da3325/dpdk/build-x86-default/install-root/usr/local/include main.c l3fwd_lpm.c l3fwd_em.c -o build/l3fwd-shared  -L/tmp/UB1604-32_K4.4.0_GCC5.4.0/i686-native-linuxapp-gcc/1c9745ce7f774ddb83b185d1e2da3325/dpdk/build-x86-default/install-root/usr/local/lib -lrte_bpf -lrte_flow_classify -lrte_pipeline -lrte_table -lrte_port -lrte_ipsec -lrte_vhost -lrte_stack -lrte_security -lrte_sched -lrte_reorder -lrte_rcu -lrte_rawdev -lrte_pdump -lrte_power -lrte_member -lrte_lpm -lrte_latencystats -lrte_jobstats -lrte_ip_frag -lrte_gso -lrte_gro -lrte_eventdev -lrte_efd -lrte_distributor -lrte_cryptodev -lrte_compressdev -lrte_cfgfile -lrte_bitratestats -lrte_bbdev -lrte_acl -lrte_timer -lrte_hash -lrte_metrics -lrte_cmdline -lrte_pci -lrte_ethdev -lrte_meter -lrte_net -lrte_mbuf -lrte_mempool -lrte_ring -lrte_eal -lrte_kvargs
make: ccache: Command not found
Makefile:28: recipe for target 'build/l3fwd-shared' failed
make: *** [build/l3fwd-shared] Error 127
make: Leaving directory '/tmp/UB1604-32_K4.4.0_GCC5.4.0/i686-native-linuxapp-gcc/1c9745ce7f774ddb83b185d1e2da3325/dpdk/build-x86-default/install-root/usr/local/share/dpdk/examples/l3fwd'
## Building skeleton
make: Entering directory '/tmp/UB1604-32_K4.4.0_GCC5.4.0/i686-native-linuxapp-gcc/1c9745ce7f774ddb83b185d1e2da3325/dpdk/build-x86-default/install-root/usr/local/share/dpdk/examples/skeleton'
Unknown option --path
rm -f build/basicfwd build/basicfwd-static build/basicfwd-shared
test -d build && rmdir -p build || true
ccache gcc -O3 -include rte_config.h -march=nehalem -I/tmp/UB1604-32_K4.4.0_GCC5.4.0/i686-native-linuxapp-gcc/1c9745ce7f774ddb83b185d1e2da3325/dpdk/build-x86-default/install-root/usr/local/include basicfwd.c -o build/basicfwd-shared  -L/tmp/UB1604-32_K4.4.0_GCC5.4.0/i686-native-linuxapp-gcc/1c9745ce7f774ddb83b185d1e2da3325/dpdk/build-x86-default/install-root/usr/local/lib -lrte_bpf -lrte_flow_classify -lrte_pipeline -lrte_table -lrte_port -lrte_ipsec -lrte_vhost -lrte_stack -lrte_security -lrte_sched -lrte_reorder -lrte_rcu -lrte_rawdev -lrte_pdump -lrte_power -lrte_member -lrte_lpm -lrte_latencystats -lrte_jobstats -lrte_ip_frag -lrte_gso -lrte_gro -lrte_eventdev -lrte_efd -lrte_distributor -lrte_cryptodev -lrte_compressdev -lrte_cfgfile -lrte_bitratestats -lrte_bbdev -lrte_acl -lrte_timer -lrte_hash -lrte_metrics -lrte_cmdline -lrte_pci -lrte_ethdev -lrte_meter -lrte_net -lrte_mbuf -lrte_mempool -lrte_ring -lrte_eal -lrte_kvargs
make: ccache: Command not found
Makefile:28: recipe for target 'build/basicfwd-shared' failed
make: *** [build/basicfwd-shared] Error 127
make: Leaving directory '/tmp/UB1604-32_K4.4.0_GCC5.4.0/i686-native-linuxapp-gcc/1c9745ce7f774ddb83b185d1e2da3325/dpdk/build-x86-default/install-root/usr/local/share/dpdk/examples/skeleton'
## Building timer
make: Entering directory '/tmp/UB1604-32_K4.4.0_GCC5.4.0/i686-native-linuxapp-gcc/1c9745ce7f774ddb83b185d1e2da3325/dpdk/build-x86-default/install-root/usr/local/share/dpdk/examples/timer'
Unknown option --path
rm -f build/timer build/timer-static build/timer-shared
test -d build && rmdir -p build || true
ccache gcc -O3 -include rte_config.h -march=nehalem -I/tmp/UB1604-32_K4.4.0_GCC5.4.0/i686-native-linuxapp-gcc/1c9745ce7f774ddb83b185d1e2da3325/dpdk/build-x86-default/install-root/usr/local/include main.c -o build/timer-shared  -L/tmp/UB1604-32_K4.4.0_GCC5.4.0/i686-native-linuxapp-gcc/1c9745ce7f774ddb83b185d1e2da3325/dpdk/build-x86-default/install-root/usr/local/lib -lrte_bpf -lrte_flow_classify -lrte_pipeline -lrte_table -lrte_port -lrte_ipsec -lrte_vhost -lrte_stack -lrte_security -lrte_sched -lrte_reorder -lrte_rcu -lrte_rawdev -lrte_pdump -lrte_power -lrte_member -lrte_lpm -lrte_latencystats -lrte_jobstats -lrte_ip_frag -lrte_gso -lrte_gro -lrte_eventdev -lrte_efd -lrte_distributor -lrte_cryptodev -lrte_compressdev -lrte_cfgfile -lrte_bitratestats -lrte_bbdev -lrte_acl -lrte_timer -lrte_hash -lrte_metrics -lrte_cmdline -lrte_pci -lrte_ethdev -lrte_meter -lrte_net -lrte_mbuf -lrte_mempool -lrte_ring -lrte_eal -lrte_kvargs
make: ccache: Command not found
Makefile:28: recipe for target 'build/timer-shared' failed
make: *** [build/timer-shared] Error 127
make: Leaving directory '/tmp/UB1604-32_K4.4.0_GCC5.4.0/i686-native-linuxapp-gcc/1c9745ce7f774ddb83b185d1e2da3325/dpdk/build-x86-default/install-root/usr/local/share/dpdk/examples/timer'


*Meson Build Failed #4:
OS: UB1804-64
Target:build-gcc-static
Unknown option --path
rm -f build/cmdline build/cmdline-static build/cmdline-shared
test -d build && rmdir -p build || true
ccache gcc -O3 -include rte_config.h -march=nehalem -mno-avx512f -I/tmp/UB1804-64_K4.15.0_GCC7.3.0/x86_64-native-linuxapp-gcc/1c9745ce7f774ddb83b185d1e2da3325/dpdk/build-x86-default/install-root/usr/local/include -I/usr/lib/include main.c commands.c parse_obj_list.c -o build/cmdline-shared  -L/tmp/UB1804-64_K4.15.0_GCC7.3.0/x86_64-native-linuxapp-gcc/1c9745ce7f774ddb83b185d1e2da3325/dpdk/build-x86-default/install-root/usr/local/lib -lrte_bpf -lrte_flow_classify -lrte_pipeline -lrte_table -lrte_port -lrte_ipsec -lrte_vhost -lrte_stack -lrte_security -lrte_sched -lrte_reorder -lrte_rcu -lrte_rawdev -lrte_pdump -lrte_power -lrte_member -lrte_lpm -lrte_latencystats -lrte_kni -lrte_jobstats -lrte_ip_frag -lrte_gso -lrte_gro -lrte_eventdev -lrte_efd -lrte_distributor -lrte_cryptodev -lrte_compressdev -lrte_cfgfile -lrte_bitratestats -lrte_bbdev -lrte_acl -lrte_timer -lrte_hash -lrte_metrics -lrte_cmdline -lrte_pci -lrte_ethdev -lrte_meter -lrte_net -lrte_mbuf -lrte_mempool -lrte_ring -lrte_eal -lrte_kvargs
make: ccache: Command not found
Makefile:28: recipe for target 'build/cmdline-shared' failed
make: *** [build/cmdline-shared] Error 127
make: Leaving directory '/tmp/UB1804-64_K4.15.0_GCC7.3.0/x86_64-native-linuxapp-gcc/1c9745ce7f774ddb83b185d1e2da3325/dpdk/build-x86-default/install-root/usr/local/share/dpdk/examples/cmdline'
## Building helloworld
make: Entering directory '/tmp/UB1804-64_K4.15.0_GCC7.3.0/x86_64-native-linuxapp-gcc/1c9745ce7f774ddb83b185d1e2da3325/dpdk/build-x86-default/install-root/usr/local/share/dpdk/examples/helloworld'
Unknown option --path
rm -f build/helloworld build/helloworld-static build/helloworld-shared
test -d build && rmdir -p build || true
ccache gcc -O3 -include rte_config.h -march=nehalem -mno-avx512f -I/tmp/UB1804-64_K4.15.0_GCC7.3.0/x86_64-native-linuxapp-gcc/1c9745ce7f774ddb83b185d1e2da3325/dpdk/build-x86-default/install-root/usr/local/include -I/usr/lib/include main.c -o build/helloworld-shared  -L/tmp/UB1804-64_K4.15.0_GCC7.3.0/x86_64-native-linuxapp-gcc/1c9745ce7f774ddb83b185d1e2da3325/dpdk/build-x86-default/install-root/usr/local/lib -lrte_bpf -lrte_flow_classify -lrte_pipeline -lrte_table -lrte_port -lrte_ipsec -lrte_vhost -lrte_stack -lrte_security -lrte_sched -lrte_reorder -lrte_rcu -lrte_rawdev -lrte_pdump -lrte_power -lrte_member -lrte_lpm -lrte_latencystats -lrte_kni -lrte_jobstats -lrte_ip_frag -lrte_gso -lrte_gro -lrte_eventdev -lrte_efd -lrte_distributor -lrte_cryptodev -lrte_compressdev -lrte_cfgfile -lrte_bitratestats -lrte_bbdev -lrte_acl -lrte_timer -lrte_hash -lrte_metrics -lrte_cmdline -lrte_pci -lrte_ethdev -lrte_meter -lrte_net -lrte_mbuf -lrte_mempool -lrte_ring -lrte_eal -lrte_kvargs
make: ccache: Command not found
Makefile:28: recipe for target 'build/helloworld-shared' failed
make: *** [build/helloworld-shared] Error 127
make: Leaving directory '/tmp/UB1804-64_K4.15.0_GCC7.3.0/x86_64-native-linuxapp-gcc/1c9745ce7f774ddb83b185d1e2da3325/dpdk/build-x86-default/install-root/usr/local/share/dpdk/examples/helloworld'
## Building l2fwd
make: Entering directory '/tmp/UB1804-64_K4.15.0_GCC7.3.0/x86_64-native-linuxapp-gcc/1c9745ce7f774ddb83b185d1e2da3325/dpdk/build-x86-default/install-root/usr/local/share/dpdk/examples/l2fwd'
Unknown option --path
rm -f build/l2fwd build/l2fwd-static build/l2fwd-shared
test -d build && rmdir -p build || true
ccache gcc -O3 -include rte_config.h -march=nehalem -mno-avx512f -I/tmp/UB1804-64_K4.15.0_GCC7.3.0/x86_64-native-linuxapp-gcc/1c9745ce7f774ddb83b185d1e2da3325/dpdk/build-x86-default/install-root/usr/local/include -I/usr/lib/include main.c -o build/l2fwd-shared  -L/tmp/UB1804-64_K4.15.0_GCC7.3.0/x86_64-native-linuxapp-gcc/1c9745ce7f774ddb83b185d1e2da3325/dpdk/build-x86-default/install-root/usr/local/lib -lrte_bpf -lrte_flow_classify -lrte_pipeline -lrte_table -lrte_port -lrte_ipsec -lrte_vhost -lrte_stack -lrte_security -lrte_sched -lrte_reorder -lrte_rcu -lrte_rawdev -lrte_pdump -lrte_power -lrte_member -lrte_lpm -lrte_latencystats -lrte_kni -lrte_jobstats -lrte_ip_frag -lrte_gso -lrte_gro -lrte_eventdev -lrte_efd -lrte_distributor -lrte_cryptodev -lrte_compressdev -lrte_cfgfile -lrte_bitratestats -lrte_bbdev -lrte_acl -lrte_timer -lrte_hash -lrte_metrics -lrte_cmdline -lrte_pci -lrte_ethdev -lrte_meter -lrte_net -lrte_mbuf -lrte_mempool -lrte_ring -lrte_eal -lrte_kvargs
make: ccache: Command not found
Makefile:28: recipe for target 'build/l2fwd-shared' failed
make: *** [build/l2fwd-shared] Error 127
make: Leaving directory '/tmp/UB1804-64_K4.15.0_GCC7.3.0/x86_64-native-linuxapp-gcc/1c9745ce7f774ddb83b185d1e2da3325/dpdk/build-x86-default/install-root/usr/local/share/dpdk/examples/l2fwd'
## Building l3fwd
make: Entering directory '/tmp/UB1804-64_K4.15.0_GCC7.3.0/x86_64-native-linuxapp-gcc/1c9745ce7f774ddb83b185d1e2da3325/dpdk/build-x86-default/install-root/usr/local/share/dpdk/examples/l3fwd'
Unknown option --path
rm -f build/l3fwd build/l3fwd-static build/l3fwd-shared
test -d build && rmdir -p build || true
ccache gcc -O3 -include rte_config.h -march=nehalem -mno-avx512f -I/tmp/UB1804-64_K4.15.0_GCC7.3.0/x86_64-native-linuxapp-gcc/1c9745ce7f774ddb83b185d1e2da3325/dpdk/build-x86-default/install-root/usr/local/include -I/usr/lib/include main.c l3fwd_lpm.c l3fwd_em.c -o build/l3fwd-shared  -L/tmp/UB1804-64_K4.15.0_GCC7.3.0/x86_64-native-linuxapp-gcc/1c9745ce7f774ddb83b185d1e2da3325/dpdk/build-x86-default/install-root/usr/local/lib -lrte_bpf -lrte_flow_classify -lrte_pipeline -lrte_table -lrte_port -lrte_ipsec -lrte_vhost -lrte_stack -lrte_security -lrte_sched -lrte_reorder -lrte_rcu -lrte_rawdev -lrte_pdump -lrte_power -lrte_member -lrte_lpm -lrte_latencystats -lrte_kni -lrte_jobstats -lrte_ip_frag -lrte_gso -lrte_gro -lrte_eventdev -lrte_efd -lrte_distributor -lrte_cryptodev -lrte_compressdev -lrte_cfgfile -lrte_bitratestats -lrte_bbdev -lrte_acl -lrte_timer -lrte_hash -lrte_metrics -lrte_cmdline -lrte_pci -lrte_ethdev -lrte_meter -lrte_net -lrte_mbuf -lrte_mempool -lrte_ring -lrte_eal -lrte_kvargs
make: ccache: Command not found
Makefile:28: recipe for target 'build/l3fwd-shared' failed
make: *** [build/l3fwd-shared] Error 127
make: Leaving directory '/tmp/UB1804-64_K4.15.0_GCC7.3.0/x86_64-native-linuxapp-gcc/1c9745ce7f774ddb83b185d1e2da3325/dpdk/build-x86-default/install-root/usr/local/share/dpdk/examples/l3fwd'
## Building skeleton
make: Entering directory '/tmp/UB1804-64_K4.15.0_GCC7.3.0/x86_64-native-linuxapp-gcc/1c9745ce7f774ddb83b185d1e2da3325/dpdk/build-x86-default/install-root/usr/local/share/dpdk/examples/skeleton'
Unknown option --path
rm -f build/basicfwd build/basicfwd-static build/basicfwd-shared
test -d build && rmdir -p build || true
ccache gcc -O3 -include rte_config.h -march=nehalem -mno-avx512f -I/tmp/UB1804-64_K4.15.0_GCC7.3.0/x86_64-native-linuxapp-gcc/1c9745ce7f774ddb83b185d1e2da3325/dpdk/build-x86-default/install-root/usr/local/include -I/usr/lib/include basicfwd.c -o build/basicfwd-shared  -L/tmp/UB1804-64_K4.15.0_GCC7.3.0/x86_64-native-linuxapp-gcc/1c9745ce7f774ddb83b185d1e2da3325/dpdk/build-x86-default/install-root/usr/local/lib -lrte_bpf -lrte_flow_classify -lrte_pipeline -lrte_table -lrte_port -lrte_ipsec -lrte_vhost -lrte_stack -lrte_security -lrte_sched -lrte_reorder -lrte_rcu -lrte_rawdev -lrte_pdump -lrte_power -lrte_member -lrte_lpm -lrte_latencystats -lrte_kni -lrte_jobstats -lrte_ip_frag -lrte_gso -lrte_gro -lrte_eventdev -lrte_efd -lrte_distributor -lrte_cryptodev -lrte_compressdev -lrte_cfgfile -lrte_bitratestats -lrte_bbdev -lrte_acl -lrte_timer -lrte_hash -lrte_metrics -lrte_cmdline -lrte_pci -lrte_ethdev -lrte_meter -lrte_net -lrte_mbuf -lrte_mempool -lrte_ring -lrte_eal -lrte_kvargs
make: ccache: Command not found
Makefile:28: recipe for target 'build/basicfwd-shared' failed
make: *** [build/basicfwd-shared] Error 127
make: Leaving directory '/tmp/UB1804-64_K4.15.0_GCC7.3.0/x86_64-native-linuxapp-gcc/1c9745ce7f774ddb83b185d1e2da3325/dpdk/build-x86-default/install-root/usr/local/share/dpdk/examples/skeleton'
## Building timer
make: Entering directory '/tmp/UB1804-64_K4.15.0_GCC7.3.0/x86_64-native-linuxapp-gcc/1c9745ce7f774ddb83b185d1e2da3325/dpdk/build-x86-default/install-root/usr/local/share/dpdk/examples/timer'
Unknown option --path
rm -f build/timer build/timer-static build/timer-shared
test -d build && rmdir -p build || true
ccache gcc -O3 -include rte_config.h -march=nehalem -mno-avx512f -I/tmp/UB1804-64_K4.15.0_GCC7.3.0/x86_64-native-linuxapp-gcc/1c9745ce7f774ddb83b185d1e2da3325/dpdk/build-x86-default/install-root/usr/local/include -I/usr/lib/include main.c -o build/timer-shared  -L/tmp/UB1804-64_K4.15.0_GCC7.3.0/x86_64-native-linuxapp-gcc/1c9745ce7f774ddb83b185d1e2da3325/dpdk/build-x86-default/install-root/usr/local/lib -lrte_bpf -lrte_flow_classify -lrte_pipeline -lrte_table -lrte_port -lrte_ipsec -lrte_vhost -lrte_stack -lrte_security -lrte_sched -lrte_reorder -lrte_rcu -lrte_rawdev -lrte_pdump -lrte_power -lrte_member -lrte_lpm -lrte_latencystats -lrte_kni -lrte_jobstats -lrte_ip_frag -lrte_gso -lrte_gro -lrte_eventdev -lrte_efd -lrte_distributor -lrte_cryptodev -lrte_compressdev -lrte_cfgfile -lrte_bitratestats -lrte_bbdev -lrte_acl -lrte_timer -lrte_hash -lrte_metrics -lrte_cmdline -lrte_pci -lrte_ethdev -lrte_meter -lrte_net -lrte_mbuf -lrte_mempool -lrte_ring -lrte_eal -lrte_kvargs
make: ccache: Command not found
Makefile:28: recipe for target 'build/timer-shared' failed
make: *** [build/timer-shared] Error 127
make: Leaving directory '/tmp/UB1804-64_K4.15.0_GCC7.3.0/x86_64-native-linuxapp-gcc/1c9745ce7f774ddb83b185d1e2da3325/dpdk/build-x86-default/install-root/usr/local/share/dpdk/examples/timer'

DPDK STV team


More information about the test-report mailing list