[dpdk-test-report] |FAILURE| pw59994[v4, 2/4] examples/ipsec-secgw: add fallback session feature

sys_stv at intel.com sys_stv at intel.com
Fri Sep 27 16:18:42 CEST 2019


Test-Label: Intel-compilation
Test-Status: FAILURE
http://dpdk.org/patch/59994

_Compilation issues_

Submitter: Marcin Smoczynski <marcinx.smoczynski at intel.com>
Date: 2019-09-27 09:10:26
Reply_mail: 20190927091028.19316-3-marcinx.smoczynski at intel.com
DPDK git baseline: Repo:dpdk, CommitID: bd253daa7717835f88bbc58b09a94d0060380396

Makefile build Summary: 22 Builds Done, 21 Successful, 1 Failures

Meson build Summary: 7 Builds Done, 5 Successful, 2 Failures

               +==============================================+===========+==========+
               |                   Makefile                   |   Meson   | Document |
+--------------+------+-------+------+------------+-----------+-----------+----------+
| os           | gcc  | clang | icc  | gcc+shared | gcc+debug | gcc/clang | pdf/html |
+--------------+------+-------+------+------------+-----------+-----------+----------+
| RHEL76-64    | pass |       |      |            |           |           |          |
| CENTOS76-64  | pass | pass  | pass | pass       | pass      |           |          |
| UB1804-64    | pass | pass  | pass |            |           | pass      | pass     |
| UB1604-32    | pass |       |      |            |           | FAIL      |          |
| UB1904-64    | pass |       |      |            |           |           |          |
| UB1604-64    | FAIL | pass  |      |            |           |           |          |
| FC30-64      | pass | pass  |      |            |           | pass      |          |
| WIN10-64     |      |       |      |            |           | pass      |          |
| FreeBSD12-64 | pass | pass  |      | pass       | pass      | pass      |          |
| RHEL80-64    | pass |       |      |            |           |           |          |
| SUSE15-64    | pass | pass  |      |            |           | FAIL      |          |
+--------------+------+-------+------+------------+-----------+-----------+----------+

Test environment and configuration as below:

** Makefile build **


OS: RHEL76-64
	Kernel Version: 3.10.0-957.el7.x86_64
	CPU info: Intel(R) Xeon(R) CPU E5-2699 v4 @ 2.20GHz
	GCC Version: gcc (GCC) 4.8.5 20150623 (Red Hat 4.8.5-36)
	Clang Version: NA
	x86_64-native-linuxapp-gcc


OS: CENTOS76-64
	Kernel Version: 3.10.0-957.10.1.el7.x86_64
	CPU info: Intel(R) Xeon(R) CPU E5-2699 v4 @ 2.20GHz
	GCC Version: gcc (GCC) 4.8.5 20150623 (Red Hat 4.8.5-36)
	Clang Version: 3.4.2 (tags/RELEASE_34/dot2-final)
	x86_64-native-linuxapp-clang
	x86_64-native-linuxapp-gcc+debug
	x86_64-native-linuxapp-gcc
	x86_64-native-linuxapp-gcc+shared
	x86_64-native-linuxapp-icc


OS: UB1804-64
	Kernel Version: 4.15.0-20-generic
	CPU info: Intel(R) Xeon(R) CPU E5-2699 v3 @ 2.30GHz
	GCC Version: gcc (Ubuntu 7.3.0-16ubuntu3) 7.3.0
	Clang Version: 6.0.0-1ubuntu2 (tags/RELEASE_600/final)
	x86_64-native-linuxapp-clang
	x86_64-native-linuxapp-icc
	x86_64-native-linuxapp-gcc


OS: UB1904-64
	Kernel Version: 5.0.0-13-generic
	CPU info: Intel(R) Xeon(R) CPU E5-2699 v3 @ 2.30GHz
	GCC Version: gcc (Ubuntu 8.3.0-6ubuntu1) 8.3.0
	Clang Version: 8.0.0-3 (tags/RELEASE_800/final)
	x86_64-native-linuxapp-gcc


OS: UB1604-32
	Kernel Version: 4.4.0-131-generic
	CPU info: Intel(R) Xeon(R) CPU E5-2699 v3 @ 2.30GHz
	GCC Version: gcc (Ubuntu 5.4.0-6ubuntu1~16.04.11) 5.4.0 20160609
	Clang Version: 3.8.0-2ubuntu4 (tags/RELEASE_380/final)
	i686-native-linuxapp-gcc


OS: UB1604-64
	Kernel Version: 4.4.0-47-generic
	CPU info: Intel(R) Xeon(R) CPU E5-2699 v3 @ 2.30GHz
	GCC Version: gcc (Ubuntu 5.4.0-6ubuntu1~16.04.10) 5.4.0 20160609
	Clang Version: 3.8.0-2ubuntu4 (tags/RELEASE_380/final)
	x86_64-native-linuxapp-clang
	x86_64-native-linuxapp-gcc


OS: FC30-64
	Kernel Version: 5.1.7-300.fc30.x86_64
	CPU info: Intel(R) Xeon(R) CPU E5-2699 v4 @ 2.20GHz
	GCC Version: gcc (GCC) 9.1.1 20190503 (Red Hat 9.1.1-1)
	Clang Version: 8.0.0 (Fedora 8.0.0-1.fc30)
	x86_64-native-linuxapp-gcc
	x86_64-native-linuxapp-clang


OS: FreeBSD12-64
	Kernel Version: 12.0-RC3
	CPU info: Intel(R) Xeon(R) CPU E5-2699 v4 @ 2.20GHz (2194.97-MHz K8-class CPU)
	GCC Version: gcc (FreeBSD Ports Collection) 7.3.0
	Clang Version: 6.0.1 (tags/RELEASE_601/final 335540) (based on LLVM 6.0.1)
	x86_64-native-bsdapp-gcc+shared
	x86_64-native-bsdapp-gcc+debug
	x86_64-native-bsdapp-clang
	x86_64-native-bsdapp-gcc


OS: RHEL80-64
	Kernel Version: 4.18.0-80.el8.x86_64
	CPU info: Intel(R) Xeon(R) CPU E5-2699 v4 @ 2.20GHz
	GCC Version: gcc (GCC) 8.2.1 20180905 (Red Hat 8.2.1-3)
	Clang Version: 6.0.1 (tags/RELEASE_601/final)
	x86_64-native-linuxapp-gcc


OS: SUSE15-64
	Kernel Version: 4.12.14-lp150.11-default
	CPU info: Intel(R) Xeon(R) CPU E5-2699 v4 @ 2.20GHz
	GCC Version: gcc (SUSE Linux) 7.3.1 20180323 [gcc-7-branch revision 258812]
	Clang Version: 5.0.1 (tags/RELEASE_501/final 312548)
	x86_64-native-linuxapp-gcc
	x86_64-native-linuxapp-clang


** Meson build **


OS: UB1804-64
	Kernel Version: 4.15.0-20-generic
	CPU info: Intel(R) Xeon(R) CPU E5-2699 v4 @ 2.20GHz
	GCC Version: gcc (Ubuntu 7.3.0-27ubuntu1~18.04) 7.3.0
	Clang Version: 6.0.0-1ubuntu2 (tags/RELEASE_600/final)
	x86_64-native-linuxapp-doc
	build-gcc-static
	build-gcc-shared
	build-clang-static
	build-clang-shared
	build-x86-default


OS: UB1604-32
	Kernel Version: 4.4.0-131-generic
	CPU info: Intel(R) Xeon(R) CPU E5-2699 v4 @ 2.20GHz
	GCC Version: gcc (Ubuntu 5.4.0-6ubuntu1~16.04.11) 5.4.0 20160609
	Clang Version: 3.8.0-2ubuntu4 (tags/RELEASE_380/final)
	build-gcc-static
	build-gcc-shared
	build-clang-static
	build-clang-shared
	build-x86-default


OS: FC30-64
	Kernel Version: 5.0.9-301.fc30.x86_64
	CPU info: Intel(R) Xeon(R) CPU E5-2699 v4 @ 2.20GHz
	GCC Version: gcc (GCC) 9.1.1 20190503 (Red Hat 9.1.1-1)
	Clang Version: 8.0.0 (Fedora 8.0.0-1.fc30)
	build-gcc-static
	build-gcc-shared
	build-clang-static
	build-clang-shared
	build-x86-default


OS: WIN10-64
	Kernel Version: N/A
	CPU info: N/A
	GCC Version: N/A
	Clang Version: Clang 8.0.0
	x86_64-windows-clang


OS: FreeBSD12-64
	Kernel Version: 12.0-RC3
	CPU info: Intel(R) Xeon(R) CPU E5-2699 v4 @ 2.20GHz (2194.99-MHz K8-class CPU)
	GCC Version: gcc (FreeBSD Ports Collection) 7.3.0
	Clang Version: 6.0.1 (tags/RELEASE_601/final 335540) (based on LLVM 6.0.1)
	build-gcc-static
	build-gcc-shared
	build-clang-static
	build-clang-shared
	build-x86-default


OS: SUSE15-64
	Kernel Version: 4.12.14-lp150.11-default
	CPU info: Intel(R) Xeon(R) CPU E5-2699 v4 @ 2.20GHz
	GCC Version: gcc (SUSE Linux) 7.3.1 20180323 [gcc-7-branch revision 258812]
	Clang Version: 5.0.1 (tags/RELEASE_501/final 312548)
	build-gcc-static
	build-gcc-shared
	build-clang-static
	build-clang-shared
	build-x86-default


*Make Build Failed #1:
OS: UB1604-64
Target: x86_64-native-linuxapp-gcc
  CC rte_option.o
/tmp/UB1604-64_K4.4.0_GCC5.4.0/x86_64-native-linuxapp-gcc/9ccd83dbfe8e4542a5a1b9eaf21111ab/dpdk/buildtools/check-experimental-syms.sh: 28: /tmp/UB1604-64_K4.4.0_GCC5.4.0/x86_64-native-linuxapp-gcc/9ccd83dbfe8e4542a5a1b9eaf21111ab/dpdk/buildtools/check-experimental-syms.sh: Cannot fork
/tmp/UB1604-64_K4.4.0_GCC5.4.0/x86_64-native-linuxapp-gcc/9ccd83dbfe8e4542a5a1b9eaf21111ab/dpdk/buildtools/check-experimental-syms.sh: 25: /tmp/UB1604-64_K4.4.0_GCC5.4.0/x86_64-native-linuxapp-gcc/9ccd83dbfe8e4542a5a1b9eaf21111ab/dpdk/buildtools/check-experimental-syms.sh: Cannot fork
/tmp/UB1604-64_K4.4.0_GCC5.4.0/x86_64-native-linuxapp-gcc/9ccd83dbfe8e4542a5a1b9eaf21111ab/dpdk/buildtools/check-experimental-syms.sh: 28: /tmp/UB1604-64_K4.4.0_GCC5.4.0/x86_64-native-linuxapp-gcc/9ccd83dbfe8e4542a5a1b9eaf21111ab/dpdk/buildtools/check-experimental-syms.sh: Cannot fork
/tmp/UB1604-64_K4.4.0_GCC5.4.0/x86_64-native-linuxapp-gcc/9ccd83dbfe8e4542a5a1b9eaf21111ab/dpdk/buildtools/check-experimental-syms.sh: 25: /tmp/UB1604-64_K4.4.0_GCC5.4.0/x86_64-native-linuxapp-gcc/9ccd83dbfe8e4542a5a1b9eaf21111ab/dpdk/buildtools/check-experimental-syms.sh: Cannot fork
/tmp/UB1604-64_K4.4.0_GCC5.4.0/x86_64-native-linuxapp-gcc/9ccd83dbfe8e4542a5a1b9eaf21111ab/dpdk/mk/internal/rte.compile-pre.mk:114: recipe for target 'eal_common_proc.o' failed
make[7]: *** [eal_common_proc.o] Error 2
make[7]: *** Waiting for unfinished jobs....
/tmp/UB1604-64_K4.4.0_GCC5.4.0/x86_64-native-linuxapp-gcc/9ccd83dbfe8e4542a5a1b9eaf21111ab/dpdk/mk/internal/rte.compile-pre.mk:114: recipe for target 'rte_keepalive.o' failed
make[7]: *** [rte_keepalive.o] Error 2
/tmp/UB1604-64_K4.4.0_GCC5.4.0/x86_64-native-linuxapp-gcc/9ccd83dbfe8e4542a5a1b9eaf21111ab/dpdk/mk/internal/rte.compile-pre.mk:114: recipe for target 'hotplug_mp.o' failed
make[7]: *** [hotplug_mp.o] Error 2
/tmp/UB1604-64_K4.4.0_GCC5.4.0/x86_64-native-linuxapp-gcc/9ccd83dbfe8e4542a5a1b9eaf21111ab/dpdk/buildtools/check-experimental-syms.sh: 28: /tmp/UB1604-64_K4.4.0_GCC5.4.0/x86_64-native-linuxapp-gcc/9ccd83dbfe8e4542a5a1b9eaf21111ab/dpdk/buildtools/check-experimental-syms.sh: Cannot fork
/tmp/UB1604-64_K4.4.0_GCC5.4.0/x86_64-native-linuxapp-gcc/9ccd83dbfe8e4542a5a1b9eaf21111ab/dpdk/mk/internal/rte.compile-pre.mk:114: recipe for target 'malloc_elem.o' failed
make[7]: *** [malloc_elem.o] Error 2
/tmp/UB1604-64_K4.4.0_GCC5.4.0/x86_64-native-linuxapp-gcc/9ccd83dbfe8e4542a5a1b9eaf21111ab/dpdk/buildtools/check-experimental-syms.sh: 28: /tmp/UB1604-64_K4.4.0_GCC5.4.0/x86_64-native-linuxapp-gcc/9ccd83dbfe8e4542a5a1b9eaf21111ab/dpdk/buildtools/check-experimental-syms.sh: Cannot fork
/tmp/UB1604-64_K4.4.0_GCC5.4.0/x86_64-native-linuxapp-gcc/9ccd83dbfe8e4542a5a1b9eaf21111ab/dpdk/mk/internal/rte.compile-pre.mk:114: recipe for target 'eal_common_fbarray.o' failed
make[7]: *** [eal_common_fbarray.o] Error 2
/tmp/UB1604-64_K4.4.0_GCC5.4.0/x86_64-native-linuxapp-gcc/9ccd83dbfe8e4542a5a1b9eaf21111ab/dpdk/mk/internal/rte.compile-pre.mk:114: recipe for target 'malloc_mp.o' failed
make[7]: *** [malloc_mp.o] Error 2
/tmp/UB1604-64_K4.4.0_GCC5.4.0/x86_64-native-linuxapp-gcc/9ccd83dbfe8e4542a5a1b9eaf21111ab/dpdk/buildtools/check-experimental-syms.sh: 22: /tmp/UB1604-64_K4.4.0_GCC5.4.0/x86_64-native-linuxapp-gcc/9ccd83dbfe8e4542a5a1b9eaf21111ab/dpdk/buildtools/check-experimental-syms.sh: Cannot fork
/tmp/UB1604-64_K4.4.0_GCC5.4.0/x86_64-native-linuxapp-gcc/9ccd83dbfe8e4542a5a1b9eaf21111ab/dpdk/mk/internal/rte.compile-pre.mk:114: recipe for target 'rte_option.o' failed
make[7]: *** [rte_option.o] Error 2
/tmp/UB1604-64_K4.4.0_GCC5.4.0/x86_64-native-linuxapp-gcc/9ccd83dbfe8e4542a5a1b9eaf21111ab/dpdk/buildtools/check-experimental-syms.sh: 25: /tmp/UB1604-64_K4.4.0_GCC5.4.0/x86_64-native-linuxapp-gcc/9ccd83dbfe8e4542a5a1b9eaf21111ab/dpdk/buildtools/check-experimental-syms.sh: Cannot fork
/tmp/UB1604-64_K4.4.0_GCC5.4.0/x86_64-native-linuxapp-gcc/9ccd83dbfe8e4542a5a1b9eaf21111ab/dpdk/mk/internal/rte.compile-pre.mk:114: recipe for target 'rte_malloc.o' failed
make[7]: *** [rte_malloc.o] Error 2
/tmp/UB1604-64_K4.4.0_GCC5.4.0/x86_64-native-linuxapp-gcc/9ccd83dbfe8e4542a5a1b9eaf21111ab/dpdk/buildtools/check-experimental-syms.sh: 25: /tmp/UB1604-64_K4.4.0_GCC5.4.0/x86_64-native-linuxapp-gcc/9ccd83dbfe8e4542a5a1b9eaf21111ab/dpdk/buildtools/check-experimental-syms.sh: Cannot fork
/tmp/UB1604-64_K4.4.0_GCC5.4.0/x86_64-native-linuxapp-gcc/9ccd83dbfe8e4542a5a1b9eaf21111ab/dpdk/mk/internal/rte.compile-pre.mk:114: recipe for target 'eal_common_options.o' failed
make[7]: *** [eal_common_options.o] Error 2
/tmp/UB1604-64_K4.4.0_GCC5.4.0/x86_64-native-linuxapp-gcc/9ccd83dbfe8e4542a5a1b9eaf21111ab/dpdk/mk/rte.subdir.mk:35: recipe for target 'eal' failed
make[6]: *** [eal] Error 2
/tmp/UB1604-64_K4.4.0_GCC5.4.0/x86_64-native-linuxapp-gcc/9ccd83dbfe8e4542a5a1b9eaf21111ab/dpdk/mk/rte.subdir.mk:35: recipe for target 'linux' failed
make[5]: *** [linux] Error 2
/tmp/UB1604-64_K4.4.0_GCC5.4.0/x86_64-native-linuxapp-gcc/9ccd83dbfe8e4542a5a1b9eaf21111ab/dpdk/mk/rte.subdir.mk:35: recipe for target 'librte_eal' failed
make[4]: *** [librte_eal] Error 2
/tmp/UB1604-64_K4.4.0_GCC5.4.0/x86_64-native-linuxapp-gcc/9ccd83dbfe8e4542a5a1b9eaf21111ab/dpdk/mk/rte.sdkbuild.mk:46: recipe for target 'lib' failed
make[3]: *** [lib] Error 2
/tmp/UB1604-64_K4.4.0_GCC5.4.0/x86_64-native-linuxapp-gcc/9ccd83dbfe8e4542a5a1b9eaf21111ab/dpdk/mk/rte.sdkroot.mk:98: recipe for target 'all' failed
make[2]: *** [all] Error 2
/tmp/UB1604-64_K4.4.0_GCC5.4.0/x86_64-native-linuxapp-gcc/9ccd83dbfe8e4542a5a1b9eaf21111ab/dpdk/mk/rte.sdkinstall.mk:60: recipe for target 'pre_install' failed
make[1]: *** [pre_install] Error 2
/tmp/UB1604-64_K4.4.0_GCC5.4.0/x86_64-native-linuxapp-gcc/9ccd83dbfe8e4542a5a1b9eaf21111ab/dpdk/mk/rte.sdkroot.mk:77: recipe for target 'install' failed
make: *** [install] Error 2

*Meson Build Failed #1:
OS: SUSE15-64
Target:build-gcc-static
[1725/1831] Compiling C object 'examples/c590b3c@@dpdk-ip_pipeline at exe/ip_pipeline_tmgr.c.o'.
[1726/1831] Compiling C object 'examples/c590b3c@@dpdk-ip_pipeline at exe/ip_pipeline_cryptodev.c.o'.
[1727/1831] Compiling C object 'examples/c590b3c@@dpdk-ipsec-secgw at exe/ipsec-secgw_rt.c.o'.
[1728/1831] Compiling C object 'examples/c590b3c@@dpdk-ip_pipeline at exe/ip_pipeline_parser.c.o'.
[1729/1831] Compiling C object 'examples/c590b3c@@dpdk-ipsec-secgw at exe/ipsec-secgw_ipsec-secgw.c.o'.
FAILED: examples/c590b3c@@dpdk-ipsec-secgw at exe/ipsec-secgw_ipsec-secgw.c.o 
clang -Iexamples/c590b3c@@dpdk-ipsec-secgw at exe -Iexamples -I../examples -Iexamples/ipsec-secgw -I../examples/ipsec-secgw -I. -I../ -Iconfig -I../config -Ilib/librte_eal/common/include -I../lib/librte_eal/common/include -I../lib/librte_eal/linux/eal/include -Ilib/librte_eal/common -I../lib/librte_eal/common -Ilib/librte_eal/common/include/arch/x86 -I../lib/librte_eal/common/include/arch/x86 -Ilib/librte_eal -I../lib/librte_eal -Ilib/librte_kvargs -I../lib/librte_kvargs -Ilib/librte_mempool -I../lib/librte_mempool -Ilib/librte_ring -I../lib/librte_ring -Ilib/librte_net -I../lib/librte_net -Ilib/librte_mbuf -I../lib/librte_mbuf -Ilib/librte_ethdev -I../lib/librte_ethdev -Ilib/librte_meter -I../lib/librte_meter -Ilib/librte_cmdline -I../lib/librte_cmdline -Ilib/librte_security -I../lib/librte_security -Ilib/librte_cryptodev -I../lib/librte_cryptodev -Ilib/librte_lpm -I../lib/librte_lpm -Ilib/librte_hash -I../lib/librte_hash -Ilib/librte_acl -I../lib/librte_acl -Ilib/librte_ip_frag -I../lib/librte_ip_frag -Ilib/librte_ipsec -I../lib/librte_ipsec -Xclang -fcolor-diagnostics -pipe -D_FILE_OFFSET_BITS=64 -Wall -Winvalid-pch -Werror -O3 -include rte_config.h -Wunused-parameter -Wsign-compare -Wcast-qual -Wno-address-of-packed-member -D_GNU_SOURCE -march=native -DALLOW_EXPERIMENTAL_API -MD -MQ 'examples/c590b3c@@dpdk-ipsec-secgw at exe/ipsec-secgw_ipsec-secgw.c.o' -MF 'examples/c590b3c@@dpdk-ipsec-secgw at exe/ipsec-secgw_ipsec-secgw.c.o.d' -o 'examples/c590b3c@@dpdk-ipsec-secgw at exe/ipsec-secgw_ipsec-secgw.c.o' -c ../examples/ipsec-secgw/ipsec-secgw.c
../examples/ipsec-secgw/ipsec-secgw.c:1356:29: error: comparison of unsigned expression < 0 is always false [-Werror,-Wtautological-compare]
                || num > INT64_MAX || num < 0)
                                      ~~~ ^ ~
1 error generated.
--
[1732/1831] Compiling C object 'examples/c590b3c@@dpdk-ip_reassembly at exe/ip_reassembly_main.c.o'.
[1733/1831] Compiling C object 'examples/c590b3c@@dpdk-ipsec-secgw at exe/ipsec-secgw_esp.c.o'.
[1734/1831] Compiling C object 'examples/c590b3c@@dpdk-ip_pipeline at exe/ip_pipeline_thread.c.o'.
[1735/1831] Compiling C object 'examples/c590b3c@@dpdk-ipsec-secgw at exe/ipsec-secgw_ipsec.c.o'.
[1736/1831] Compiling C object 'examples/c590b3c@@dpdk-ipsec-secgw at exe/ipsec-secgw_sa.c.o'.
ninja: build stopped: subcommand failed.
meson --werror -Dexamples=all --default-library=shared /tmp/SUSE15-64_K4.12.14_GCC7.3.1/x86_64-native-linuxapp-gcc/9ccd83dbfe8e4542a5a1b9eaf21111ab/dpdk/devtools/.. build-clang-shared
The Meson build system
Version: 0.50.1
Source dir: /tmp/SUSE15-64_K4.12.14_GCC7.3.1/x86_64-native-linuxapp-gcc/9ccd83dbfe8e4542a5a1b9eaf21111ab/dpdk
Build dir: /tmp/SUSE15-64_K4.12.14_GCC7.3.1/x86_64-native-linuxapp-gcc/9ccd83dbfe8e4542a5a1b9eaf21111ab/dpdk/build-clang-shared
--
[1759/1855] Compiling C object 'examples/c590b3c@@dpdk-ip_pipeline at exe/ip_pipeline_thread.c.o'.
[1760/1855] Compiling C object 'examples/c590b3c@@dpdk-ip_reassembly at exe/ip_reassembly_main.c.o'.
[1761/1855] Compiling C object 'examples/c590b3c@@dpdk-ipsec-secgw at exe/ipsec-secgw_parser.c.o'.
[1762/1855] Linking target examples/dpdk-ip_reassembly.
[1763/1855] Compiling C object 'examples/c590b3c@@dpdk-ipsec-secgw at exe/ipsec-secgw_ipsec-secgw.c.o'.
FAILED: examples/c590b3c@@dpdk-ipsec-secgw at exe/ipsec-secgw_ipsec-secgw.c.o 
clang -Iexamples/c590b3c@@dpdk-ipsec-secgw at exe -Iexamples -I../examples -Iexamples/ipsec-secgw -I../examples/ipsec-secgw -I. -I../ -Iconfig -I../config -Ilib/librte_eal/common/include -I../lib/librte_eal/common/include -I../lib/librte_eal/linux/eal/include -Ilib/librte_eal/common -I../lib/librte_eal/common -Ilib/librte_eal/common/include/arch/x86 -I../lib/librte_eal/common/include/arch/x86 -Ilib/librte_eal -I../lib/librte_eal -Ilib/librte_kvargs -I../lib/librte_kvargs -Ilib/librte_mempool -I../lib/librte_mempool -Ilib/librte_ring -I../lib/librte_ring -Ilib/librte_net -I../lib/librte_net -Ilib/librte_mbuf -I../lib/librte_mbuf -Ilib/librte_ethdev -I../lib/librte_ethdev -Ilib/librte_meter -I../lib/librte_meter -Ilib/librte_cmdline -I../lib/librte_cmdline -Ilib/librte_security -I../lib/librte_security -Ilib/librte_cryptodev -I../lib/librte_cryptodev -Ilib/librte_lpm -I../lib/librte_lpm -Ilib/librte_hash -I../lib/librte_hash -Ilib/librte_acl -I../lib/librte_acl -Ilib/librte_ip_frag -I../lib/librte_ip_frag -Ilib/librte_ipsec -I../lib/librte_ipsec -Xclang -fcolor-diagnostics -pipe -D_FILE_OFFSET_BITS=64 -Wall -Winvalid-pch -Werror -O3 -include rte_config.h -Wunused-parameter -Wsign-compare -Wcast-qual -Wno-address-of-packed-member -D_GNU_SOURCE -march=native -DALLOW_EXPERIMENTAL_API -MD -MQ 'examples/c590b3c@@dpdk-ipsec-secgw at exe/ipsec-secgw_ipsec-secgw.c.o' -MF 'examples/c590b3c@@dpdk-ipsec-secgw at exe/ipsec-secgw_ipsec-secgw.c.o.d' -o 'examples/c590b3c@@dpdk-ipsec-secgw at exe/ipsec-secgw_ipsec-secgw.c.o' -c ../examples/ipsec-secgw/ipsec-secgw.c
../examples/ipsec-secgw/ipsec-secgw.c:1356:29: error: comparison of unsigned expression < 0 is always false [-Werror,-Wtautological-compare]
                || num > INT64_MAX || num < 0)
                                      ~~~ ^ ~
1 error generated.
--
[1766/1855] Compiling C object 'examples/c590b3c@@dpdk-ipsec-secgw at exe/ipsec-secgw_rt.c.o'.
[1767/1855] Compiling C object 'examples/c590b3c@@dpdk-ipsec-secgw at exe/ipsec-secgw_sp4.c.o'.
[1768/1855] Compiling C object 'examples/c590b3c@@dpdk-ipsec-secgw at exe/ipsec-secgw_sp6.c.o'.
[1769/1855] Compiling C object 'examples/c590b3c@@dpdk-ipv4_multicast at exe/ipv4_multicast_main.c.o'.
[1770/1855] Compiling C object 'examples/c590b3c@@dpdk-ipsec-secgw at exe/ipsec-secgw_sa.c.o'.
ninja: build stopped: subcommand failed.
meson --werror -Dexamples=all -Dlibdir=lib -Dmachine=nehalem --default-library=shared /tmp/SUSE15-64_K4.12.14_GCC7.3.1/x86_64-native-linuxapp-gcc/9ccd83dbfe8e4542a5a1b9eaf21111ab/dpdk/devtools/.. build-x86-default
The Meson build system
Version: 0.50.1
Source dir: /tmp/SUSE15-64_K4.12.14_GCC7.3.1/x86_64-native-linuxapp-gcc/9ccd83dbfe8e4542a5a1b9eaf21111ab/dpdk
Build dir: /tmp/SUSE15-64_K4.12.14_GCC7.3.1/x86_64-native-linuxapp-gcc/9ccd83dbfe8e4542a5a1b9eaf21111ab/dpdk/build-x86-default


*Meson Build Failed #2:
OS: UB1604-32
Target:build-gcc-static
FAILED: examples/c590b3c@@dpdk-ipsec-secgw at exe/ipsec-secgw_ipsec-secgw.c.o 
gcc -Iexamples/c590b3c@@dpdk-ipsec-secgw at exe -Iexamples -I../examples -Iexamples/ipsec-secgw -I../examples/ipsec-secgw -I. -I../ -Iconfig -I../config -Ilib/librte_eal/common/include -I../lib/librte_eal/common/include -I../lib/librte_eal/linux/eal/include -Ilib/librte_eal/common -I../lib/librte_eal/common -Ilib/librte_eal/common/include/arch/x86 -I../lib/librte_eal/common/include/arch/x86 -Ilib/librte_eal -I../lib/librte_eal -Ilib/librte_kvargs -I../lib/librte_kvargs -Ilib/librte_mempool -I../lib/librte_mempool -Ilib/librte_ring -I../lib/librte_ring -Ilib/librte_net -I../lib/librte_net -Ilib/librte_mbuf -I../lib/librte_mbuf -Ilib/librte_ethdev -I../lib/librte_ethdev -Ilib/librte_meter -I../lib/librte_meter -Ilib/librte_cmdline -I../lib/librte_cmdline -Ilib/librte_security -I../lib/librte_security -Ilib/librte_cryptodev -I../lib/librte_cryptodev -Ilib/librte_lpm -I../lib/librte_lpm -Ilib/librte_hash -I../lib/librte_hash -Ilib/librte_acl -I../lib/librte_acl -Ilib/librte_ip_frag -I../lib/librte_ip_frag -Ilib/librte_ipsec -I../lib/librte_ipsec -fdiagnostics-color=always -pipe -D_FILE_OFFSET_BITS=64 -Wall -Winvalid-pch -Werror -O3 -include rte_config.h -Wunused-parameter -Wsign-compare -Wcast-qual -Wno-pointer-to-int-cast -D_GNU_SOURCE -march=native -DALLOW_EXPERIMENTAL_API -MD -MQ 'examples/c590b3c@@dpdk-ipsec-secgw at exe/ipsec-secgw_ipsec-secgw.c.o' -MF 'examples/c590b3c@@dpdk-ipsec-secgw at exe/ipsec-secgw_ipsec-secgw.c.o.d' -o 'examples/c590b3c@@dpdk-ipsec-secgw at exe/ipsec-secgw_ipsec-secgw.c.o' -c ../examples/ipsec-secgw/ipsec-secgw.c
../examples/ipsec-secgw/ipsec-secgw.c: In function ‘print_app_sa_prm’:
../examples/ipsec-secgw/ipsec-secgw.c:1430:9: error: format ‘%lu’ expects argument of type ‘long unsigned int’, but argument 2 has type ‘uint64_t {aka long long unsigned int}’ [-Werror=format=]
  printf("Frag TTL: %lu ns\n", frag_ttl_ns);
         ^
cc1: all warnings being treated as errors
[1571/1656] Compiling C object 'examples/c590b3c@@dpdk-ipv4_multicast at exe/ipv4_multicast_main.c.o'.
[1572/1656] Compiling C object 'examples/c590b3c@@dpdk-l3fwd at exe/l3fwd_l3fwd_em.c.o'.
[1573/1656] Compiling C object 'examples/c590b3c@@dpdk-link_status_interrupt at exe/link_status_interrupt_main.c.o'.
[1574/1656] Compiling C object 'examples/c590b3c@@dpdk-l3fwd at exe/l3fwd_l3fwd_lpm.c.o'.
[1575/1656] Compiling C object 'examples/c590b3c@@dpdk-l2fwd-jobstats at exe/l2fwd-jobstats_main.c.o'.
ninja: build stopped: subcommand failed



DPDK STV team


More information about the test-report mailing list