[dpdk-test-report] |FAILURE| pw60062[2/2] build: support building ABI versioned files twice

sys_stv at intel.com sys_stv at intel.com
Fri Sep 27 22:59:51 CEST 2019


Test-Label: Intel-compilation
Test-Status: FAILURE
http://dpdk.org/patch/60062

_Compilation issues_

Submitter: Bruce Richardson <bruce.richardson at intel.com>
Date: 2019-09-27 19:49:32
Reply_mail: 20190927194932.22197-3-bruce.richardson at intel.com
DPDK git baseline: Repo:dpdk, CommitID: bd253daa7717835f88bbc58b09a94d0060380396

Makefile build Summary: 22 Builds Done, 0 Successful, 22 Failures

Meson build Summary: 7 Builds Done, 1 Successful, 6 Failures

               +==============================================+===========+==========+
               |                   Makefile                   |   Meson   | Document |
+--------------+------+-------+------+------------+-----------+-----------+----------+
| os           | gcc  | clang | icc  | gcc+shared | gcc+debug | gcc/clang | pdf/html |
+--------------+------+-------+------+------------+-----------+-----------+----------+
| RHEL76-64    | FAIL |       |      |            |           |           |          |
| CENTOS76-64  | FAIL | FAIL  | FAIL | FAIL       | FAIL      |           |          |
| UB1804-64    | FAIL | FAIL  | FAIL |            |           | FAIL      | pass     |
| UB1604-32    | FAIL |       |      |            |           | FAIL      |          |
| UB1904-64    | FAIL |       |      |            |           |           |          |
| UB1604-64    | FAIL | FAIL  |      |            |           |           |          |
| FC30-64      | FAIL | FAIL  |      |            |           | FAIL      |          |
| WIN10-64     |      |       |      |            |           | FAIL      |          |
| FreeBSD12-64 | FAIL | FAIL  |      | FAIL       | FAIL      | FAIL      |          |
| RHEL80-64    | FAIL |       |      |            |           |           |          |
| SUSE15-64    | FAIL | FAIL  |      |            |           | FAIL      |          |
+--------------+------+-------+------+------------+-----------+-----------+----------+

Test environment and configuration as below:

** Makefile build **


OS: RHEL76-64
	Kernel Version: 3.10.0-957.el7.x86_64
	CPU info: Intel(R) Xeon(R) CPU E5-2699 v4 @ 2.20GHz
	GCC Version: gcc (GCC) 4.8.5 20150623 (Red Hat 4.8.5-36)
	Clang Version: NA
	x86_64-native-linuxapp-gcc


OS: CENTOS76-64
	Kernel Version: 3.10.0-957.10.1.el7.x86_64
	CPU info: Intel(R) Xeon(R) CPU E5-2699 v4 @ 2.20GHz
	GCC Version: gcc (GCC) 4.8.5 20150623 (Red Hat 4.8.5-36)
	Clang Version: 3.4.2 (tags/RELEASE_34/dot2-final)
	x86_64-native-linuxapp-clang
	x86_64-native-linuxapp-gcc
	x86_64-native-linuxapp-gcc+debug
	x86_64-native-linuxapp-icc
	x86_64-native-linuxapp-gcc+shared


OS: UB1804-64
	Kernel Version: 4.15.0-20-generic
	CPU info: Intel(R) Xeon(R) CPU E5-2699 v3 @ 2.30GHz
	GCC Version: gcc (Ubuntu 7.3.0-27ubuntu1~18.04) 7.3.0
	Clang Version: 6.0.0-1ubuntu2 (tags/RELEASE_600/final)
	x86_64-native-linuxapp-icc
	x86_64-native-linuxapp-clang
	x86_64-native-linuxapp-gcc


OS: UB1904-64
	Kernel Version: 5.0.0-13-generic
	CPU info: Intel(R) Xeon(R) CPU E5-2699 v3 @ 2.30GHz
	GCC Version: gcc (Ubuntu 8.3.0-6ubuntu1) 8.3.0
	Clang Version: 8.0.0-3 (tags/RELEASE_800/final)
	x86_64-native-linuxapp-gcc


OS: UB1604-32
	Kernel Version: 4.4.0-131-generic
	CPU info: Intel(R) Xeon(R) CPU E5-2699 v3 @ 2.30GHz
	GCC Version: gcc (Ubuntu 5.4.0-6ubuntu1~16.04.11) 5.4.0 20160609
	Clang Version: 3.8.0-2ubuntu4 (tags/RELEASE_380/final)
	i686-native-linuxapp-gcc


OS: UB1604-64
	Kernel Version: 4.4.0-47-generic
	CPU info: Intel(R) Xeon(R) CPU E5-2699 v3 @ 2.30GHz
	GCC Version: gcc (Ubuntu 5.4.0-6ubuntu1~16.04.10) 5.4.0 20160609
	Clang Version: 3.8.0-2ubuntu4 (tags/RELEASE_380/final)
	x86_64-native-linuxapp-clang
	x86_64-native-linuxapp-gcc


OS: FC30-64
	Kernel Version: 5.1.7-300.fc30.x86_64
	CPU info: Intel(R) Xeon(R) CPU E5-2699 v4 @ 2.20GHz
	GCC Version: gcc (GCC) 9.1.1 20190503 (Red Hat 9.1.1-1)
	Clang Version: 8.0.0 (Fedora 8.0.0-1.fc30)
	x86_64-native-linuxapp-clang
	x86_64-native-linuxapp-gcc


OS: FreeBSD12-64
	Kernel Version: 12.0-RC3
	CPU info: Intel(R) Xeon(R) CPU E5-2699 v4 @ 2.20GHz (2194.97-MHz K8-class CPU)
	GCC Version: gcc (FreeBSD Ports Collection) 7.3.0
	Clang Version: 6.0.1 (tags/RELEASE_601/final 335540) (based on LLVM 6.0.1)
	x86_64-native-bsdapp-gcc+debug
	x86_64-native-bsdapp-gcc
	x86_64-native-bsdapp-clang
	x86_64-native-bsdapp-gcc+shared


OS: RHEL80-64
	Kernel Version: 4.18.0-80.el8.x86_64
	CPU info: Intel(R) Xeon(R) CPU E5-2699 v4 @ 2.20GHz
	GCC Version: gcc (GCC) 8.2.1 20180905 (Red Hat 8.2.1-3)
	Clang Version: 6.0.1 (tags/RELEASE_601/final)
	x86_64-native-linuxapp-gcc


OS: SUSE15-64
	Kernel Version: 4.12.14-lp150.11-default
	CPU info: Intel(R) Xeon(R) CPU E5-2699 v4 @ 2.20GHz
	GCC Version: gcc (SUSE Linux) 7.3.1 20180323 [gcc-7-branch revision 258812]
	Clang Version: 5.0.1 (tags/RELEASE_501/final 312548)
	x86_64-native-linuxapp-gcc
	x86_64-native-linuxapp-clang


** Meson build **


OS: UB1804-64
	Kernel Version: 4.15.0-20-generic
	CPU info: Intel(R) Xeon(R) CPU E5-2699 v4 @ 2.20GHz
	GCC Version: gcc (Ubuntu 7.3.0-27ubuntu1~18.04) 7.3.0
	Clang Version: 6.0.0-1ubuntu2 (tags/RELEASE_600/final)
	build-gcc-static
	build-gcc-shared
	build-clang-static
	build-clang-shared
	build-x86-default
	x86_64-native-linuxapp-doc


OS: UB1604-32
	Kernel Version: 4.4.0-131-generic
	CPU info: Intel(R) Xeon(R) CPU E5-2699 v4 @ 2.20GHz
	GCC Version: gcc (Ubuntu 5.4.0-6ubuntu1~16.04.11) 5.4.0 20160609
	Clang Version: 3.8.0-2ubuntu4 (tags/RELEASE_380/final)
	build-gcc-static
	build-gcc-shared
	build-clang-static
	build-clang-shared
	build-x86-default


OS: FC30-64
	Kernel Version: 5.0.9-301.fc30.x86_64
	CPU info: Intel(R) Xeon(R) CPU E5-2699 v4 @ 2.20GHz
	GCC Version: gcc (GCC) 9.1.1 20190503 (Red Hat 9.1.1-1)
	Clang Version: 8.0.0 (Fedora 8.0.0-1.fc30)
	build-gcc-static
	build-gcc-shared
	build-clang-static
	build-clang-shared
	build-x86-default


OS: WIN10-64
	Kernel Version: N/A
	CPU info: N/A
	GCC Version: N/A
	Clang Version: Clang 8.0.0
	x86_64-windows-clang


OS: FreeBSD12-64
	Kernel Version: 12.0-RC3
	CPU info: Intel(R) Xeon(R) CPU E5-2699 v4 @ 2.20GHz (2194.99-MHz K8-class CPU)
	GCC Version: gcc (FreeBSD Ports Collection) 7.3.0
	Clang Version: 6.0.1 (tags/RELEASE_601/final 335540) (based on LLVM 6.0.1)
	build-gcc-static
	build-gcc-shared
	build-clang-static
	build-clang-shared
	build-x86-default


OS: SUSE15-64
	Kernel Version: 4.12.14-lp150.11-default
	CPU info: Intel(R) Xeon(R) CPU E5-2699 v4 @ 2.20GHz
	GCC Version: gcc (SUSE Linux) 7.3.1 20180323 [gcc-7-branch revision 258812]
	Clang Version: 5.0.1 (tags/RELEASE_501/final 312548)
	build-gcc-static
	build-gcc-shared
	build-clang-static
	build-clang-shared
	build-x86-default


*Make Build Failed #1:
OS: UB1604-64
Target: x86_64-native-linuxapp-clang
== Build lib
== Build lib/librte_kvargs
  SYMLINK-FILE include/rte_kvargs.h
  CC rte_kvargs.o
In file included from /tmp/UB1604-64_K4.4.0_Clang3.8.0/x86_64-native-linuxapp-clang/42aed033669d49198fbfec00218314b8/dpdk/lib/librte_kvargs/rte_kvargs.c:11:
/tmp/UB1604-64_K4.4.0_Clang3.8.0/x86_64-native-linuxapp-clang/42aed033669d49198fbfec00218314b8/dpdk/lib/librte_kvargs/rte_kvargs.h:28:10: fatal error: 'rte_compat.h' file not found
#include <rte_compat.h>
         ^
1 error generated.
/tmp/UB1604-64_K4.4.0_Clang3.8.0/x86_64-native-linuxapp-clang/42aed033669d49198fbfec00218314b8/dpdk/mk/internal/rte.compile-pre.mk:114: recipe for target 'rte_kvargs.o' failed
make[5]: *** [rte_kvargs.o] Error 1
/tmp/UB1604-64_K4.4.0_Clang3.8.0/x86_64-native-linuxapp-clang/42aed033669d49198fbfec00218314b8/dpdk/mk/rte.subdir.mk:35: recipe for target 'librte_kvargs' failed
make[4]: *** [librte_kvargs] Error 2
/tmp/UB1604-64_K4.4.0_Clang3.8.0/x86_64-native-linuxapp-clang/42aed033669d49198fbfec00218314b8/dpdk/mk/rte.sdkbuild.mk:46: recipe for target 'lib' failed
make[3]: *** [lib] Error 2
/tmp/UB1604-64_K4.4.0_Clang3.8.0/x86_64-native-linuxapp-clang/42aed033669d49198fbfec00218314b8/dpdk/mk/rte.sdkroot.mk:98: recipe for target 'all' failed
make[2]: *** [all] Error 2
/tmp/UB1604-64_K4.4.0_Clang3.8.0/x86_64-native-linuxapp-clang/42aed033669d49198fbfec00218314b8/dpdk/mk/rte.sdkinstall.mk:60: recipe for target 'pre_install' failed
make[1]: *** [pre_install] Error 2
/tmp/UB1604-64_K4.4.0_Clang3.8.0/x86_64-native-linuxapp-clang/42aed033669d49198fbfec00218314b8/dpdk/mk/rte.sdkroot.mk:77: recipe for target 'install' failed
make: *** [install] Error 2


*Make Build Failed #2:
OS: UB1604-32
Target: i686-native-linuxapp-gcc
== Build lib
== Build lib/librte_kvargs
  SYMLINK-FILE include/rte_kvargs.h
  CC rte_kvargs.o
In file included from /tmp/UB1604-32_K4.4.0_GCC5.4.0/i686-native-linuxapp-gcc/42aed033669d49198fbfec00218314b8/dpdk/lib/librte_kvargs/rte_kvargs.c:11:0:
/tmp/UB1604-32_K4.4.0_GCC5.4.0/i686-native-linuxapp-gcc/42aed033669d49198fbfec00218314b8/dpdk/lib/librte_kvargs/rte_kvargs.h:28:24: fatal error: rte_compat.h: No such file or directory
compilation terminated.
/tmp/UB1604-32_K4.4.0_GCC5.4.0/i686-native-linuxapp-gcc/42aed033669d49198fbfec00218314b8/dpdk/mk/internal/rte.compile-pre.mk:114: recipe for target 'rte_kvargs.o' failed
make[5]: *** [rte_kvargs.o] Error 1
/tmp/UB1604-32_K4.4.0_GCC5.4.0/i686-native-linuxapp-gcc/42aed033669d49198fbfec00218314b8/dpdk/mk/rte.subdir.mk:35: recipe for target 'librte_kvargs' failed
make[4]: *** [librte_kvargs] Error 2
/tmp/UB1604-32_K4.4.0_GCC5.4.0/i686-native-linuxapp-gcc/42aed033669d49198fbfec00218314b8/dpdk/mk/rte.sdkbuild.mk:46: recipe for target 'lib' failed
make[3]: *** [lib] Error 2
/tmp/UB1604-32_K4.4.0_GCC5.4.0/i686-native-linuxapp-gcc/42aed033669d49198fbfec00218314b8/dpdk/mk/rte.sdkroot.mk:98: recipe for target 'all' failed
make[2]: *** [all] Error 2
/tmp/UB1604-32_K4.4.0_GCC5.4.0/i686-native-linuxapp-gcc/42aed033669d49198fbfec00218314b8/dpdk/mk/rte.sdkinstall.mk:60: recipe for target 'pre_install' failed
make[1]: *** [pre_install] Error 2
/tmp/UB1604-32_K4.4.0_GCC5.4.0/i686-native-linuxapp-gcc/42aed033669d49198fbfec00218314b8/dpdk/mk/rte.sdkroot.mk:77: recipe for target 'install' failed
make: *** [install] Error 2


*Make Build Failed #3:
OS: UB1904-64
Target: x86_64-native-linuxapp-gcc
== Build lib
== Build lib/librte_kvargs
  SYMLINK-FILE include/rte_kvargs.h
  CC rte_kvargs.o
In file included from /tmp/UB1904-64_K4.18.0_GCC8.3.0/x86_64-native-linuxapp-gcc/42aed033669d49198fbfec00218314b8/dpdk/lib/librte_kvargs/rte_kvargs.c:11:
/tmp/UB1904-64_K4.18.0_GCC8.3.0/x86_64-native-linuxapp-gcc/42aed033669d49198fbfec00218314b8/dpdk/lib/librte_kvargs/rte_kvargs.h:28:10: fatal error: rte_compat.h: No such file or directory
 #include <rte_compat.h>
          ^~~~~~~~~~~~~~
compilation terminated.
make[5]: *** [/tmp/UB1904-64_K4.18.0_GCC8.3.0/x86_64-native-linuxapp-gcc/42aed033669d49198fbfec00218314b8/dpdk/mk/internal/rte.compile-pre.mk:116: rte_kvargs.o] Error 1
make[4]: *** [/tmp/UB1904-64_K4.18.0_GCC8.3.0/x86_64-native-linuxapp-gcc/42aed033669d49198fbfec00218314b8/dpdk/mk/rte.subdir.mk:37: librte_kvargs] Error 2
make[3]: *** [/tmp/UB1904-64_K4.18.0_GCC8.3.0/x86_64-native-linuxapp-gcc/42aed033669d49198fbfec00218314b8/dpdk/mk/rte.sdkbuild.mk:48: lib] Error 2
make[2]: *** [/tmp/UB1904-64_K4.18.0_GCC8.3.0/x86_64-native-linuxapp-gcc/42aed033669d49198fbfec00218314b8/dpdk/mk/rte.sdkroot.mk:99: all] Error 2
make[1]: *** [/tmp/UB1904-64_K4.18.0_GCC8.3.0/x86_64-native-linuxapp-gcc/42aed033669d49198fbfec00218314b8/dpdk/mk/rte.sdkinstall.mk:61: pre_install] Error 2
make: *** [/tmp/UB1904-64_K4.18.0_GCC8.3.0/x86_64-native-linuxapp-gcc/42aed033669d49198fbfec00218314b8/dpdk/mk/rte.sdkroot.mk:77: install] Error 2


*Make Build Failed #4:
OS: UB1804-64
Target: x86_64-native-linuxapp-icc
/tmp/UB1804-64_K4.15.0_ICC19.0.0/x86_64-native-linuxapp-icc/42aed033669d49198fbfec00218314b8/dpdk/lib/librte_kvargs/rte_kvargs.h(28): catastrophic error: cannot open source file "rte_compat.h"
  #include <rte_compat.h>
                         ^

compilation aborted for /tmp/UB1804-64_K4.15.0_ICC19.0.0/x86_64-native-linuxapp-icc/42aed033669d49198fbfec00218314b8/dpdk/lib/librte_kvargs/rte_kvargs.c (code 4)
/tmp/UB1804-64_K4.15.0_ICC19.0.0/x86_64-native-linuxapp-icc/42aed033669d49198fbfec00218314b8/dpdk/mk/internal/rte.compile-pre.mk:114: recipe for target 'rte_kvargs.o' failed
make[5]: *** [rte_kvargs.o] Error 4
/tmp/UB1804-64_K4.15.0_ICC19.0.0/x86_64-native-linuxapp-icc/42aed033669d49198fbfec00218314b8/dpdk/mk/rte.subdir.mk:35: recipe for target 'librte_kvargs' failed
make[4]: *** [librte_kvargs] Error 2
/tmp/UB1804-64_K4.15.0_ICC19.0.0/x86_64-native-linuxapp-icc/42aed033669d49198fbfec00218314b8/dpdk/mk/rte.sdkbuild.mk:46: recipe for target 'lib' failed
make[3]: *** [lib] Error 2
/tmp/UB1804-64_K4.15.0_ICC19.0.0/x86_64-native-linuxapp-icc/42aed033669d49198fbfec00218314b8/dpdk/mk/rte.sdkroot.mk:98: recipe for target 'all' failed
make[2]: *** [all] Error 2
/tmp/UB1804-64_K4.15.0_ICC19.0.0/x86_64-native-linuxapp-icc/42aed033669d49198fbfec00218314b8/dpdk/mk/rte.sdkinstall.mk:60: recipe for target 'pre_install' failed
make[1]: *** [pre_install] Error 2
/tmp/UB1804-64_K4.15.0_ICC19.0.0/x86_64-native-linuxapp-icc/42aed033669d49198fbfec00218314b8/dpdk/mk/rte.sdkroot.mk:77: recipe for target 'install' failed
make: *** [install] Error 2


*Make Build Failed #5:
OS: UB1804-64
Target: x86_64-native-linuxapp-clang
== Build lib
== Build lib/librte_kvargs
  SYMLINK-FILE include/rte_kvargs.h
  CC rte_kvargs.o
In file included from /tmp/UB1804-64_K4.15.0_Clang6.0.0/x86_64-native-linuxapp-clang/42aed033669d49198fbfec00218314b8/dpdk/lib/librte_kvargs/rte_kvargs.c:11:
/tmp/UB1804-64_K4.15.0_Clang6.0.0/x86_64-native-linuxapp-clang/42aed033669d49198fbfec00218314b8/dpdk/lib/librte_kvargs/rte_kvargs.h:28:10: fatal error: 'rte_compat.h' file not found
#include <rte_compat.h>
         ^~~~~~~~~~~~~~
1 error generated.
/tmp/UB1804-64_K4.15.0_Clang6.0.0/x86_64-native-linuxapp-clang/42aed033669d49198fbfec00218314b8/dpdk/mk/internal/rte.compile-pre.mk:114: recipe for target 'rte_kvargs.o' failed
make[5]: *** [rte_kvargs.o] Error 1
/tmp/UB1804-64_K4.15.0_Clang6.0.0/x86_64-native-linuxapp-clang/42aed033669d49198fbfec00218314b8/dpdk/mk/rte.subdir.mk:35: recipe for target 'librte_kvargs' failed
make[4]: *** [librte_kvargs] Error 2
/tmp/UB1804-64_K4.15.0_Clang6.0.0/x86_64-native-linuxapp-clang/42aed033669d49198fbfec00218314b8/dpdk/mk/rte.sdkbuild.mk:46: recipe for target 'lib' failed
make[3]: *** [lib] Error 2
/tmp/UB1804-64_K4.15.0_Clang6.0.0/x86_64-native-linuxapp-clang/42aed033669d49198fbfec00218314b8/dpdk/mk/rte.sdkroot.mk:98: recipe for target 'all' failed
make[2]: *** [all] Error 2
/tmp/UB1804-64_K4.15.0_Clang6.0.0/x86_64-native-linuxapp-clang/42aed033669d49198fbfec00218314b8/dpdk/mk/rte.sdkinstall.mk:60: recipe for target 'pre_install' failed
make[1]: *** [pre_install] Error 2
/tmp/UB1804-64_K4.15.0_Clang6.0.0/x86_64-native-linuxapp-clang/42aed033669d49198fbfec00218314b8/dpdk/mk/rte.sdkroot.mk:77: recipe for target 'install' failed
make: *** [install] Error 2


*Make Build Failed #6:
OS: FC30-64
Target: x86_64-native-linuxapp-clang
== Build lib
== Build lib/librte_kvargs
  SYMLINK-FILE include/rte_kvargs.h
  CC rte_kvargs.o
In file included from /tmp/FC30-64_K4.20_Clang8.0.0/x86_64-native-linuxapp-clang/42aed033669d49198fbfec00218314b8/dpdk/lib/librte_kvargs/rte_kvargs.c:11:
/tmp/FC30-64_K4.20_Clang8.0.0/x86_64-native-linuxapp-clang/42aed033669d49198fbfec00218314b8/dpdk/lib/librte_kvargs/rte_kvargs.h:28:10: fatal error: 'rte_compat.h' file not found
#include <rte_compat.h>
         ^~~~~~~~~~~~~~
1 error generated.
make[5]: *** [/tmp/FC30-64_K4.20_Clang8.0.0/x86_64-native-linuxapp-clang/42aed033669d49198fbfec00218314b8/dpdk/mk/internal/rte.compile-pre.mk:116: rte_kvargs.o] Error 1
make[4]: *** [/tmp/FC30-64_K4.20_Clang8.0.0/x86_64-native-linuxapp-clang/42aed033669d49198fbfec00218314b8/dpdk/mk/rte.subdir.mk:37: librte_kvargs] Error 2
make[3]: *** [/tmp/FC30-64_K4.20_Clang8.0.0/x86_64-native-linuxapp-clang/42aed033669d49198fbfec00218314b8/dpdk/mk/rte.sdkbuild.mk:48: lib] Error 2
make[2]: *** [/tmp/FC30-64_K4.20_Clang8.0.0/x86_64-native-linuxapp-clang/42aed033669d49198fbfec00218314b8/dpdk/mk/rte.sdkroot.mk:99: all] Error 2
make[1]: *** [/tmp/FC30-64_K4.20_Clang8.0.0/x86_64-native-linuxapp-clang/42aed033669d49198fbfec00218314b8/dpdk/mk/rte.sdkinstall.mk:61: pre_install] Error 2
make: *** [/tmp/FC30-64_K4.20_Clang8.0.0/x86_64-native-linuxapp-clang/42aed033669d49198fbfec00218314b8/dpdk/mk/rte.sdkroot.mk:77: install] Error 2


*Make Build Failed #7:
OS: SUSE15-64
Target: x86_64-native-linuxapp-gcc
== Build lib
== Build lib/librte_kvargs
  SYMLINK-FILE include/rte_kvargs.h
  CC rte_kvargs.o
In file included from /tmp/SUSE15-64_K4.12.14_GCC7.3.1/x86_64-native-linuxapp-gcc/42aed033669d49198fbfec00218314b8/dpdk/lib/librte_kvargs/rte_kvargs.c:11:0:
/tmp/SUSE15-64_K4.12.14_GCC7.3.1/x86_64-native-linuxapp-gcc/42aed033669d49198fbfec00218314b8/dpdk/lib/librte_kvargs/rte_kvargs.h:28:10: fatal error: rte_compat.h: No such file or directory
 #include <rte_compat.h>
          ^~~~~~~~~~~~~~
compilation terminated.
make[5]: *** [/tmp/SUSE15-64_K4.12.14_GCC7.3.1/x86_64-native-linuxapp-gcc/42aed033669d49198fbfec00218314b8/dpdk/mk/internal/rte.compile-pre.mk:116: rte_kvargs.o] Error 1
make[4]: *** [/tmp/SUSE15-64_K4.12.14_GCC7.3.1/x86_64-native-linuxapp-gcc/42aed033669d49198fbfec00218314b8/dpdk/mk/rte.subdir.mk:37: librte_kvargs] Error 2
make[3]: *** [/tmp/SUSE15-64_K4.12.14_GCC7.3.1/x86_64-native-linuxapp-gcc/42aed033669d49198fbfec00218314b8/dpdk/mk/rte.sdkbuild.mk:48: lib] Error 2
make[2]: *** [/tmp/SUSE15-64_K4.12.14_GCC7.3.1/x86_64-native-linuxapp-gcc/42aed033669d49198fbfec00218314b8/dpdk/mk/rte.sdkroot.mk:99: all] Error 2
make[1]: *** [/tmp/SUSE15-64_K4.12.14_GCC7.3.1/x86_64-native-linuxapp-gcc/42aed033669d49198fbfec00218314b8/dpdk/mk/rte.sdkinstall.mk:61: pre_install] Error 2
make: *** [/tmp/SUSE15-64_K4.12.14_GCC7.3.1/x86_64-native-linuxapp-gcc/42aed033669d49198fbfec00218314b8/dpdk/mk/rte.sdkroot.mk:77: install] Error 2


*Make Build Failed #8:
OS: FC30-64
Target: x86_64-native-linuxapp-gcc
== Build lib
== Build lib/librte_kvargs
  SYMLINK-FILE include/rte_kvargs.h
  CC rte_kvargs.o
In file included from /tmp/FC30-64_K4.20_GCC9.1.1/x86_64-native-linuxapp-gcc/42aed033669d49198fbfec00218314b8/dpdk/lib/librte_kvargs/rte_kvargs.c:11:
/tmp/FC30-64_K4.20_GCC9.1.1/x86_64-native-linuxapp-gcc/42aed033669d49198fbfec00218314b8/dpdk/lib/librte_kvargs/rte_kvargs.h:28:10: fatal error: rte_compat.h: No such file or directory
   28 | #include <rte_compat.h>
      |          ^~~~~~~~~~~~~~
compilation terminated.
make[5]: *** [/tmp/FC30-64_K4.20_GCC9.1.1/x86_64-native-linuxapp-gcc/42aed033669d49198fbfec00218314b8/dpdk/mk/internal/rte.compile-pre.mk:116: rte_kvargs.o] Error 1
make[4]: *** [/tmp/FC30-64_K4.20_GCC9.1.1/x86_64-native-linuxapp-gcc/42aed033669d49198fbfec00218314b8/dpdk/mk/rte.subdir.mk:37: librte_kvargs] Error 2
make[3]: *** [/tmp/FC30-64_K4.20_GCC9.1.1/x86_64-native-linuxapp-gcc/42aed033669d49198fbfec00218314b8/dpdk/mk/rte.sdkbuild.mk:48: lib] Error 2
make[2]: *** [/tmp/FC30-64_K4.20_GCC9.1.1/x86_64-native-linuxapp-gcc/42aed033669d49198fbfec00218314b8/dpdk/mk/rte.sdkroot.mk:99: all] Error 2
make[1]: *** [/tmp/FC30-64_K4.20_GCC9.1.1/x86_64-native-linuxapp-gcc/42aed033669d49198fbfec00218314b8/dpdk/mk/rte.sdkinstall.mk:61: pre_install] Error 2
make: *** [/tmp/FC30-64_K4.20_GCC9.1.1/x86_64-native-linuxapp-gcc/42aed033669d49198fbfec00218314b8/dpdk/mk/rte.sdkroot.mk:77: install] Error 2


*Make Build Failed #9:
OS: RHEL76-64
Target: x86_64-native-linuxapp-gcc
== Build lib
== Build lib/librte_kvargs
  SYMLINK-FILE include/rte_kvargs.h
  CC rte_kvargs.o
In file included from /tmp/RHEL76-64_K3.10.0_GCC4.8.5/x86_64-native-linuxapp-gcc/42aed033669d49198fbfec00218314b8/dpdk/lib/librte_kvargs/rte_kvargs.c:11:0:
/tmp/RHEL76-64_K3.10.0_GCC4.8.5/x86_64-native-linuxapp-gcc/42aed033669d49198fbfec00218314b8/dpdk/lib/librte_kvargs/rte_kvargs.h:28:24: fatal error: rte_compat.h: No such file or directory
 #include <rte_compat.h>
                        ^
compilation terminated.
make[5]: *** [rte_kvargs.o] Error 1
make[4]: *** [librte_kvargs] Error 2
make[3]: *** [lib] Error 2
make[2]: *** [all] Error 2
make[1]: *** [pre_install] Error 2
make: *** [install] Error 2


*Make Build Failed #10:
OS: SUSE15-64
Target: x86_64-native-linuxapp-clang
== Build lib
== Build lib/librte_kvargs
  SYMLINK-FILE include/rte_kvargs.h
  CC rte_kvargs.o
In file included from /tmp/SUSE15-64_K4.12.14_Clang5.0.1/x86_64-native-linuxapp-clang/42aed033669d49198fbfec00218314b8/dpdk/lib/librte_kvargs/rte_kvargs.c:11:
/tmp/SUSE15-64_K4.12.14_Clang5.0.1/x86_64-native-linuxapp-clang/42aed033669d49198fbfec00218314b8/dpdk/lib/librte_kvargs/rte_kvargs.h:28:10: fatal error: 'rte_compat.h' file not found
#include <rte_compat.h>
         ^~~~~~~~~~~~~~
1 error generated.
make[5]: *** [/tmp/SUSE15-64_K4.12.14_Clang5.0.1/x86_64-native-linuxapp-clang/42aed033669d49198fbfec00218314b8/dpdk/mk/internal/rte.compile-pre.mk:116: rte_kvargs.o] Error 1
make[4]: *** [/tmp/SUSE15-64_K4.12.14_Clang5.0.1/x86_64-native-linuxapp-clang/42aed033669d49198fbfec00218314b8/dpdk/mk/rte.subdir.mk:37: librte_kvargs] Error 2
make[3]: *** [/tmp/SUSE15-64_K4.12.14_Clang5.0.1/x86_64-native-linuxapp-clang/42aed033669d49198fbfec00218314b8/dpdk/mk/rte.sdkbuild.mk:48: lib] Error 2
make[2]: *** [/tmp/SUSE15-64_K4.12.14_Clang5.0.1/x86_64-native-linuxapp-clang/42aed033669d49198fbfec00218314b8/dpdk/mk/rte.sdkroot.mk:99: all] Error 2
make[1]: *** [/tmp/SUSE15-64_K4.12.14_Clang5.0.1/x86_64-native-linuxapp-clang/42aed033669d49198fbfec00218314b8/dpdk/mk/rte.sdkinstall.mk:61: pre_install] Error 2
make: *** [/tmp/SUSE15-64_K4.12.14_Clang5.0.1/x86_64-native-linuxapp-clang/42aed033669d49198fbfec00218314b8/dpdk/mk/rte.sdkroot.mk:77: install] Error 2


*Make Build Failed #11:
OS: RHEL80-64
Target: x86_64-native-linuxapp-gcc
== Build lib
== Build lib/librte_kvargs
  SYMLINK-FILE include/rte_kvargs.h
  CC rte_kvargs.o
In file included from /tmp/RHEL80-64_K3.10.0_GCC8.2.1/x86_64-native-linuxapp-gcc/42aed033669d49198fbfec00218314b8/dpdk/lib/librte_kvargs/rte_kvargs.c:11:
/tmp/RHEL80-64_K3.10.0_GCC8.2.1/x86_64-native-linuxapp-gcc/42aed033669d49198fbfec00218314b8/dpdk/lib/librte_kvargs/rte_kvargs.h:28:10: fatal error: rte_compat.h: No such file or directory
 #include <rte_compat.h>
          ^~~~~~~~~~~~~~
compilation terminated.
make[5]: *** [/tmp/RHEL80-64_K3.10.0_GCC8.2.1/x86_64-native-linuxapp-gcc/42aed033669d49198fbfec00218314b8/dpdk/mk/internal/rte.compile-pre.mk:116: rte_kvargs.o] Error 1
make[4]: *** [/tmp/RHEL80-64_K3.10.0_GCC8.2.1/x86_64-native-linuxapp-gcc/42aed033669d49198fbfec00218314b8/dpdk/mk/rte.subdir.mk:37: librte_kvargs] Error 2
make[3]: *** [/tmp/RHEL80-64_K3.10.0_GCC8.2.1/x86_64-native-linuxapp-gcc/42aed033669d49198fbfec00218314b8/dpdk/mk/rte.sdkbuild.mk:48: lib] Error 2
make[2]: *** [/tmp/RHEL80-64_K3.10.0_GCC8.2.1/x86_64-native-linuxapp-gcc/42aed033669d49198fbfec00218314b8/dpdk/mk/rte.sdkroot.mk:99: all] Error 2
make[1]: *** [/tmp/RHEL80-64_K3.10.0_GCC8.2.1/x86_64-native-linuxapp-gcc/42aed033669d49198fbfec00218314b8/dpdk/mk/rte.sdkinstall.mk:61: pre_install] Error 2
make: *** [/tmp/RHEL80-64_K3.10.0_GCC8.2.1/x86_64-native-linuxapp-gcc/42aed033669d49198fbfec00218314b8/dpdk/mk/rte.sdkroot.mk:77: install] Error 2


*Make Build Failed #12:
OS: UB1604-64
Target: x86_64-native-linuxapp-gcc
== Build lib
== Build lib/librte_kvargs
  SYMLINK-FILE include/rte_kvargs.h
  CC rte_kvargs.o
In file included from /tmp/UB1604-64_K4.4.0_GCC5.4.0/x86_64-native-linuxapp-gcc/42aed033669d49198fbfec00218314b8/dpdk/lib/librte_kvargs/rte_kvargs.c:11:0:
/tmp/UB1604-64_K4.4.0_GCC5.4.0/x86_64-native-linuxapp-gcc/42aed033669d49198fbfec00218314b8/dpdk/lib/librte_kvargs/rte_kvargs.h:28:24: fatal error: rte_compat.h: No such file or directory
compilation terminated.
/tmp/UB1604-64_K4.4.0_GCC5.4.0/x86_64-native-linuxapp-gcc/42aed033669d49198fbfec00218314b8/dpdk/mk/internal/rte.compile-pre.mk:114: recipe for target 'rte_kvargs.o' failed
make[5]: *** [rte_kvargs.o] Error 1
/tmp/UB1604-64_K4.4.0_GCC5.4.0/x86_64-native-linuxapp-gcc/42aed033669d49198fbfec00218314b8/dpdk/mk/rte.subdir.mk:35: recipe for target 'librte_kvargs' failed
make[4]: *** [librte_kvargs] Error 2
/tmp/UB1604-64_K4.4.0_GCC5.4.0/x86_64-native-linuxapp-gcc/42aed033669d49198fbfec00218314b8/dpdk/mk/rte.sdkbuild.mk:46: recipe for target 'lib' failed
make[3]: *** [lib] Error 2
/tmp/UB1604-64_K4.4.0_GCC5.4.0/x86_64-native-linuxapp-gcc/42aed033669d49198fbfec00218314b8/dpdk/mk/rte.sdkroot.mk:98: recipe for target 'all' failed
make[2]: *** [all] Error 2
/tmp/UB1604-64_K4.4.0_GCC5.4.0/x86_64-native-linuxapp-gcc/42aed033669d49198fbfec00218314b8/dpdk/mk/rte.sdkinstall.mk:60: recipe for target 'pre_install' failed
make[1]: *** [pre_install] Error 2
/tmp/UB1604-64_K4.4.0_GCC5.4.0/x86_64-native-linuxapp-gcc/42aed033669d49198fbfec00218314b8/dpdk/mk/rte.sdkroot.mk:77: recipe for target 'install' failed
make: *** [install] Error 2


*Make Build Failed #13:
OS: UB1804-64
Target: x86_64-native-linuxapp-gcc
== Build lib
== Build lib/librte_kvargs
  SYMLINK-FILE include/rte_kvargs.h
  CC rte_kvargs.o
In file included from /tmp/UB1804-64_K4.15.0_GCC7.3.0/x86_64-native-linuxapp-gcc/42aed033669d49198fbfec00218314b8/dpdk/lib/librte_kvargs/rte_kvargs.c:11:0:
/tmp/UB1804-64_K4.15.0_GCC7.3.0/x86_64-native-linuxapp-gcc/42aed033669d49198fbfec00218314b8/dpdk/lib/librte_kvargs/rte_kvargs.h:28:10: fatal error: rte_compat.h: No such file or directory
 #include <rte_compat.h>
          ^~~~~~~~~~~~~~
compilation terminated.
/tmp/UB1804-64_K4.15.0_GCC7.3.0/x86_64-native-linuxapp-gcc/42aed033669d49198fbfec00218314b8/dpdk/mk/internal/rte.compile-pre.mk:114: recipe for target 'rte_kvargs.o' failed
make[5]: *** [rte_kvargs.o] Error 1
/tmp/UB1804-64_K4.15.0_GCC7.3.0/x86_64-native-linuxapp-gcc/42aed033669d49198fbfec00218314b8/dpdk/mk/rte.subdir.mk:35: recipe for target 'librte_kvargs' failed
make[4]: *** [librte_kvargs] Error 2
/tmp/UB1804-64_K4.15.0_GCC7.3.0/x86_64-native-linuxapp-gcc/42aed033669d49198fbfec00218314b8/dpdk/mk/rte.sdkbuild.mk:46: recipe for target 'lib' failed
make[3]: *** [lib] Error 2
/tmp/UB1804-64_K4.15.0_GCC7.3.0/x86_64-native-linuxapp-gcc/42aed033669d49198fbfec00218314b8/dpdk/mk/rte.sdkroot.mk:98: recipe for target 'all' failed
make[2]: *** [all] Error 2
/tmp/UB1804-64_K4.15.0_GCC7.3.0/x86_64-native-linuxapp-gcc/42aed033669d49198fbfec00218314b8/dpdk/mk/rte.sdkinstall.mk:60: recipe for target 'pre_install' failed
make[1]: *** [pre_install] Error 2
/tmp/UB1804-64_K4.15.0_GCC7.3.0/x86_64-native-linuxapp-gcc/42aed033669d49198fbfec00218314b8/dpdk/mk/rte.sdkroot.mk:77: recipe for target 'install' failed
make: *** [install] Error 2


*Make Build Failed #14:
OS: CENTOS76-64
Target: x86_64-native-linuxapp-clang
== Build lib
== Build lib/librte_kvargs
  SYMLINK-FILE include/rte_kvargs.h
  CC rte_kvargs.o
In file included from /tmp/CENTOS76-64_K3.10.0_Clang3.4.2/x86_64-native-linuxapp-clang/42aed033669d49198fbfec00218314b8/dpdk/lib/librte_kvargs/rte_kvargs.c:11:
/tmp/CENTOS76-64_K3.10.0_Clang3.4.2/x86_64-native-linuxapp-clang/42aed033669d49198fbfec00218314b8/dpdk/lib/librte_kvargs/rte_kvargs.h:28:10: fatal error: 'rte_compat.h' file not found
#include <rte_compat.h>
         ^
1 error generated.
make[5]: *** [rte_kvargs.o] Error 1
make[4]: *** [librte_kvargs] Error 2
make[3]: *** [lib] Error 2
make[2]: *** [all] Error 2
make[1]: *** [pre_install] Error 2
make: *** [install] Error 2


*Make Build Failed #15:
OS: CENTOS76-64
Target: x86_64-native-linuxapp-gcc
== Build lib
== Build lib/librte_kvargs
  SYMLINK-FILE include/rte_kvargs.h
  CC rte_kvargs.o
In file included from /tmp/CENTOS76-64_K3.10.0_GCC4.8.5/x86_64-native-linuxapp-gcc/42aed033669d49198fbfec00218314b8/dpdk/lib/librte_kvargs/rte_kvargs.c:11:0:
/tmp/CENTOS76-64_K3.10.0_GCC4.8.5/x86_64-native-linuxapp-gcc/42aed033669d49198fbfec00218314b8/dpdk/lib/librte_kvargs/rte_kvargs.h:28:24: fatal error: rte_compat.h: No such file or directory
 #include <rte_compat.h>
                        ^
compilation terminated.
make[5]: *** [rte_kvargs.o] Error 1
make[4]: *** [librte_kvargs] Error 2
make[3]: *** [lib] Error 2
make[2]: *** [all] Error 2
make[1]: *** [pre_install] Error 2
make: *** [install] Error 2


*Make Build Failed #16:
OS: CENTOS76-64
Target: x86_64-native-linuxapp-gcc+debug
== Build lib
== Build lib/librte_kvargs
  SYMLINK-FILE include/rte_kvargs.h
  CC rte_kvargs.o
In file included from /tmp/CENTOS76-64_K3.10.0_GCC4.8.5/x86_64-native-linuxapp-gcc+debug/42aed033669d49198fbfec00218314b8/dpdk/lib/librte_kvargs/rte_kvargs.c:11:0:
/tmp/CENTOS76-64_K3.10.0_GCC4.8.5/x86_64-native-linuxapp-gcc+debug/42aed033669d49198fbfec00218314b8/dpdk/lib/librte_kvargs/rte_kvargs.h:28:24: fatal error: rte_compat.h: No such file or directory
 #include <rte_compat.h>
                        ^
compilation terminated.
make[5]: *** [rte_kvargs.o] Error 1
make[4]: *** [librte_kvargs] Error 2
make[3]: *** [lib] Error 2
make[2]: *** [all] Error 2
make[1]: *** [pre_install] Error 2
make: *** [install] Error 2


*Make Build Failed #17:
OS: CENTOS76-64
Target: x86_64-native-linuxapp-icc
/tmp/CENTOS76-64_K3.10.0_ICC19.0.0/x86_64-native-linuxapp-icc/42aed033669d49198fbfec00218314b8/dpdk/lib/librte_kvargs/rte_kvargs.h(28): catastrophic error: cannot open source file "rte_compat.h"
  #include <rte_compat.h>
                         ^

compilation aborted for /tmp/CENTOS76-64_K3.10.0_ICC19.0.0/x86_64-native-linuxapp-icc/42aed033669d49198fbfec00218314b8/dpdk/lib/librte_kvargs/rte_kvargs.c (code 4)
make[5]: *** [rte_kvargs.o] Error 4
make[4]: *** [librte_kvargs] Error 2
make[3]: *** [lib] Error 2
make[2]: *** [all] Error 2
make[1]: *** [pre_install] Error 2
make: *** [install] Error 2


*Make Build Failed #18:
OS: CENTOS76-64
Target: x86_64-native-linuxapp-gcc+shared
== Build lib
== Build lib/librte_kvargs
  SYMLINK-FILE include/rte_kvargs.h
  CC rte_kvargs.o
In file included from /tmp/CENTOS76-64_K3.10.0_GCC4.8.5/x86_64-native-linuxapp-gcc+shared/42aed033669d49198fbfec00218314b8/dpdk/lib/librte_kvargs/rte_kvargs.c:11:0:
/tmp/CENTOS76-64_K3.10.0_GCC4.8.5/x86_64-native-linuxapp-gcc+shared/42aed033669d49198fbfec00218314b8/dpdk/lib/librte_kvargs/rte_kvargs.h:28:24: fatal error: rte_compat.h: No such file or directory
 #include <rte_compat.h>
                        ^
compilation terminated.
make[5]: *** [rte_kvargs.o] Error 1
make[4]: *** [librte_kvargs] Error 2
make[3]: *** [lib] Error 2
make[2]: *** [all] Error 2
make[1]: *** [pre_install] Error 2
make: *** [install] Error 2


*Make Build Failed #19:
OS: FreeBSD12-64
Target: x86_64-native-bsdapp-gcc+debug
== Build lib
== Build lib/librte_kvargs
  SYMLINK-FILE include/rte_kvargs.h
  CC rte_kvargs.o
In file included from /tmp/FreeBSD12-64_K19.02_GCC7.3.0/x86_64-native-bsdapp-gcc+debug/42aed033669d49198fbfec00218314b8/dpdk/lib/librte_kvargs/rte_kvargs.c:11:0:
/tmp/FreeBSD12-64_K19.02_GCC7.3.0/x86_64-native-bsdapp-gcc+debug/42aed033669d49198fbfec00218314b8/dpdk/lib/librte_kvargs/rte_kvargs.h:28:10: fatal error: rte_compat.h: No such file or directory
 #include <rte_compat.h>
          ^~~~~~~~~~~~~~
compilation terminated.
gmake[5]: *** [/tmp/FreeBSD12-64_K19.02_GCC7.3.0/x86_64-native-bsdapp-gcc+debug/42aed033669d49198fbfec00218314b8/dpdk/mk/internal/rte.compile-pre.mk:116: rte_kvargs.o] Error 1
gmake[4]: *** [/tmp/FreeBSD12-64_K19.02_GCC7.3.0/x86_64-native-bsdapp-gcc+debug/42aed033669d49198fbfec00218314b8/dpdk/mk/rte.subdir.mk:37: librte_kvargs] Error 2
gmake[3]: *** [/tmp/FreeBSD12-64_K19.02_GCC7.3.0/x86_64-native-bsdapp-gcc+debug/42aed033669d49198fbfec00218314b8/dpdk/mk/rte.sdkbuild.mk:48: lib] Error 2
gmake[2]: *** [/tmp/FreeBSD12-64_K19.02_GCC7.3.0/x86_64-native-bsdapp-gcc+debug/42aed033669d49198fbfec00218314b8/dpdk/mk/rte.sdkroot.mk:99: all] Error 2
gmake[1]: *** [/tmp/FreeBSD12-64_K19.02_GCC7.3.0/x86_64-native-bsdapp-gcc+debug/42aed033669d49198fbfec00218314b8/dpdk/mk/rte.sdkinstall.mk:61: pre_install] Error 2
gmake: *** [/tmp/FreeBSD12-64_K19.02_GCC7.3.0/x86_64-native-bsdapp-gcc+debug/42aed033669d49198fbfec00218314b8/dpdk/mk/rte.sdkroot.mk:77: install] Error 2


*Make Build Failed #20:
OS: FreeBSD12-64
Target: x86_64-native-bsdapp-gcc
== Build lib
== Build lib/librte_kvargs
  SYMLINK-FILE include/rte_kvargs.h
  CC rte_kvargs.o
In file included from /tmp/FreeBSD12-64_K19.02_GCC7.3.0/x86_64-native-bsdapp-gcc/42aed033669d49198fbfec00218314b8/dpdk/lib/librte_kvargs/rte_kvargs.c:11:0:
/tmp/FreeBSD12-64_K19.02_GCC7.3.0/x86_64-native-bsdapp-gcc/42aed033669d49198fbfec00218314b8/dpdk/lib/librte_kvargs/rte_kvargs.h:28:10: fatal error: rte_compat.h: No such file or directory
 #include <rte_compat.h>
          ^~~~~~~~~~~~~~
compilation terminated.
gmake[5]: *** [/tmp/FreeBSD12-64_K19.02_GCC7.3.0/x86_64-native-bsdapp-gcc/42aed033669d49198fbfec00218314b8/dpdk/mk/internal/rte.compile-pre.mk:116: rte_kvargs.o] Error 1
gmake[4]: *** [/tmp/FreeBSD12-64_K19.02_GCC7.3.0/x86_64-native-bsdapp-gcc/42aed033669d49198fbfec00218314b8/dpdk/mk/rte.subdir.mk:37: librte_kvargs] Error 2
gmake[3]: *** [/tmp/FreeBSD12-64_K19.02_GCC7.3.0/x86_64-native-bsdapp-gcc/42aed033669d49198fbfec00218314b8/dpdk/mk/rte.sdkbuild.mk:48: lib] Error 2
gmake[2]: *** [/tmp/FreeBSD12-64_K19.02_GCC7.3.0/x86_64-native-bsdapp-gcc/42aed033669d49198fbfec00218314b8/dpdk/mk/rte.sdkroot.mk:99: all] Error 2
gmake[1]: *** [/tmp/FreeBSD12-64_K19.02_GCC7.3.0/x86_64-native-bsdapp-gcc/42aed033669d49198fbfec00218314b8/dpdk/mk/rte.sdkinstall.mk:61: pre_install] Error 2
gmake: *** [/tmp/FreeBSD12-64_K19.02_GCC7.3.0/x86_64-native-bsdapp-gcc/42aed033669d49198fbfec00218314b8/dpdk/mk/rte.sdkroot.mk:77: install] Error 2


*Make Build Failed #21:
OS: FreeBSD12-64
Target: x86_64-native-bsdapp-clang
== Build lib
== Build lib/librte_kvargs
  SYMLINK-FILE include/rte_kvargs.h
  CC rte_kvargs.o
In file included from /tmp/FreeBSD12-64_K19.02_Clang6.0.1/x86_64-native-bsdapp-clang/42aed033669d49198fbfec00218314b8/dpdk/lib/librte_kvargs/rte_kvargs.c:11:
/tmp/FreeBSD12-64_K19.02_Clang6.0.1/x86_64-native-bsdapp-clang/42aed033669d49198fbfec00218314b8/dpdk/lib/librte_kvargs/rte_kvargs.h:28:10: fatal error: 'rte_compat.h' file not found
#include <rte_compat.h>
         ^~~~~~~~~~~~~~
1 error generated.
gmake[5]: *** [/tmp/FreeBSD12-64_K19.02_Clang6.0.1/x86_64-native-bsdapp-clang/42aed033669d49198fbfec00218314b8/dpdk/mk/internal/rte.compile-pre.mk:116: rte_kvargs.o] Error 1
gmake[4]: *** [/tmp/FreeBSD12-64_K19.02_Clang6.0.1/x86_64-native-bsdapp-clang/42aed033669d49198fbfec00218314b8/dpdk/mk/rte.subdir.mk:37: librte_kvargs] Error 2
gmake[3]: *** [/tmp/FreeBSD12-64_K19.02_Clang6.0.1/x86_64-native-bsdapp-clang/42aed033669d49198fbfec00218314b8/dpdk/mk/rte.sdkbuild.mk:48: lib] Error 2
gmake[2]: *** [/tmp/FreeBSD12-64_K19.02_Clang6.0.1/x86_64-native-bsdapp-clang/42aed033669d49198fbfec00218314b8/dpdk/mk/rte.sdkroot.mk:99: all] Error 2
gmake[1]: *** [/tmp/FreeBSD12-64_K19.02_Clang6.0.1/x86_64-native-bsdapp-clang/42aed033669d49198fbfec00218314b8/dpdk/mk/rte.sdkinstall.mk:61: pre_install] Error 2
gmake: *** [/tmp/FreeBSD12-64_K19.02_Clang6.0.1/x86_64-native-bsdapp-clang/42aed033669d49198fbfec00218314b8/dpdk/mk/rte.sdkroot.mk:77: install] Error 2


*Make Build Failed #22:
OS: FreeBSD12-64
Target: x86_64-native-bsdapp-gcc+shared
== Build lib
== Build lib/librte_kvargs
  SYMLINK-FILE include/rte_kvargs.h
  CC rte_kvargs.o
In file included from /tmp/FreeBSD12-64_K19.02_GCC7.3.0/x86_64-native-bsdapp-gcc+shared/42aed033669d49198fbfec00218314b8/dpdk/lib/librte_kvargs/rte_kvargs.c:11:0:
/tmp/FreeBSD12-64_K19.02_GCC7.3.0/x86_64-native-bsdapp-gcc+shared/42aed033669d49198fbfec00218314b8/dpdk/lib/librte_kvargs/rte_kvargs.h:28:10: fatal error: rte_compat.h: No such file or directory
 #include <rte_compat.h>
          ^~~~~~~~~~~~~~
compilation terminated.
gmake[5]: *** [/tmp/FreeBSD12-64_K19.02_GCC7.3.0/x86_64-native-bsdapp-gcc+shared/42aed033669d49198fbfec00218314b8/dpdk/mk/internal/rte.compile-pre.mk:116: rte_kvargs.o] Error 1
gmake[4]: *** [/tmp/FreeBSD12-64_K19.02_GCC7.3.0/x86_64-native-bsdapp-gcc+shared/42aed033669d49198fbfec00218314b8/dpdk/mk/rte.subdir.mk:37: librte_kvargs] Error 2
gmake[3]: *** [/tmp/FreeBSD12-64_K19.02_GCC7.3.0/x86_64-native-bsdapp-gcc+shared/42aed033669d49198fbfec00218314b8/dpdk/mk/rte.sdkbuild.mk:48: lib] Error 2
gmake[2]: *** [/tmp/FreeBSD12-64_K19.02_GCC7.3.0/x86_64-native-bsdapp-gcc+shared/42aed033669d49198fbfec00218314b8/dpdk/mk/rte.sdkroot.mk:99: all] Error 2
gmake[1]: *** [/tmp/FreeBSD12-64_K19.02_GCC7.3.0/x86_64-native-bsdapp-gcc+shared/42aed033669d49198fbfec00218314b8/dpdk/mk/rte.sdkinstall.mk:61: pre_install] Error 2
gmake: *** [/tmp/FreeBSD12-64_K19.02_GCC7.3.0/x86_64-native-bsdapp-gcc+shared/42aed033669d49198fbfec00218314b8/dpdk/mk/rte.sdkroot.mk:77: install] Error 2

*Meson Build Failed #1:
OS: WIN10-64
Target: x86_64-windows-clang
Fetching value of define "__RDSEED__" : 1
Program gen-pmdinfo-cfile.sh found: YES (sh C:\windows-dpdk\dpdk\buildtools\gen-pmdinfo-cfile.sh)
Using meson's python ['c:\\program files\\python37\\python.exe']
Compiler for C supports arguments -Wno-format-truncation: NO

lib\librte_eal\common\meson.build:51:0: ERROR: File include/rte_compat.h does not exist.

A full log can be found at C:\windows-dpdk\dpdk\build\meson-logs\meson-log.txt
ninja: Entering directory `build'
end_time=Fri 09/27/2019 13:54:48.24 
status=0 


*Meson Build Failed #2:
OS: FC30-64
Target:build-gcc-static
Fetching value of define "__RDSEED__" : 1
Program gen-pmdinfo-cfile.sh found: YES (/tmp/FC30-64_K4.20_GCC9.1.1/x86_64-native-linuxapp-gcc/42aed033669d49198fbfec00218314b8/dpdk/buildtools/gen-pmdinfo-cfile.sh)
Using meson's python ['/usr/bin/python3']
Compiler for C supports arguments -Wno-format-truncation -Wformat-truncation: YES

lib/librte_eal/common/meson.build:51:0: ERROR: File include/rte_compat.h does not exist.

A full log can be found at /tmp/FC30-64_K4.20_GCC9.1.1/x86_64-native-linuxapp-gcc/42aed033669d49198fbfec00218314b8/dpdk/build-gcc-static/meson-logs/meson-log.txt
ninja -C build-gcc-static
ninja: Entering directory `build-gcc-static'
ninja: error: loading 'build.ninja': No such file or directory
--
Fetching value of define "__RDSEED__" : 1
Program gen-pmdinfo-cfile.sh found: YES (/tmp/FC30-64_K4.20_GCC9.1.1/x86_64-native-linuxapp-gcc/42aed033669d49198fbfec00218314b8/dpdk/buildtools/gen-pmdinfo-cfile.sh)
Using meson's python ['/usr/bin/python3']
Compiler for C supports arguments -Wno-format-truncation -Wformat-truncation: YES

lib/librte_eal/common/meson.build:51:0: ERROR: File include/rte_compat.h does not exist.

A full log can be found at /tmp/FC30-64_K4.20_GCC9.1.1/x86_64-native-linuxapp-gcc/42aed033669d49198fbfec00218314b8/dpdk/build-gcc-shared/meson-logs/meson-log.txt
ninja -C build-gcc-shared
ninja: Entering directory `build-gcc-shared'
ninja: error: loading 'build.ninja': No such file or directory
--
Fetching value of define "__RDSEED__" : 1
Program gen-pmdinfo-cfile.sh found: YES (/tmp/FC30-64_K4.20_GCC9.1.1/x86_64-native-linuxapp-gcc/42aed033669d49198fbfec00218314b8/dpdk/buildtools/gen-pmdinfo-cfile.sh)
Using meson's python ['/usr/bin/python3']
Compiler for C supports arguments -Wno-format-truncation: NO

lib/librte_eal/common/meson.build:51:0: ERROR: File include/rte_compat.h does not exist.

A full log can be found at /tmp/FC30-64_K4.20_GCC9.1.1/x86_64-native-linuxapp-gcc/42aed033669d49198fbfec00218314b8/dpdk/build-clang-static/meson-logs/meson-log.txt
ninja -C build-clang-static
ninja: Entering directory `build-clang-static'
ninja: error: loading 'build.ninja': No such file or directory
--
Fetching value of define "__RDSEED__" : 1
Program gen-pmdinfo-cfile.sh found: YES (/tmp/FC30-64_K4.20_GCC9.1.1/x86_64-native-linuxapp-gcc/42aed033669d49198fbfec00218314b8/dpdk/buildtools/gen-pmdinfo-cfile.sh)
Using meson's python ['/usr/bin/python3']
Compiler for C supports arguments -Wno-format-truncation: NO

lib/librte_eal/common/meson.build:51:0: ERROR: File include/rte_compat.h does not exist.

A full log can be found at /tmp/FC30-64_K4.20_GCC9.1.1/x86_64-native-linuxapp-gcc/42aed033669d49198fbfec00218314b8/dpdk/build-clang-shared/meson-logs/meson-log.txt
ninja -C build-clang-shared
ninja: Entering directory `build-clang-shared'
ninja: error: loading 'build.ninja': No such file or directory
--
Fetching value of define "__RDSEED__" : 
Program gen-pmdinfo-cfile.sh found: YES (/tmp/FC30-64_K4.20_GCC9.1.1/x86_64-native-linuxapp-gcc/42aed033669d49198fbfec00218314b8/dpdk/buildtools/gen-pmdinfo-cfile.sh)
Using meson's python ['/usr/bin/python3']
Compiler for C supports arguments -Wno-format-truncation -Wformat-truncation: YES

lib/librte_eal/common/meson.build:51:0: ERROR: File include/rte_compat.h does not exist.

A full log can be found at /tmp/FC30-64_K4.20_GCC9.1.1/x86_64-native-linuxapp-gcc/42aed033669d49198fbfec00218314b8/dpdk/build-x86-default/meson-logs/meson-log.txt
ninja -C build-x86-default
ninja: Entering directory `build-x86-default'
ninja: error: loading 'build.ninja': No such file or directory
--
ninja: error: loading 'build.ninja': No such file or directory
find: ‘/tmp/FC30-64_K4.20_GCC9.1.1/x86_64-native-linuxapp-gcc/42aed033669d49198fbfec00218314b8/dpdk/build-x86-default/install-root’: No such file or directory
dirname: missing operand
Try 'dirname --help' for more information.
## Building cmdline
gmake: *** /tmp/FC30-64_K4.20_GCC9.1.1/x86_64-native-linuxapp-gcc/42aed033669d49198fbfec00218314b8/dpdk/build-x86-default/install-root/usr/local/share/dpdk/examples/cmdline: No such file or directory.  Stop.
## Building helloworld
gmake: *** /tmp/FC30-64_K4.20_GCC9.1.1/x86_64-native-linuxapp-gcc/42aed033669d49198fbfec00218314b8/dpdk/build-x86-default/install-root/usr/local/share/dpdk/examples/helloworld: No such file or directory.  Stop.
## Building l2fwd
gmake: *** /tmp/FC30-64_K4.20_GCC9.1.1/x86_64-native-linuxapp-gcc/42aed033669d49198fbfec00218314b8/dpdk/build-x86-default/install-root/usr/local/share/dpdk/examples/l2fwd: No such file or directory.  Stop.
## Building l3fwd
gmake: *** /tmp/FC30-64_K4.20_GCC9.1.1/x86_64-native-linuxapp-gcc/42aed033669d49198fbfec00218314b8/dpdk/build-x86-default/install-root/usr/local/share/dpdk/examples/l3fwd: No such file or directory.  Stop.
## Building skeleton
gmake: *** /tmp/FC30-64_K4.20_GCC9.1.1/x86_64-native-linuxapp-gcc/42aed033669d49198fbfec00218314b8/dpdk/build-x86-default/install-root/usr/local/share/dpdk/examples/skeleton: No such file or directory.  Stop.
## Building timer
gmake: *** /tmp/FC30-64_K4.20_GCC9.1.1/x86_64-native-linuxapp-gcc/42aed033669d49198fbfec00218314b8/dpdk/build-x86-default/install-root/usr/local/share/dpdk/examples/timer: No such file or directory.  Stop.


*Meson Build Failed #3:
OS: UB1604-32
Target:build-gcc-static
Fetching value of define "__RDSEED__" : 1
Program gen-pmdinfo-cfile.sh found: YES (/tmp/UB1604-32_K4.4.0_GCC5.4.0/i686-native-linuxapp-gcc/42aed033669d49198fbfec00218314b8/dpdk/buildtools/gen-pmdinfo-cfile.sh)
Using meson's python ['/usr/bin/python3']
Compiler for C supports arguments -Wno-format-truncation -Wformat-truncation: NO

lib/librte_eal/common/meson.build:51:0: ERROR: File include/rte_compat.h does not exist.

A full log can be found at /tmp/UB1604-32_K4.4.0_GCC5.4.0/i686-native-linuxapp-gcc/42aed033669d49198fbfec00218314b8/dpdk/build-gcc-static/meson-logs/meson-log.txt
ninja -C build-gcc-static
ninja: Entering directory `build-gcc-static'
ninja: error: loading 'build.ninja': No such file or directory
--
Fetching value of define "__RDSEED__" : 1
Program gen-pmdinfo-cfile.sh found: YES (/tmp/UB1604-32_K4.4.0_GCC5.4.0/i686-native-linuxapp-gcc/42aed033669d49198fbfec00218314b8/dpdk/buildtools/gen-pmdinfo-cfile.sh)
Using meson's python ['/usr/bin/python3']
Compiler for C supports arguments -Wno-format-truncation -Wformat-truncation: NO

lib/librte_eal/common/meson.build:51:0: ERROR: File include/rte_compat.h does not exist.

A full log can be found at /tmp/UB1604-32_K4.4.0_GCC5.4.0/i686-native-linuxapp-gcc/42aed033669d49198fbfec00218314b8/dpdk/build-gcc-shared/meson-logs/meson-log.txt
ninja -C build-gcc-shared
ninja: Entering directory `build-gcc-shared'
ninja: error: loading 'build.ninja': No such file or directory
--
Fetching value of define "__RDSEED__" : 1
Program gen-pmdinfo-cfile.sh found: YES (/tmp/UB1604-32_K4.4.0_GCC5.4.0/i686-native-linuxapp-gcc/42aed033669d49198fbfec00218314b8/dpdk/buildtools/gen-pmdinfo-cfile.sh)
Using meson's python ['/usr/bin/python3']
Compiler for C supports arguments -Wno-format-truncation: NO

lib/librte_eal/common/meson.build:51:0: ERROR: File include/rte_compat.h does not exist.

A full log can be found at /tmp/UB1604-32_K4.4.0_GCC5.4.0/i686-native-linuxapp-gcc/42aed033669d49198fbfec00218314b8/dpdk/build-clang-static/meson-logs/meson-log.txt
ninja -C build-clang-static
ninja: Entering directory `build-clang-static'
ninja: error: loading 'build.ninja': No such file or directory
--
Fetching value of define "__RDSEED__" : 1
Program gen-pmdinfo-cfile.sh found: YES (/tmp/UB1604-32_K4.4.0_GCC5.4.0/i686-native-linuxapp-gcc/42aed033669d49198fbfec00218314b8/dpdk/buildtools/gen-pmdinfo-cfile.sh)
Using meson's python ['/usr/bin/python3']
Compiler for C supports arguments -Wno-format-truncation: NO

lib/librte_eal/common/meson.build:51:0: ERROR: File include/rte_compat.h does not exist.

A full log can be found at /tmp/UB1604-32_K4.4.0_GCC5.4.0/i686-native-linuxapp-gcc/42aed033669d49198fbfec00218314b8/dpdk/build-clang-shared/meson-logs/meson-log.txt
ninja -C build-clang-shared
ninja: Entering directory `build-clang-shared'
ninja: error: loading 'build.ninja': No such file or directory
--
Fetching value of define "__RDSEED__" : 
Program gen-pmdinfo-cfile.sh found: YES (/tmp/UB1604-32_K4.4.0_GCC5.4.0/i686-native-linuxapp-gcc/42aed033669d49198fbfec00218314b8/dpdk/buildtools/gen-pmdinfo-cfile.sh)
Using meson's python ['/usr/bin/python3']
Compiler for C supports arguments -Wno-format-truncation -Wformat-truncation: NO

lib/librte_eal/common/meson.build:51:0: ERROR: File include/rte_compat.h does not exist.

A full log can be found at /tmp/UB1604-32_K4.4.0_GCC5.4.0/i686-native-linuxapp-gcc/42aed033669d49198fbfec00218314b8/dpdk/build-x86-default/meson-logs/meson-log.txt
ninja -C build-x86-default
ninja: Entering directory `build-x86-default'
ninja: error: loading 'build.ninja': No such file or directory
--
ninja: error: loading 'build.ninja': No such file or directory
find: ‘/tmp/UB1604-32_K4.4.0_GCC5.4.0/i686-native-linuxapp-gcc/42aed033669d49198fbfec00218314b8/dpdk/build-x86-default/install-root’: No such file or directory
dirname: missing operand
Try 'dirname --help' for more information.
## Building cmdline
make: *** /tmp/UB1604-32_K4.4.0_GCC5.4.0/i686-native-linuxapp-gcc/42aed033669d49198fbfec00218314b8/dpdk/build-x86-default/install-root/usr/local/share/dpdk/examples/cmdline: No such file or directory.  Stop.
## Building helloworld
make: *** /tmp/UB1604-32_K4.4.0_GCC5.4.0/i686-native-linuxapp-gcc/42aed033669d49198fbfec00218314b8/dpdk/build-x86-default/install-root/usr/local/share/dpdk/examples/helloworld: No such file or directory.  Stop.
## Building l2fwd
make: *** /tmp/UB1604-32_K4.4.0_GCC5.4.0/i686-native-linuxapp-gcc/42aed033669d49198fbfec00218314b8/dpdk/build-x86-default/install-root/usr/local/share/dpdk/examples/l2fwd: No such file or directory.  Stop.
## Building l3fwd
make: *** /tmp/UB1604-32_K4.4.0_GCC5.4.0/i686-native-linuxapp-gcc/42aed033669d49198fbfec00218314b8/dpdk/build-x86-default/install-root/usr/local/share/dpdk/examples/l3fwd: No such file or directory.  Stop.
## Building skeleton
make: *** /tmp/UB1604-32_K4.4.0_GCC5.4.0/i686-native-linuxapp-gcc/42aed033669d49198fbfec00218314b8/dpdk/build-x86-default/install-root/usr/local/share/dpdk/examples/skeleton: No such file or directory.  Stop.
## Building timer
make: *** /tmp/UB1604-32_K4.4.0_GCC5.4.0/i686-native-linuxapp-gcc/42aed033669d49198fbfec00218314b8/dpdk/build-x86-default/install-root/usr/local/share/dpdk/examples/timer: No such file or directory.  Stop.


*Meson Build Failed #4:
OS: SUSE15-64
Target:build-gcc-static
Fetching value of define "__RDSEED__" : 1
Program gen-pmdinfo-cfile.sh found: YES (/tmp/SUSE15-64_K4.12.14_GCC7.3.1/x86_64-native-linuxapp-gcc/42aed033669d49198fbfec00218314b8/dpdk/buildtools/gen-pmdinfo-cfile.sh)
Using meson's python ['/usr/bin/python3']
Compiler for C supports arguments -Wno-format-truncation -Wformat-truncation: YES

lib/librte_eal/common/meson.build:51:0: ERROR: File include/rte_compat.h does not exist.

A full log can be found at /tmp/SUSE15-64_K4.12.14_GCC7.3.1/x86_64-native-linuxapp-gcc/42aed033669d49198fbfec00218314b8/dpdk/build-gcc-static/meson-logs/meson-log.txt
ninja -C build-gcc-static
ninja: Entering directory `build-gcc-static'
ninja: error: loading 'build.ninja': No such file or directory
--
Fetching value of define "__RDSEED__" : 1
Program gen-pmdinfo-cfile.sh found: YES (/tmp/SUSE15-64_K4.12.14_GCC7.3.1/x86_64-native-linuxapp-gcc/42aed033669d49198fbfec00218314b8/dpdk/buildtools/gen-pmdinfo-cfile.sh)
Using meson's python ['/usr/bin/python3']
Compiler for C supports arguments -Wno-format-truncation -Wformat-truncation: YES

lib/librte_eal/common/meson.build:51:0: ERROR: File include/rte_compat.h does not exist.

A full log can be found at /tmp/SUSE15-64_K4.12.14_GCC7.3.1/x86_64-native-linuxapp-gcc/42aed033669d49198fbfec00218314b8/dpdk/build-gcc-shared/meson-logs/meson-log.txt
ninja -C build-gcc-shared
ninja: Entering directory `build-gcc-shared'
ninja: error: loading 'build.ninja': No such file or directory
--
Fetching value of define "__RDSEED__" : 1
Program gen-pmdinfo-cfile.sh found: YES (/tmp/SUSE15-64_K4.12.14_GCC7.3.1/x86_64-native-linuxapp-gcc/42aed033669d49198fbfec00218314b8/dpdk/buildtools/gen-pmdinfo-cfile.sh)
Using meson's python ['/usr/bin/python3']
Compiler for C supports arguments -Wno-format-truncation: NO

lib/librte_eal/common/meson.build:51:0: ERROR: File include/rte_compat.h does not exist.

A full log can be found at /tmp/SUSE15-64_K4.12.14_GCC7.3.1/x86_64-native-linuxapp-gcc/42aed033669d49198fbfec00218314b8/dpdk/build-clang-static/meson-logs/meson-log.txt
ninja -C build-clang-static
ninja: Entering directory `build-clang-static'
ninja: error: loading 'build.ninja': No such file or directory
--
Fetching value of define "__RDSEED__" : 1
Program gen-pmdinfo-cfile.sh found: YES (/tmp/SUSE15-64_K4.12.14_GCC7.3.1/x86_64-native-linuxapp-gcc/42aed033669d49198fbfec00218314b8/dpdk/buildtools/gen-pmdinfo-cfile.sh)
Using meson's python ['/usr/bin/python3']
Compiler for C supports arguments -Wno-format-truncation: NO

lib/librte_eal/common/meson.build:51:0: ERROR: File include/rte_compat.h does not exist.

A full log can be found at /tmp/SUSE15-64_K4.12.14_GCC7.3.1/x86_64-native-linuxapp-gcc/42aed033669d49198fbfec00218314b8/dpdk/build-clang-shared/meson-logs/meson-log.txt
ninja -C build-clang-shared
ninja: Entering directory `build-clang-shared'
ninja: error: loading 'build.ninja': No such file or directory
--
Fetching value of define "__RDSEED__" : 
Program gen-pmdinfo-cfile.sh found: YES (/tmp/SUSE15-64_K4.12.14_GCC7.3.1/x86_64-native-linuxapp-gcc/42aed033669d49198fbfec00218314b8/dpdk/buildtools/gen-pmdinfo-cfile.sh)
Using meson's python ['/usr/bin/python3']
Compiler for C supports arguments -Wno-format-truncation -Wformat-truncation: YES

lib/librte_eal/common/meson.build:51:0: ERROR: File include/rte_compat.h does not exist.

A full log can be found at /tmp/SUSE15-64_K4.12.14_GCC7.3.1/x86_64-native-linuxapp-gcc/42aed033669d49198fbfec00218314b8/dpdk/build-x86-default/meson-logs/meson-log.txt
ninja -C build-x86-default
ninja: Entering directory `build-x86-default'
ninja: error: loading 'build.ninja': No such file or directory
--
ninja: error: loading 'build.ninja': No such file or directory
find: ‘/tmp/SUSE15-64_K4.12.14_GCC7.3.1/x86_64-native-linuxapp-gcc/42aed033669d49198fbfec00218314b8/dpdk/build-x86-default/install-root’: No such file or directory
dirname: missing operand
Try 'dirname --help' for more information.
## Building cmdline
gmake: *** /tmp/SUSE15-64_K4.12.14_GCC7.3.1/x86_64-native-linuxapp-gcc/42aed033669d49198fbfec00218314b8/dpdk/build-x86-default/install-root/usr/local/share/dpdk/examples/cmdline: No such file or directory.  Stop.
## Building helloworld
gmake: *** /tmp/SUSE15-64_K4.12.14_GCC7.3.1/x86_64-native-linuxapp-gcc/42aed033669d49198fbfec00218314b8/dpdk/build-x86-default/install-root/usr/local/share/dpdk/examples/helloworld: No such file or directory.  Stop.
## Building l2fwd
gmake: *** /tmp/SUSE15-64_K4.12.14_GCC7.3.1/x86_64-native-linuxapp-gcc/42aed033669d49198fbfec00218314b8/dpdk/build-x86-default/install-root/usr/local/share/dpdk/examples/l2fwd: No such file or directory.  Stop.
## Building l3fwd
gmake: *** /tmp/SUSE15-64_K4.12.14_GCC7.3.1/x86_64-native-linuxapp-gcc/42aed033669d49198fbfec00218314b8/dpdk/build-x86-default/install-root/usr/local/share/dpdk/examples/l3fwd: No such file or directory.  Stop.
## Building skeleton
gmake: *** /tmp/SUSE15-64_K4.12.14_GCC7.3.1/x86_64-native-linuxapp-gcc/42aed033669d49198fbfec00218314b8/dpdk/build-x86-default/install-root/usr/local/share/dpdk/examples/skeleton: No such file or directory.  Stop.
## Building timer
gmake: *** /tmp/SUSE15-64_K4.12.14_GCC7.3.1/x86_64-native-linuxapp-gcc/42aed033669d49198fbfec00218314b8/dpdk/build-x86-default/install-root/usr/local/share/dpdk/examples/timer: No such file or directory.  Stop.


*Meson Build Failed #5:
OS: UB1804-64
Target:build-gcc-static
Fetching value of define "__RDSEED__" : 1
Program gen-pmdinfo-cfile.sh found: YES (/tmp/UB1804-64_K4.15.0_GCC7.3.0/x86_64-native-linuxapp-gcc/42aed033669d49198fbfec00218314b8/dpdk/buildtools/gen-pmdinfo-cfile.sh)
Using meson's python ['/usr/bin/python3']
Compiler for C supports arguments -Wno-format-truncation -Wformat-truncation: YES

lib/librte_eal/common/meson.build:51:0: ERROR: File include/rte_compat.h does not exist.

A full log can be found at /tmp/UB1804-64_K4.15.0_GCC7.3.0/x86_64-native-linuxapp-gcc/42aed033669d49198fbfec00218314b8/dpdk/build-gcc-static/meson-logs/meson-log.txt
ninja -C build-gcc-static
ninja: Entering directory `build-gcc-static'
ninja: error: loading 'build.ninja': No such file or directory
--
Fetching value of define "__RDSEED__" : 1
Program gen-pmdinfo-cfile.sh found: YES (/tmp/UB1804-64_K4.15.0_GCC7.3.0/x86_64-native-linuxapp-gcc/42aed033669d49198fbfec00218314b8/dpdk/buildtools/gen-pmdinfo-cfile.sh)
Using meson's python ['/usr/bin/python3']
Compiler for C supports arguments -Wno-format-truncation -Wformat-truncation: YES

lib/librte_eal/common/meson.build:51:0: ERROR: File include/rte_compat.h does not exist.

A full log can be found at /tmp/UB1804-64_K4.15.0_GCC7.3.0/x86_64-native-linuxapp-gcc/42aed033669d49198fbfec00218314b8/dpdk/build-gcc-shared/meson-logs/meson-log.txt
ninja -C build-gcc-shared
ninja: Entering directory `build-gcc-shared'
ninja: error: loading 'build.ninja': No such file or directory
--
Fetching value of define "__RDSEED__" : 1
Program gen-pmdinfo-cfile.sh found: YES (/tmp/UB1804-64_K4.15.0_GCC7.3.0/x86_64-native-linuxapp-gcc/42aed033669d49198fbfec00218314b8/dpdk/buildtools/gen-pmdinfo-cfile.sh)
Using meson's python ['/usr/bin/python3']
Compiler for C supports arguments -Wno-format-truncation: NO

lib/librte_eal/common/meson.build:51:0: ERROR: File include/rte_compat.h does not exist.

A full log can be found at /tmp/UB1804-64_K4.15.0_GCC7.3.0/x86_64-native-linuxapp-gcc/42aed033669d49198fbfec00218314b8/dpdk/build-clang-static/meson-logs/meson-log.txt
ninja -C build-clang-static
ninja: Entering directory `build-clang-static'
ninja: error: loading 'build.ninja': No such file or directory
--
Fetching value of define "__RDSEED__" : 1
Program gen-pmdinfo-cfile.sh found: YES (/tmp/UB1804-64_K4.15.0_GCC7.3.0/x86_64-native-linuxapp-gcc/42aed033669d49198fbfec00218314b8/dpdk/buildtools/gen-pmdinfo-cfile.sh)
Using meson's python ['/usr/bin/python3']
Compiler for C supports arguments -Wno-format-truncation: NO

lib/librte_eal/common/meson.build:51:0: ERROR: File include/rte_compat.h does not exist.

A full log can be found at /tmp/UB1804-64_K4.15.0_GCC7.3.0/x86_64-native-linuxapp-gcc/42aed033669d49198fbfec00218314b8/dpdk/build-clang-shared/meson-logs/meson-log.txt
ninja -C build-clang-shared
ninja: Entering directory `build-clang-shared'
ninja: error: loading 'build.ninja': No such file or directory
--
Fetching value of define "__RDSEED__" : 
Program gen-pmdinfo-cfile.sh found: YES (/tmp/UB1804-64_K4.15.0_GCC7.3.0/x86_64-native-linuxapp-gcc/42aed033669d49198fbfec00218314b8/dpdk/buildtools/gen-pmdinfo-cfile.sh)
Using meson's python ['/usr/bin/python3']
Compiler for C supports arguments -Wno-format-truncation -Wformat-truncation: YES

lib/librte_eal/common/meson.build:51:0: ERROR: File include/rte_compat.h does not exist.

A full log can be found at /tmp/UB1804-64_K4.15.0_GCC7.3.0/x86_64-native-linuxapp-gcc/42aed033669d49198fbfec00218314b8/dpdk/build-x86-default/meson-logs/meson-log.txt
ninja -C build-x86-default
ninja: Entering directory `build-x86-default'
ninja: error: loading 'build.ninja': No such file or directory
--
ninja: error: loading 'build.ninja': No such file or directory
find: ‘/tmp/UB1804-64_K4.15.0_GCC7.3.0/x86_64-native-linuxapp-gcc/42aed033669d49198fbfec00218314b8/dpdk/build-x86-default/install-root’: No such file or directory
dirname: missing operand
Try 'dirname --help' for more information.
## Building cmdline
make: *** /tmp/UB1804-64_K4.15.0_GCC7.3.0/x86_64-native-linuxapp-gcc/42aed033669d49198fbfec00218314b8/dpdk/build-x86-default/install-root/usr/local/share/dpdk/examples/cmdline: No such file or directory.  Stop.
## Building helloworld
make: *** /tmp/UB1804-64_K4.15.0_GCC7.3.0/x86_64-native-linuxapp-gcc/42aed033669d49198fbfec00218314b8/dpdk/build-x86-default/install-root/usr/local/share/dpdk/examples/helloworld: No such file or directory.  Stop.
## Building l2fwd
make: *** /tmp/UB1804-64_K4.15.0_GCC7.3.0/x86_64-native-linuxapp-gcc/42aed033669d49198fbfec00218314b8/dpdk/build-x86-default/install-root/usr/local/share/dpdk/examples/l2fwd: No such file or directory.  Stop.
## Building l3fwd
make: *** /tmp/UB1804-64_K4.15.0_GCC7.3.0/x86_64-native-linuxapp-gcc/42aed033669d49198fbfec00218314b8/dpdk/build-x86-default/install-root/usr/local/share/dpdk/examples/l3fwd: No such file or directory.  Stop.
## Building skeleton
make: *** /tmp/UB1804-64_K4.15.0_GCC7.3.0/x86_64-native-linuxapp-gcc/42aed033669d49198fbfec00218314b8/dpdk/build-x86-default/install-root/usr/local/share/dpdk/examples/skeleton: No such file or directory.  Stop.
## Building timer
make: *** /tmp/UB1804-64_K4.15.0_GCC7.3.0/x86_64-native-linuxapp-gcc/42aed033669d49198fbfec00218314b8/dpdk/build-x86-default/install-root/usr/local/share/dpdk/examples/timer: No such file or directory.  Stop.


*Meson Build Failed #6:
OS: FreeBSD12-64
Target:build-gcc-static
Fetching value of define "__RDSEED__" : 1
Program gen-pmdinfo-cfile.sh found: YES (/tmp/FreeBSD12-64_K19.02_GCC7.3.0/x86_64-native-bsdapp-gcc/42aed033669d49198fbfec00218314b8/dpdk/buildtools/gen-pmdinfo-cfile.sh)
Using meson's python ['/usr/local/bin/python3']
Compiler for C supports arguments -Wno-format-truncation -Wformat-truncation: YES

lib/librte_eal/common/meson.build:51:0: ERROR: File include/rte_compat.h does not exist.

A full log can be found at /tmp/FreeBSD12-64_K19.02_GCC7.3.0/x86_64-native-bsdapp-gcc/42aed033669d49198fbfec00218314b8/dpdk/build-gcc-static/meson-logs/meson-log.txt
ninja -C build-gcc-static
ninja: Entering directory `build-gcc-static'
ninja: error: loading 'build.ninja': No such file or directory
--
Fetching value of define "__RDSEED__" : 1
Program gen-pmdinfo-cfile.sh found: YES (/tmp/FreeBSD12-64_K19.02_GCC7.3.0/x86_64-native-bsdapp-gcc/42aed033669d49198fbfec00218314b8/dpdk/buildtools/gen-pmdinfo-cfile.sh)
Using meson's python ['/usr/local/bin/python3']
Compiler for C supports arguments -Wno-format-truncation -Wformat-truncation: YES

lib/librte_eal/common/meson.build:51:0: ERROR: File include/rte_compat.h does not exist.

A full log can be found at /tmp/FreeBSD12-64_K19.02_GCC7.3.0/x86_64-native-bsdapp-gcc/42aed033669d49198fbfec00218314b8/dpdk/build-gcc-shared/meson-logs/meson-log.txt
ninja -C build-gcc-shared
ninja: Entering directory `build-gcc-shared'
ninja: error: loading 'build.ninja': No such file or directory
--
Fetching value of define "__RDSEED__" : 1
Program gen-pmdinfo-cfile.sh found: YES (/tmp/FreeBSD12-64_K19.02_GCC7.3.0/x86_64-native-bsdapp-gcc/42aed033669d49198fbfec00218314b8/dpdk/buildtools/gen-pmdinfo-cfile.sh)
Using meson's python ['/usr/local/bin/python3']
Compiler for C supports arguments -Wno-format-truncation: NO

lib/librte_eal/common/meson.build:51:0: ERROR: File include/rte_compat.h does not exist.

A full log can be found at /tmp/FreeBSD12-64_K19.02_GCC7.3.0/x86_64-native-bsdapp-gcc/42aed033669d49198fbfec00218314b8/dpdk/build-clang-static/meson-logs/meson-log.txt
ninja -C build-clang-static
ninja: Entering directory `build-clang-static'
ninja: error: loading 'build.ninja': No such file or directory
--
Fetching value of define "__RDSEED__" : 1
Program gen-pmdinfo-cfile.sh found: YES (/tmp/FreeBSD12-64_K19.02_GCC7.3.0/x86_64-native-bsdapp-gcc/42aed033669d49198fbfec00218314b8/dpdk/buildtools/gen-pmdinfo-cfile.sh)
Using meson's python ['/usr/local/bin/python3']
Compiler for C supports arguments -Wno-format-truncation: NO

lib/librte_eal/common/meson.build:51:0: ERROR: File include/rte_compat.h does not exist.

A full log can be found at /tmp/FreeBSD12-64_K19.02_GCC7.3.0/x86_64-native-bsdapp-gcc/42aed033669d49198fbfec00218314b8/dpdk/build-clang-shared/meson-logs/meson-log.txt
ninja -C build-clang-shared
ninja: Entering directory `build-clang-shared'
ninja: error: loading 'build.ninja': No such file or directory
--
Fetching value of define "__RDSEED__" : 
Program gen-pmdinfo-cfile.sh found: YES (/tmp/FreeBSD12-64_K19.02_GCC7.3.0/x86_64-native-bsdapp-gcc/42aed033669d49198fbfec00218314b8/dpdk/buildtools/gen-pmdinfo-cfile.sh)
Using meson's python ['/usr/local/bin/python3']
Compiler for C supports arguments -Wno-format-truncation: NO

lib/librte_eal/common/meson.build:51:0: ERROR: File include/rte_compat.h does not exist.

A full log can be found at /tmp/FreeBSD12-64_K19.02_GCC7.3.0/x86_64-native-bsdapp-gcc/42aed033669d49198fbfec00218314b8/dpdk/build-x86-default/meson-logs/meson-log.txt
ninja -C build-x86-default
ninja: Entering directory `build-x86-default'
ninja: error: loading 'build.ninja': No such file or directory
ninja: Entering directory `build-x86-default'
ninja: error: loading 'build.ninja': No such file or directory
find: /tmp/FreeBSD12-64_K19.02_GCC7.3.0/x86_64-native-bsdapp-gcc/42aed033669d49198fbfec00218314b8/dpdk/build-x86-default/install-root: No such file or directory
usage: dirname string [...]
## Building cmdline
gmake: *** /tmp/FreeBSD12-64_K19.02_GCC7.3.0/x86_64-native-bsdapp-gcc/42aed033669d49198fbfec00218314b8/dpdk/build-x86-default/install-root/usr/local/share/dpdk/examples/cmdline: No such file or directory.  Stop.
## Building helloworld
gmake: *** /tmp/FreeBSD12-64_K19.02_GCC7.3.0/x86_64-native-bsdapp-gcc/42aed033669d49198fbfec00218314b8/dpdk/build-x86-default/install-root/usr/local/share/dpdk/examples/helloworld: No such file or directory.  Stop.
## Building l2fwd
gmake: *** /tmp/FreeBSD12-64_K19.02_GCC7.3.0/x86_64-native-bsdapp-gcc/42aed033669d49198fbfec00218314b8/dpdk/build-x86-default/install-root/usr/local/share/dpdk/examples/l2fwd: No such file or directory.  Stop.
## Building l3fwd
gmake: *** /tmp/FreeBSD12-64_K19.02_GCC7.3.0/x86_64-native-bsdapp-gcc/42aed033669d49198fbfec00218314b8/dpdk/build-x86-default/install-root/usr/local/share/dpdk/examples/l3fwd: No such file or directory.  Stop.
## Building skeleton
gmake: *** /tmp/FreeBSD12-64_K19.02_GCC7.3.0/x86_64-native-bsdapp-gcc/42aed033669d49198fbfec00218314b8/dpdk/build-x86-default/install-root/usr/local/share/dpdk/examples/skeleton: No such file or directory.  Stop.
## Building timer
gmake: *** /tmp/FreeBSD12-64_K19.02_GCC7.3.0/x86_64-native-bsdapp-gcc/42aed033669d49198fbfec00218314b8/dpdk/build-x86-default/install-root/usr/local/share/dpdk/examples/timer: No such file or directory.  Stop.

DPDK STV team


More information about the test-report mailing list