[dpdk-test-report] |FAILURE| pw60257[v2, 2/2] event/dpaa: support event crypto adapter

sys_stv at intel.com sys_stv at intel.com
Mon Sep 30 22:11:42 CEST 2019


Test-Label: Intel-compilation
Test-Status: FAILURE
http://dpdk.org/patch/60257

_Compilation issues_

Submitter: Akhil Goyal <akhil.goyal at nxp.com>
Date: 2019-09-30 19:13:48
Reply_mail: 20190930191348.16577-3-akhil.goyal at nxp.com
DPDK git baseline: Repo:dpdk, CommitID: bd253daa7717835f88bbc58b09a94d0060380396

Makefile build Summary: 22 Builds Done, 4 Successful, 18 Failures

Meson build Summary: 7 Builds Done, 3 Successful, 4 Failures

               +==============================================+===========+==========+
               |                   Makefile                   |   Meson   | Document |
+--------------+------+-------+------+------------+-----------+-----------+----------+
| os           | gcc  | clang | icc  | gcc+shared | gcc+debug | gcc/clang | pdf/html |
+--------------+------+-------+------+------------+-----------+-----------+----------+
| RHEL76-64    | FAIL |       |      |            |           |           |          |
| CENTOS76-64  | FAIL | FAIL  | FAIL | FAIL       | FAIL      |           |          |
| UB1804-64    | FAIL | FAIL  | FAIL |            |           | FAIL      | pass     |
| UB1604-32    | FAIL |       |      |            |           | FAIL      |          |
| UB1904-64    | FAIL |       |      |            |           |           |          |
| UB1604-64    | FAIL | FAIL  |      |            |           |           |          |
| FC30-64      | FAIL | FAIL  |      |            |           | FAIL      |          |
| WIN10-64     |      |       |      |            |           | pass      |          |
| FreeBSD12-64 | pass | pass  |      | pass       | pass      | pass      |          |
| RHEL80-64    | FAIL |       |      |            |           |           |          |
| SUSE15-64    | FAIL | FAIL  |      |            |           | FAIL      |          |
+--------------+------+-------+------+------------+-----------+-----------+----------+

Test environment and configuration as below:

** Makefile build **


OS: RHEL76-64
	Kernel Version: 3.10.0-957.el7.x86_64
	CPU info: Intel(R) Xeon(R) CPU E5-2699 v4 @ 2.20GHz
	GCC Version: gcc (GCC) 4.8.5 20150623 (Red Hat 4.8.5-36)
	Clang Version: NA
	x86_64-native-linuxapp-gcc


OS: CENTOS76-64
	Kernel Version: 3.10.0-957.10.1.el7.x86_64
	CPU info: Intel(R) Xeon(R) CPU E5-2699 v4 @ 2.20GHz
	GCC Version: gcc (GCC) 4.8.5 20150623 (Red Hat 4.8.5-36)
	Clang Version: 3.4.2 (tags/RELEASE_34/dot2-final)
	x86_64-native-linuxapp-clang
	x86_64-native-linuxapp-gcc+debug
	x86_64-native-linuxapp-gcc
	x86_64-native-linuxapp-icc
	x86_64-native-linuxapp-gcc+shared


OS: UB1804-64
	Kernel Version: 4.15.0-20-generic
	CPU info: Intel(R) Xeon(R) CPU E5-2699 v3 @ 2.30GHz
	GCC Version: gcc (Ubuntu 7.3.0-27ubuntu1~18.04) 7.3.0
	Clang Version: 6.0.0-1ubuntu2 (tags/RELEASE_600/final)
	x86_64-native-linuxapp-icc
	x86_64-native-linuxapp-clang
	x86_64-native-linuxapp-gcc


OS: UB1904-64
	Kernel Version: 5.0.0-13-generic
	CPU info: Intel(R) Xeon(R) CPU E5-2699 v3 @ 2.30GHz
	GCC Version: gcc (Ubuntu 8.3.0-6ubuntu1) 8.3.0
	Clang Version: 8.0.0-3 (tags/RELEASE_800/final)
	x86_64-native-linuxapp-gcc


OS: UB1604-32
	Kernel Version: 4.4.0-131-generic
	CPU info: Intel(R) Xeon(R) CPU E5-2699 v3 @ 2.30GHz
	GCC Version: gcc (Ubuntu 5.4.0-6ubuntu1~16.04.11) 5.4.0 20160609
	Clang Version: 3.8.0-2ubuntu4 (tags/RELEASE_380/final)
	i686-native-linuxapp-gcc


OS: UB1604-64
	Kernel Version: 4.4.0-47-generic
	CPU info: Intel(R) Xeon(R) CPU E5-2699 v3 @ 2.30GHz
	GCC Version: gcc (Ubuntu 5.4.0-6ubuntu1~16.04.10) 5.4.0 20160609
	Clang Version: 3.8.0-2ubuntu4 (tags/RELEASE_380/final)
	x86_64-native-linuxapp-clang
	x86_64-native-linuxapp-gcc


OS: FC30-64
	Kernel Version: 5.1.7-300.fc30.x86_64
	CPU info: Intel(R) Xeon(R) CPU E5-2699 v4 @ 2.20GHz
	GCC Version: gcc (GCC) 9.1.1 20190503 (Red Hat 9.1.1-1)
	Clang Version: 8.0.0 (Fedora 8.0.0-1.fc30)
	x86_64-native-linuxapp-gcc
	x86_64-native-linuxapp-clang


OS: FreeBSD12-64
	Kernel Version: 12.0-RC3
	CPU info: Intel(R) Xeon(R) CPU E5-2699 v4 @ 2.20GHz (2194.97-MHz K8-class CPU)
	GCC Version: gcc (FreeBSD Ports Collection) 7.3.0
	Clang Version: 6.0.1 (tags/RELEASE_601/final 335540) (based on LLVM 6.0.1)
	x86_64-native-bsdapp-gcc+shared
	x86_64-native-bsdapp-gcc+debug
	x86_64-native-bsdapp-clang
	x86_64-native-bsdapp-gcc


OS: RHEL80-64
	Kernel Version: 4.18.0-80.el8.x86_64
	CPU info: Intel(R) Xeon(R) CPU E5-2699 v4 @ 2.20GHz
	GCC Version: gcc (GCC) 8.2.1 20180905 (Red Hat 8.2.1-3)
	Clang Version: 6.0.1 (tags/RELEASE_601/final)
	x86_64-native-linuxapp-gcc


OS: SUSE15-64
	Kernel Version: 4.12.14-lp150.11-default
	CPU info: Intel(R) Xeon(R) CPU E5-2699 v4 @ 2.20GHz
	GCC Version: gcc (SUSE Linux) 7.3.1 20180323 [gcc-7-branch revision 258812]
	Clang Version: 5.0.1 (tags/RELEASE_501/final 312548)
	x86_64-native-linuxapp-gcc
	x86_64-native-linuxapp-clang


** Meson build **


OS: UB1804-64
	Kernel Version: 4.15.0-20-generic
	CPU info: Intel(R) Xeon(R) CPU E5-2699 v4 @ 2.20GHz
	GCC Version: gcc (Ubuntu 7.3.0-27ubuntu1~18.04) 7.3.0
	Clang Version: 6.0.0-1ubuntu2 (tags/RELEASE_600/final)
	x86_64-native-linuxapp-doc
	build-gcc-static
	build-gcc-shared
	build-clang-static
	build-clang-shared
	build-x86-default


OS: UB1604-32
	Kernel Version: 4.4.0-131-generic
	CPU info: Intel(R) Xeon(R) CPU E5-2699 v4 @ 2.20GHz
	GCC Version: gcc (Ubuntu 5.4.0-6ubuntu1~16.04.11) 5.4.0 20160609
	Clang Version: 3.8.0-2ubuntu4 (tags/RELEASE_380/final)
	build-gcc-static
	build-gcc-shared
	build-clang-static
	build-clang-shared
	build-x86-default


OS: FC30-64
	Kernel Version: 5.0.9-301.fc30.x86_64
	CPU info: Intel(R) Xeon(R) CPU E5-2699 v4 @ 2.20GHz
	GCC Version: gcc (GCC) 9.1.1 20190503 (Red Hat 9.1.1-1)
	Clang Version: 8.0.0 (Fedora 8.0.0-1.fc30)
	build-gcc-static
	build-gcc-shared
	build-clang-static
	build-clang-shared
	build-x86-default


OS: WIN10-64
	Kernel Version: N/A
	CPU info: N/A
	GCC Version: N/A
	Clang Version: Clang 8.0.0
	x86_64-windows-clang


OS: FreeBSD12-64
	Kernel Version: 12.0-RC3
	CPU info: Intel(R) Xeon(R) CPU E5-2699 v4 @ 2.20GHz (2194.99-MHz K8-class CPU)
	GCC Version: gcc (FreeBSD Ports Collection) 7.3.0
	Clang Version: 6.0.1 (tags/RELEASE_601/final 335540) (based on LLVM 6.0.1)
	build-gcc-static
	build-gcc-shared
	build-clang-static
	build-clang-shared
	build-x86-default


OS: SUSE15-64
	Kernel Version: 4.12.14-lp150.11-default
	CPU info: Intel(R) Xeon(R) CPU E5-2699 v4 @ 2.20GHz
	GCC Version: gcc (SUSE Linux) 7.3.1 20180323 [gcc-7-branch revision 258812]
	Clang Version: 5.0.1 (tags/RELEASE_501/final 312548)
	build-gcc-static
	build-gcc-shared
	build-clang-static
	build-clang-shared
	build-x86-default


*Make Build Failed #1:
OS: UB1604-64
Target: x86_64-native-linuxapp-clang
  LD opdl_evdev.o
  AR librte_pmd_skeleton_event.a
  PMDINFO dsw_evdev.o.pmd.c
  CC opdl_evdev_xstats.o
  CC dsw_evdev.o.pmd.o
/tmp/UB1604-64_K4.4.0_Clang3.8.0/x86_64-native-linuxapp-clang/82fb14f71b8c4e9384a2cf562c8298e1/dpdk/drivers/event/dpaa/dpaa_eventdev.c:37:10: fatal error: 'dpaa_sec_event.h' file not found
#include <dpaa_sec_event.h>
         ^
  INSTALL-LIB librte_pmd_skeleton_event.a
1 error generated.
/tmp/UB1604-64_K4.4.0_Clang3.8.0/x86_64-native-linuxapp-clang/82fb14f71b8c4e9384a2cf562c8298e1/dpdk/mk/internal/rte.compile-pre.mk:114: recipe for target 'dpaa_eventdev.o' failed
make[6]: *** [dpaa_eventdev.o] Error 1
/tmp/UB1604-64_K4.4.0_Clang3.8.0/x86_64-native-linuxapp-clang/82fb14f71b8c4e9384a2cf562c8298e1/dpdk/mk/rte.subdir.mk:35: recipe for target 'dpaa' failed
make[5]: *** [dpaa] Error 2
make[5]: *** Waiting for unfinished jobs....
  LD dsw_evdev.o
  CC opdl_test.o
  CC ssovf_evdev.o
  PMDINFO dpaa2_hw_dpcon.o.pmd.c
--
  LD otx2_evdev.o
  AR librte_pmd_sw_event.a
  INSTALL-LIB librte_pmd_sw_event.a
  AR librte_pmd_octeontx2_event.a
  INSTALL-LIB librte_pmd_octeontx2_event.a
/tmp/UB1604-64_K4.4.0_Clang3.8.0/x86_64-native-linuxapp-clang/82fb14f71b8c4e9384a2cf562c8298e1/dpdk/mk/rte.subdir.mk:35: recipe for target 'event' failed
make[4]: *** [event] Error 2
/tmp/UB1604-64_K4.4.0_Clang3.8.0/x86_64-native-linuxapp-clang/82fb14f71b8c4e9384a2cf562c8298e1/dpdk/mk/rte.sdkbuild.mk:46: recipe for target 'drivers' failed
make[3]: *** [drivers] Error 2
/tmp/UB1604-64_K4.4.0_Clang3.8.0/x86_64-native-linuxapp-clang/82fb14f71b8c4e9384a2cf562c8298e1/dpdk/mk/rte.sdkroot.mk:98: recipe for target 'all' failed
make[2]: *** [all] Error 2
/tmp/UB1604-64_K4.4.0_Clang3.8.0/x86_64-native-linuxapp-clang/82fb14f71b8c4e9384a2cf562c8298e1/dpdk/mk/rte.sdkinstall.mk:60: recipe for target 'pre_install' failed
make[1]: *** [pre_install] Error 2
/tmp/UB1604-64_K4.4.0_Clang3.8.0/x86_64-native-linuxapp-clang/82fb14f71b8c4e9384a2cf562c8298e1/dpdk/mk/rte.sdkroot.mk:77: recipe for target 'install' failed
make: *** [install] Error 2


*Make Build Failed #2:
OS: UB1604-32
Target: i686-native-linuxapp-gcc
  PMDINFO dpaa2_hw_dpcon.o.pmd.c
  CC dpaa2_hw_dpcon.o.pmd.o
  CC dsw_event.o
  LD dpaa2_hw_dpcon.o
  CC dsw_xstats.o
/tmp/UB1604-32_K4.4.0_GCC5.4.0/i686-native-linuxapp-gcc/82fb14f71b8c4e9384a2cf562c8298e1/dpdk/drivers/event/dpaa/dpaa_eventdev.c:37:28: fatal error: dpaa_sec_event.h: No such file or directory
compilation terminated.
/tmp/UB1604-32_K4.4.0_GCC5.4.0/i686-native-linuxapp-gcc/82fb14f71b8c4e9384a2cf562c8298e1/dpdk/mk/internal/rte.compile-pre.mk:114: recipe for target 'dpaa_eventdev.o' failed
make[6]: *** [dpaa_eventdev.o] Error 1
/tmp/UB1604-32_K4.4.0_GCC5.4.0/i686-native-linuxapp-gcc/82fb14f71b8c4e9384a2cf562c8298e1/dpdk/mk/rte.subdir.mk:35: recipe for target 'dpaa' failed
make[5]: *** [dpaa] Error 2
make[5]: *** Waiting for unfinished jobs....
  CC ssovf_evdev.o
  PMDINFO sw_evdev.o.pmd.c
  CC sw_evdev.o.pmd.o
  LD sw_evdev.o
--
  PMDINFO otx2_evdev.o.pmd.c
  CC otx2_evdev.o.pmd.o
  LD otx2_evdev.o
  AR librte_pmd_octeontx2_event.a
  INSTALL-LIB librte_pmd_octeontx2_event.a
/tmp/UB1604-32_K4.4.0_GCC5.4.0/i686-native-linuxapp-gcc/82fb14f71b8c4e9384a2cf562c8298e1/dpdk/mk/rte.subdir.mk:35: recipe for target 'event' failed
make[4]: *** [event] Error 2
/tmp/UB1604-32_K4.4.0_GCC5.4.0/i686-native-linuxapp-gcc/82fb14f71b8c4e9384a2cf562c8298e1/dpdk/mk/rte.sdkbuild.mk:46: recipe for target 'drivers' failed
make[3]: *** [drivers] Error 2
/tmp/UB1604-32_K4.4.0_GCC5.4.0/i686-native-linuxapp-gcc/82fb14f71b8c4e9384a2cf562c8298e1/dpdk/mk/rte.sdkroot.mk:98: recipe for target 'all' failed
make[2]: *** [all] Error 2
/tmp/UB1604-32_K4.4.0_GCC5.4.0/i686-native-linuxapp-gcc/82fb14f71b8c4e9384a2cf562c8298e1/dpdk/mk/rte.sdkinstall.mk:60: recipe for target 'pre_install' failed
make[1]: *** [pre_install] Error 2
/tmp/UB1604-32_K4.4.0_GCC5.4.0/i686-native-linuxapp-gcc/82fb14f71b8c4e9384a2cf562c8298e1/dpdk/mk/rte.sdkroot.mk:77: recipe for target 'install' failed
make: *** [install] Error 2


*Make Build Failed #3:
OS: UB1904-64
Target: x86_64-native-linuxapp-gcc
  LD skeleton_eventdev.o
  CC dsw_event.o
  AR librte_pmd_skeleton_event.a
  INSTALL-LIB librte_pmd_skeleton_event.a
  CC opdl_evdev.o
/tmp/UB1904-64_K4.18.0_GCC8.3.0/x86_64-native-linuxapp-gcc/82fb14f71b8c4e9384a2cf562c8298e1/dpdk/drivers/event/dpaa/dpaa_eventdev.c:37:10: fatal error: dpaa_sec_event.h: No such file or directory
 #include <dpaa_sec_event.h>
          ^~~~~~~~~~~~~~~~~~
compilation terminated.
make[6]: *** [/tmp/UB1904-64_K4.18.0_GCC8.3.0/x86_64-native-linuxapp-gcc/82fb14f71b8c4e9384a2cf562c8298e1/dpdk/mk/internal/rte.compile-pre.mk:116: dpaa_eventdev.o] Error 1
make[5]: *** [/tmp/UB1904-64_K4.18.0_GCC8.3.0/x86_64-native-linuxapp-gcc/82fb14f71b8c4e9384a2cf562c8298e1/dpdk/mk/rte.subdir.mk:35: dpaa] Error 2
make[5]: *** Waiting for unfinished jobs....
  CC sw_evdev_worker.o
  PMDINFO ssovf_evdev.o.pmd.c
  CC ssovf_evdev.o.pmd.o
  LD ssovf_evdev.o
--
  PMDINFO otx2_evdev.o.pmd.c
  CC otx2_evdev.o.pmd.o
  LD otx2_evdev.o
  AR librte_pmd_octeontx2_event.a
  INSTALL-LIB librte_pmd_octeontx2_event.a
make[4]: *** [/tmp/UB1904-64_K4.18.0_GCC8.3.0/x86_64-native-linuxapp-gcc/82fb14f71b8c4e9384a2cf562c8298e1/dpdk/mk/rte.subdir.mk:37: event] Error 2
make[3]: *** [/tmp/UB1904-64_K4.18.0_GCC8.3.0/x86_64-native-linuxapp-gcc/82fb14f71b8c4e9384a2cf562c8298e1/dpdk/mk/rte.sdkbuild.mk:46: drivers] Error 2
make[2]: *** [/tmp/UB1904-64_K4.18.0_GCC8.3.0/x86_64-native-linuxapp-gcc/82fb14f71b8c4e9384a2cf562c8298e1/dpdk/mk/rte.sdkroot.mk:99: all] Error 2
make[1]: *** [/tmp/UB1904-64_K4.18.0_GCC8.3.0/x86_64-native-linuxapp-gcc/82fb14f71b8c4e9384a2cf562c8298e1/dpdk/mk/rte.sdkinstall.mk:61: pre_install] Error 2
make: *** [/tmp/UB1904-64_K4.18.0_GCC8.3.0/x86_64-native-linuxapp-gcc/82fb14f71b8c4e9384a2cf562c8298e1/dpdk/mk/rte.sdkroot.mk:77: install] Error 2


*Make Build Failed #4:
OS: UB1804-64
Target: x86_64-native-linuxapp-icc
/tmp/UB1804-64_K4.15.0_ICC19.0.0/x86_64-native-linuxapp-icc/82fb14f71b8c4e9384a2cf562c8298e1/dpdk/drivers/event/dpaa/dpaa_eventdev.c(37): catastrophic error: cannot open source file "dpaa_sec_event.h"
  #include <dpaa_sec_event.h>
                             ^

compilation aborted for /tmp/UB1804-64_K4.15.0_ICC19.0.0/x86_64-native-linuxapp-icc/82fb14f71b8c4e9384a2cf562c8298e1/dpdk/drivers/event/dpaa/dpaa_eventdev.c (code 4)
/tmp/UB1804-64_K4.15.0_ICC19.0.0/x86_64-native-linuxapp-icc/82fb14f71b8c4e9384a2cf562c8298e1/dpdk/mk/internal/rte.compile-pre.mk:114: recipe for target 'dpaa_eventdev.o' failed
make[6]: *** [dpaa_eventdev.o] Error 4
/tmp/UB1804-64_K4.15.0_ICC19.0.0/x86_64-native-linuxapp-icc/82fb14f71b8c4e9384a2cf562c8298e1/dpdk/mk/rte.subdir.mk:35: recipe for target 'dpaa' failed
make[5]: *** [dpaa] Error 2
make[5]: *** Waiting for unfinished jobs....
  CC sw_evdev_worker.o
  LD dpaa2_eventdev.o
  CC opdl_evdev_init.o
  LD skeleton_eventdev.o
--
  INSTALL-LIB librte_pmd_octeontx_ssovf.a
  AR librte_pmd_sw_event.a
  INSTALL-LIB librte_pmd_sw_event.a
  AR librte_pmd_octeontx2_event.a
  INSTALL-LIB librte_pmd_octeontx2_event.a
/tmp/UB1804-64_K4.15.0_ICC19.0.0/x86_64-native-linuxapp-icc/82fb14f71b8c4e9384a2cf562c8298e1/dpdk/mk/rte.subdir.mk:35: recipe for target 'event' failed
make[4]: *** [event] Error 2
/tmp/UB1804-64_K4.15.0_ICC19.0.0/x86_64-native-linuxapp-icc/82fb14f71b8c4e9384a2cf562c8298e1/dpdk/mk/rte.sdkbuild.mk:46: recipe for target 'drivers' failed
make[3]: *** [drivers] Error 2
/tmp/UB1804-64_K4.15.0_ICC19.0.0/x86_64-native-linuxapp-icc/82fb14f71b8c4e9384a2cf562c8298e1/dpdk/mk/rte.sdkroot.mk:98: recipe for target 'all' failed
make[2]: *** [all] Error 2
/tmp/UB1804-64_K4.15.0_ICC19.0.0/x86_64-native-linuxapp-icc/82fb14f71b8c4e9384a2cf562c8298e1/dpdk/mk/rte.sdkinstall.mk:60: recipe for target 'pre_install' failed
make[1]: *** [pre_install] Error 2
/tmp/UB1804-64_K4.15.0_ICC19.0.0/x86_64-native-linuxapp-icc/82fb14f71b8c4e9384a2cf562c8298e1/dpdk/mk/rte.sdkroot.mk:77: recipe for target 'install' failed
make: *** [install] Error 2


*Make Build Failed #5:
OS: UB1804-64
Target: x86_64-native-linuxapp-clang
  PMDINFO dsw_evdev.o.pmd.c
  CC dsw_evdev.o.pmd.o
  LD dsw_evdev.o
  CC dsw_event.o
/tmp/UB1804-64_K4.15.0_Clang6.0.0/x86_64-native-linuxapp-clang/82fb14f71b8c4e9384a2cf562c8298e1/dpdk/drivers/event/dpaa/dpaa_eventdev.c  PMDINFO sw_evdev.o.pmd.c
:37:10: fatal error: 'dpaa_sec_event.h' file not found
#include <dpaa_sec_event.h>
         ^~~~~~~~~~~~~~~~~~
  CC sw_evdev.o.pmd.o
1 error generated.
/tmp/UB1804-64_K4.15.0_Clang6.0.0/x86_64-native-linuxapp-clang/82fb14f71b8c4e9384a2cf562c8298e1/dpdk/mk/internal/rte.compile-pre.mk:114: recipe for target 'dpaa_eventdev.o' failed
make[6]: *** [dpaa_eventdev.o] Error 1
/tmp/UB1804-64_K4.15.0_Clang6.0.0/x86_64-native-linuxapp-clang/82fb14f71b8c4e9384a2cf562c8298e1/dpdk/mk/rte.subdir.mk:35: recipe for target 'dpaa' failed
make[5]: *** [dpaa] Error 2
make[5]: *** Waiting for unfinished jobs....
  LD sw_evdev.o
  CC ssovf_evdev_selftest.o
  PMDINFO dpaa2_hw_dpcon.o.pmd.c
  CC dpaa2_hw_dpcon.o.pmd.o
--
  INSTALL-LIB librte_pmd_opdl_event.a
  AR librte_pmd_sw_event.a
  INSTALL-LIB librte_pmd_sw_event.a
  AR librte_pmd_octeontx2_event.a
  INSTALL-LIB librte_pmd_octeontx2_event.a
/tmp/UB1804-64_K4.15.0_Clang6.0.0/x86_64-native-linuxapp-clang/82fb14f71b8c4e9384a2cf562c8298e1/dpdk/mk/rte.subdir.mk:35: recipe for target 'event' failed
make[4]: *** [event] Error 2
/tmp/UB1804-64_K4.15.0_Clang6.0.0/x86_64-native-linuxapp-clang/82fb14f71b8c4e9384a2cf562c8298e1/dpdk/mk/rte.sdkbuild.mk:46: recipe for target 'drivers' failed
make[3]: *** [drivers] Error 2
/tmp/UB1804-64_K4.15.0_Clang6.0.0/x86_64-native-linuxapp-clang/82fb14f71b8c4e9384a2cf562c8298e1/dpdk/mk/rte.sdkroot.mk:98: recipe for target 'all' failed
make[2]: *** [all] Error 2
/tmp/UB1804-64_K4.15.0_Clang6.0.0/x86_64-native-linuxapp-clang/82fb14f71b8c4e9384a2cf562c8298e1/dpdk/mk/rte.sdkinstall.mk:60: recipe for target 'pre_install' failed
make[1]: *** [pre_install] Error 2
/tmp/UB1804-64_K4.15.0_Clang6.0.0/x86_64-native-linuxapp-clang/82fb14f71b8c4e9384a2cf562c8298e1/dpdk/mk/rte.sdkroot.mk:77: recipe for target 'install' failed
make: *** [install] Error 2


*Make Build Failed #6:
OS: SUSE15-64
Target: x86_64-native-linuxapp-gcc
  LD dpaa2_hw_dpcon.o
  INSTALL-LIB librte_pmd_skeleton_event.a
  PMDINFO dsw_evdev.o.pmd.c
  CC dsw_evdev.o.pmd.o
  CC sw_evdev_worker.o
/tmp/SUSE15-64_K4.12.14_GCC7.3.1/x86_64-native-linuxapp-gcc/82fb14f71b8c4e9384a2cf562c8298e1/dpdk/drivers/event/dpaa/dpaa_eventdev.c:37:10: fatal error: dpaa_sec_event.h: No such file or directory
 #include <dpaa_sec_event.h>
          ^~~~~~~~~~~~~~~~~~
compilation terminated.
make[6]: *** [/tmp/SUSE15-64_K4.12.14_GCC7.3.1/x86_64-native-linuxapp-gcc/82fb14f71b8c4e9384a2cf562c8298e1/dpdk/mk/internal/rte.compile-pre.mk:116: dpaa_eventdev.o] Error 1
make[5]: *** [/tmp/SUSE15-64_K4.12.14_GCC7.3.1/x86_64-native-linuxapp-gcc/82fb14f71b8c4e9384a2cf562c8298e1/dpdk/mk/rte.subdir.mk:35: dpaa] Error 2
make[5]: *** Waiting for unfinished jobs....
  LD dsw_evdev.o
  CC opdl_evdev_init.o
  CC dpaa2_eventdev.o
  PMDINFO opdl_evdev.o.pmd.c
--
  PMDINFO otx2_evdev.o.pmd.c
  CC otx2_evdev.o.pmd.o
  LD otx2_evdev.o
  AR librte_pmd_octeontx2_event.a
  INSTALL-LIB librte_pmd_octeontx2_event.a
make[4]: *** [/tmp/SUSE15-64_K4.12.14_GCC7.3.1/x86_64-native-linuxapp-gcc/82fb14f71b8c4e9384a2cf562c8298e1/dpdk/mk/rte.subdir.mk:37: event] Error 2
make[3]: *** [/tmp/SUSE15-64_K4.12.14_GCC7.3.1/x86_64-native-linuxapp-gcc/82fb14f71b8c4e9384a2cf562c8298e1/dpdk/mk/rte.sdkbuild.mk:46: drivers] Error 2
make[2]: *** [/tmp/SUSE15-64_K4.12.14_GCC7.3.1/x86_64-native-linuxapp-gcc/82fb14f71b8c4e9384a2cf562c8298e1/dpdk/mk/rte.sdkroot.mk:99: all] Error 2
make[1]: *** [/tmp/SUSE15-64_K4.12.14_GCC7.3.1/x86_64-native-linuxapp-gcc/82fb14f71b8c4e9384a2cf562c8298e1/dpdk/mk/rte.sdkinstall.mk:61: pre_install] Error 2
make: *** [/tmp/SUSE15-64_K4.12.14_GCC7.3.1/x86_64-native-linuxapp-gcc/82fb14f71b8c4e9384a2cf562c8298e1/dpdk/mk/rte.sdkroot.mk:77: install] Error 2


*Make Build Failed #7:
OS: FC30-64
Target: x86_64-native-linuxapp-gcc
  CC otx2_worker.o
  CC otx2_tim_worker.o
  PMDINFO sw_evdev.o.pmd.c
  CC sw_evdev.o.pmd.o
  LD sw_evdev.o
/tmp/FC30-64_K4.20_GCC9.1.1/x86_64-native-linuxapp-gcc/82fb14f71b8c4e9384a2cf562c8298e1/dpdk/drivers/event/dpaa/dpaa_eventdev.c:37:10: fatal error: dpaa_sec_event.h: No such file or directory
   37 | #include <dpaa_sec_event.h>
      |          ^~~~~~~~~~~~~~~~~~
compilation terminated.
make[6]: *** [/tmp/FC30-64_K4.20_GCC9.1.1/x86_64-native-linuxapp-gcc/82fb14f71b8c4e9384a2cf562c8298e1/dpdk/mk/internal/rte.compile-pre.mk:116: dpaa_eventdev.o] Error 1
make[5]: *** [/tmp/FC30-64_K4.20_GCC9.1.1/x86_64-native-linuxapp-gcc/82fb14f71b8c4e9384a2cf562c8298e1/dpdk/mk/rte.subdir.mk:35: dpaa] Error 2
make[5]: *** Waiting for unfinished jobs....
  CC otx2_evdev.o
  PMDINFO dpaa2_hw_dpcon.o.pmd.c
  CC dpaa2_hw_dpcon.o.pmd.o
  PMDINFO opdl_evdev.o.pmd.c
--
  LD otx2_evdev.o
  AR librte_pmd_sw_event.a
  INSTALL-LIB librte_pmd_sw_event.a
  AR librte_pmd_octeontx2_event.a
  INSTALL-LIB librte_pmd_octeontx2_event.a
make[4]: *** [/tmp/FC30-64_K4.20_GCC9.1.1/x86_64-native-linuxapp-gcc/82fb14f71b8c4e9384a2cf562c8298e1/dpdk/mk/rte.subdir.mk:37: event] Error 2
make[3]: *** [/tmp/FC30-64_K4.20_GCC9.1.1/x86_64-native-linuxapp-gcc/82fb14f71b8c4e9384a2cf562c8298e1/dpdk/mk/rte.sdkbuild.mk:46: drivers] Error 2
make[2]: *** [/tmp/FC30-64_K4.20_GCC9.1.1/x86_64-native-linuxapp-gcc/82fb14f71b8c4e9384a2cf562c8298e1/dpdk/mk/rte.sdkroot.mk:99: all] Error 2
make[1]: *** [/tmp/FC30-64_K4.20_GCC9.1.1/x86_64-native-linuxapp-gcc/82fb14f71b8c4e9384a2cf562c8298e1/dpdk/mk/rte.sdkinstall.mk:61: pre_install] Error 2
make: *** [/tmp/FC30-64_K4.20_GCC9.1.1/x86_64-native-linuxapp-gcc/82fb14f71b8c4e9384a2cf562c8298e1/dpdk/mk/rte.sdkroot.mk:77: install] Error 2


*Make Build Failed #8:
OS: RHEL76-64
Target: x86_64-native-linuxapp-gcc
  CC dpaa2_hw_dpcon.o
  CC dpaa_eventdev.o
  PMDINFO skeleton_eventdev.o.pmd.c
  CC skeleton_eventdev.o.pmd.o
  LD skeleton_eventdev.o
/tmp/RHEL76-64_K3.10.0_GCC4.8.5/x86_64-native-linuxapp-gcc/82fb14f71b8c4e9384a2cf562c8298e1/dpdk/drivers/event/dpaa/dpaa_eventdev.c:37:28: fatal error: dpaa_sec_event.h: No such file or directory
 #include <dpaa_sec_event.h>
                            ^
compilation terminated.
  PMDINFO dpaa2_hw_dpcon.o.pmd.c
  CC dpaa2_hw_dpcon.o.pmd.o
--
  CC opdl_ring.o
  CC dsw_event.o
  CC dpaa2_eventdev.o
  CC ssovf_evdev.o
  CC dsw_xstats.o
make[6]: *** [dpaa_eventdev.o] Error 1
make[5]: *** [dpaa] Error 2
make[5]: *** Waiting for unfinished jobs....
  CC sw_evdev_scheduler.o
  CC ssovf_evdev_selftest.o
  PMDINFO ssovf_evdev.o.pmd.c
  CC ssovf_evdev.o.pmd.o
--
  PMDINFO otx2_evdev.o.pmd.c
  CC otx2_evdev.o.pmd.o
  LD otx2_evdev.o
  AR librte_pmd_octeontx2_event.a
  INSTALL-LIB librte_pmd_octeontx2_event.a
make[4]: *** [event] Error 2
make[3]: *** [drivers] Error 2
make[2]: *** [all] Error 2
make[1]: *** [pre_install] Error 2
make: *** [install] Error 2


*Make Build Failed #9:
OS: FC30-64
Target: x86_64-native-linuxapp-clang
  PMDINFO dsw_evdev.o.pmd.c
  CC dsw_evdev.o.pmd.o
  LD dsw_evdev.o
  PMDINFO dpaa2_hw_dpcon.o.pmd.c
  CC dpaa2_hw_dpcon.o.pmd.o
/tmp/FC30-64_K4.20_Clang8.0.0/x86_64-native-linuxapp-clang/82fb14f71b8c4e9384a2cf562c8298e1/dpdk/drivers/event/dpaa/dpaa_eventdev.c:37:10: fatal error: 'dpaa_sec_event.h' file not found
#include <dpaa_sec_event.h>
         ^~~~~~~~~~~~~~~~~~
1 error generated.
make[6]: *** [/tmp/FC30-64_K4.20_Clang8.0.0/x86_64-native-linuxapp-clang/82fb14f71b8c4e9384a2cf562c8298e1/dpdk/mk/internal/rte.compile-pre.mk:116: dpaa_eventdev.o] Error 1
make[5]: *** [/tmp/FC30-64_K4.20_Clang8.0.0/x86_64-native-linuxapp-clang/82fb14f71b8c4e9384a2cf562c8298e1/dpdk/mk/rte.subdir.mk:35: dpaa] Error 2
make[5]: *** Waiting for unfinished jobs....
  LD dpaa2_hw_dpcon.o
  CC ssovf_evdev.o
  CC dsw_event.o
  PMDINFO sw_evdev.o.pmd.c
--
  INSTALL-LIB librte_pmd_octeontx_ssovf.a
  AR librte_pmd_sw_event.a
  INSTALL-LIB librte_pmd_sw_event.a
  AR librte_pmd_octeontx2_event.a
  INSTALL-LIB librte_pmd_octeontx2_event.a
make[4]: *** [/tmp/FC30-64_K4.20_Clang8.0.0/x86_64-native-linuxapp-clang/82fb14f71b8c4e9384a2cf562c8298e1/dpdk/mk/rte.subdir.mk:37: event] Error 2
make[3]: *** [/tmp/FC30-64_K4.20_Clang8.0.0/x86_64-native-linuxapp-clang/82fb14f71b8c4e9384a2cf562c8298e1/dpdk/mk/rte.sdkbuild.mk:46: drivers] Error 2
make[2]: *** [/tmp/FC30-64_K4.20_Clang8.0.0/x86_64-native-linuxapp-clang/82fb14f71b8c4e9384a2cf562c8298e1/dpdk/mk/rte.sdkroot.mk:99: all] Error 2
make[1]: *** [/tmp/FC30-64_K4.20_Clang8.0.0/x86_64-native-linuxapp-clang/82fb14f71b8c4e9384a2cf562c8298e1/dpdk/mk/rte.sdkinstall.mk:61: pre_install] Error 2
make: *** [/tmp/FC30-64_K4.20_Clang8.0.0/x86_64-native-linuxapp-clang/82fb14f71b8c4e9384a2cf562c8298e1/dpdk/mk/rte.sdkroot.mk:77: install] Error 2


*Make Build Failed #10:
OS: RHEL80-64
Target: x86_64-native-linuxapp-gcc
  AR librte_pmd_skeleton_event.a
  CC dsw_xstats.o
  INSTALL-LIB librte_pmd_skeleton_event.a
  CC dpaa2_eventdev.o
  CC opdl_evdev.o
/tmp/RHEL80-64_K3.10.0_GCC8.2.1/x86_64-native-linuxapp-gcc/82fb14f71b8c4e9384a2cf562c8298e1/dpdk/drivers/event/dpaa/dpaa_eventdev.c:37:10: fatal error: dpaa_sec_event.h: No such file or directory
 #include <dpaa_sec_event.h>
          ^~~~~~~~~~~~~~~~~~
compilation terminated.
make[6]: *** [/tmp/RHEL80-64_K3.10.0_GCC8.2.1/x86_64-native-linuxapp-gcc/82fb14f71b8c4e9384a2cf562c8298e1/dpdk/mk/internal/rte.compile-pre.mk:116: dpaa_eventdev.o] Error 1
make[5]: *** [/tmp/RHEL80-64_K3.10.0_GCC8.2.1/x86_64-native-linuxapp-gcc/82fb14f71b8c4e9384a2cf562c8298e1/dpdk/mk/rte.subdir.mk:35: dpaa] Error 2
make[5]: *** Waiting for unfinished jobs....
  CC sw_evdev_scheduler.o
  CC opdl_evdev_init.o
  PMDINFO sw_evdev.o.pmd.c
  CC sw_evdev.o.pmd.o
--
  INSTALL-LIB librte_pmd_sw_event.a
  AR librte_pmd_opdl_event.a
  INSTALL-LIB librte_pmd_opdl_event.a
  AR librte_pmd_octeontx2_event.a
  INSTALL-LIB librte_pmd_octeontx2_event.a
make[4]: *** [/tmp/RHEL80-64_K3.10.0_GCC8.2.1/x86_64-native-linuxapp-gcc/82fb14f71b8c4e9384a2cf562c8298e1/dpdk/mk/rte.subdir.mk:37: event] Error 2
make[3]: *** [/tmp/RHEL80-64_K3.10.0_GCC8.2.1/x86_64-native-linuxapp-gcc/82fb14f71b8c4e9384a2cf562c8298e1/dpdk/mk/rte.sdkbuild.mk:46: drivers] Error 2
make[2]: *** [/tmp/RHEL80-64_K3.10.0_GCC8.2.1/x86_64-native-linuxapp-gcc/82fb14f71b8c4e9384a2cf562c8298e1/dpdk/mk/rte.sdkroot.mk:99: all] Error 2
make[1]: *** [/tmp/RHEL80-64_K3.10.0_GCC8.2.1/x86_64-native-linuxapp-gcc/82fb14f71b8c4e9384a2cf562c8298e1/dpdk/mk/rte.sdkinstall.mk:61: pre_install] Error 2
make: *** [/tmp/RHEL80-64_K3.10.0_GCC8.2.1/x86_64-native-linuxapp-gcc/82fb14f71b8c4e9384a2cf562c8298e1/dpdk/mk/rte.sdkroot.mk:77: install] Error 2


*Make Build Failed #11:
OS: SUSE15-64
Target: x86_64-native-linuxapp-clang
  PMDINFO dpaa2_eventdev.o.pmd.c
  CC sw_evdev_xstats.o
  CC dpaa2_eventdev.o.pmd.o
  PMDINFO dpaa2_hw_dpcon.o.pmd.c
  CC dpaa2_hw_dpcon.o.pmd.o
/tmp/SUSE15-64_K4.12.14_Clang5.0.1/x86_64-native-linuxapp-clang/82fb14f71b8c4e9384a2cf562c8298e1/dpdk/drivers/event/dpaa/dpaa_eventdev.c:37:10: fatal error: 'dpaa_sec_event.h' file not found
#include <dpaa_sec_event.h>
         ^~~~~~~~~~~~~~~~~~
1  LD dpaa2_eventdev.o
 error generated.
  LD dpaa2_hw_dpcon.o
make[6]: *** [/tmp/SUSE15-64_K4.12.14_Clang5.0.1/x86_64-native-linuxapp-clang/82fb14f71b8c4e9384a2cf562c8298e1/dpdk/mk/internal/rte.compile-pre.mk:116: dpaa_eventdev.o] Error 1
make[5]: *** [/tmp/SUSE15-64_K4.12.14_Clang5.0.1/x86_64-native-linuxapp-clang/82fb14f71b8c4e9384a2cf562c8298e1/dpdk/mk/rte.subdir.mk:35: dpaa] Error 2
make[5]: *** Waiting for unfinished jobs....
  CC sw_evdev_selftest.o
  PMDINFO sw_evdev.o.pmd.c
  CC sw_evdev.o.pmd.o
  LD sw_evdev.o
--
  PMDINFO otx2_evdev.o.pmd.c
  CC otx2_evdev.o.pmd.o
  LD otx2_evdev.o
  AR librte_pmd_octeontx2_event.a
  INSTALL-LIB librte_pmd_octeontx2_event.a
make[4]: *** [/tmp/SUSE15-64_K4.12.14_Clang5.0.1/x86_64-native-linuxapp-clang/82fb14f71b8c4e9384a2cf562c8298e1/dpdk/mk/rte.subdir.mk:37: event] Error 2
make[3]: *** [/tmp/SUSE15-64_K4.12.14_Clang5.0.1/x86_64-native-linuxapp-clang/82fb14f71b8c4e9384a2cf562c8298e1/dpdk/mk/rte.sdkbuild.mk:46: drivers] Error 2
make[2]: *** [/tmp/SUSE15-64_K4.12.14_Clang5.0.1/x86_64-native-linuxapp-clang/82fb14f71b8c4e9384a2cf562c8298e1/dpdk/mk/rte.sdkroot.mk:99: all] Error 2
make[1]: *** [/tmp/SUSE15-64_K4.12.14_Clang5.0.1/x86_64-native-linuxapp-clang/82fb14f71b8c4e9384a2cf562c8298e1/dpdk/mk/rte.sdkinstall.mk:61: pre_install] Error 2
make: *** [/tmp/SUSE15-64_K4.12.14_Clang5.0.1/x86_64-native-linuxapp-clang/82fb14f71b8c4e9384a2cf562c8298e1/dpdk/mk/rte.sdkroot.mk:77: install] Error 2


*Make Build Failed #12:
OS: UB1604-64
Target: x86_64-native-linuxapp-gcc
  PMDINFO dsw_evdev.o.pmd.c
  CC dsw_evdev.o.pmd.o
  PMDINFO dpaa2_hw_dpcon.o.pmd.c
  CC dpaa2_hw_dpcon.o.pmd.o
  LD dsw_evdev.o
/tmp/UB1604-64_K4.4.0_GCC5.4.0/x86_64-native-linuxapp-gcc/82fb14f71b8c4e9384a2cf562c8298e1/dpdk/drivers/event/dpaa/dpaa_eventdev.c:37:28: fatal error: dpaa_sec_event.h: No such file or directory
compilation terminated.
/tmp/UB1604-64_K4.4.0_GCC5.4.0/x86_64-native-linuxapp-gcc/82fb14f71b8c4e9384a2cf562c8298e1/dpdk/mk/internal/rte.compile-pre.mk:114: recipe for target 'dpaa_eventdev.o' failed
make[6]: *** [dpaa_eventdev.o] Error 1
  CC ssovf_evdev_selftest.o
/tmp/UB1604-64_K4.4.0_GCC5.4.0/x86_64-native-linuxapp-gcc/82fb14f71b8c4e9384a2cf562c8298e1/dpdk/mk/rte.subdir.mk:35: recipe for target 'dpaa' failed
make[5]: *** [dpaa] Error 2
make[5]: *** Waiting for unfinished jobs....
  CC otx2_worker.o
  LD dpaa2_hw_dpcon.o
  CC otx2_tim_worker.o
  PMDINFO sw_evdev.o.pmd.c
--
  LD otx2_evdev.o
  AR librte_pmd_sw_event.a
  INSTALL-LIB librte_pmd_sw_event.a
  AR librte_pmd_octeontx2_event.a
  INSTALL-LIB librte_pmd_octeontx2_event.a
/tmp/UB1604-64_K4.4.0_GCC5.4.0/x86_64-native-linuxapp-gcc/82fb14f71b8c4e9384a2cf562c8298e1/dpdk/mk/rte.subdir.mk:35: recipe for target 'event' failed
make[4]: *** [event] Error 2
/tmp/UB1604-64_K4.4.0_GCC5.4.0/x86_64-native-linuxapp-gcc/82fb14f71b8c4e9384a2cf562c8298e1/dpdk/mk/rte.sdkbuild.mk:46: recipe for target 'drivers' failed
make[3]: *** [drivers] Error 2
/tmp/UB1604-64_K4.4.0_GCC5.4.0/x86_64-native-linuxapp-gcc/82fb14f71b8c4e9384a2cf562c8298e1/dpdk/mk/rte.sdkroot.mk:98: recipe for target 'all' failed
make[2]: *** [all] Error 2
/tmp/UB1604-64_K4.4.0_GCC5.4.0/x86_64-native-linuxapp-gcc/82fb14f71b8c4e9384a2cf562c8298e1/dpdk/mk/rte.sdkinstall.mk:60: recipe for target 'pre_install' failed
make[1]: *** [pre_install] Error 2
/tmp/UB1604-64_K4.4.0_GCC5.4.0/x86_64-native-linuxapp-gcc/82fb14f71b8c4e9384a2cf562c8298e1/dpdk/mk/rte.sdkroot.mk:77: recipe for target 'install' failed
make: *** [install] Error 2


*Make Build Failed #13:
OS: UB1804-64
Target: x86_64-native-linuxapp-gcc
  LD dsw_evdev.o
  CC opdl_evdev_init.o
  PMDINFO dpaa2_hw_dpcon.o.pmd.c
  CC dpaa2_hw_dpcon.o.pmd.o
  LD dpaa2_hw_dpcon.o
/tmp/UB1804-64_K4.15.0_GCC7.3.0/x86_64-native-linuxapp-gcc/82fb14f71b8c4e9384a2cf562c8298e1/dpdk/drivers/event/dpaa/dpaa_eventdev.c:37:10: fatal error: dpaa_sec_event.h: No such file or directory
 #include <dpaa_sec_event.h>
          ^~~~~~~~~~~~~~~~~~
compilation terminated.
  CC opdl_evdev_xstats.o
/tmp/UB1804-64_K4.15.0_GCC7.3.0/x86_64-native-linuxapp-gcc/82fb14f71b8c4e9384a2cf562c8298e1/dpdk/mk/internal/rte.compile-pre.mk:114: recipe for target 'dpaa_eventdev.o' failed
make[6]: *** [dpaa_eventdev.o] Error 1
/tmp/UB1804-64_K4.15.0_GCC7.3.0/x86_64-native-linuxapp-gcc/82fb14f71b8c4e9384a2cf562c8298e1/dpdk/mk/rte.subdir.mk:35: recipe for target 'dpaa' failed
make[5]: *** [dpaa] Error 2
make[5]: *** Waiting for unfinished jobs....
  CC opdl_test.o
  PMDINFO opdl_evdev.o.pmd.c
  CC opdl_evdev.o.pmd.o
  PMDINFO dpaa2_eventdev.o.pmd.c
--
  PMDINFO otx2_evdev.o.pmd.c
  CC otx2_evdev.o.pmd.o
  LD otx2_evdev.o
  AR librte_pmd_octeontx2_event.a
  INSTALL-LIB librte_pmd_octeontx2_event.a
/tmp/UB1804-64_K4.15.0_GCC7.3.0/x86_64-native-linuxapp-gcc/82fb14f71b8c4e9384a2cf562c8298e1/dpdk/mk/rte.subdir.mk:35: recipe for target 'event' failed
make[4]: *** [event] Error 2
/tmp/UB1804-64_K4.15.0_GCC7.3.0/x86_64-native-linuxapp-gcc/82fb14f71b8c4e9384a2cf562c8298e1/dpdk/mk/rte.sdkbuild.mk:46: recipe for target 'drivers' failed
make[3]: *** [drivers] Error 2
/tmp/UB1804-64_K4.15.0_GCC7.3.0/x86_64-native-linuxapp-gcc/82fb14f71b8c4e9384a2cf562c8298e1/dpdk/mk/rte.sdkroot.mk:98: recipe for target 'all' failed
make[2]: *** [all] Error 2
/tmp/UB1804-64_K4.15.0_GCC7.3.0/x86_64-native-linuxapp-gcc/82fb14f71b8c4e9384a2cf562c8298e1/dpdk/mk/rte.sdkinstall.mk:60: recipe for target 'pre_install' failed
make[1]: *** [pre_install] Error 2
/tmp/UB1804-64_K4.15.0_GCC7.3.0/x86_64-native-linuxapp-gcc/82fb14f71b8c4e9384a2cf562c8298e1/dpdk/mk/rte.sdkroot.mk:77: recipe for target 'install' failed
make: *** [install] Error 2


*Make Build Failed #14:
OS: CENTOS76-64
Target: x86_64-native-linuxapp-clang
  LD dsw_evdev.o
  CC dpaa2_eventdev.o
  PMDINFO dpaa2_hw_dpcon.o.pmd.c
  CC dpaa2_hw_dpcon.o.pmd.o
  AR librte_pmd_skeleton_event.a
/tmp/CENTOS76-64_K3.10.0_Clang3.4.2/x86_64-native-linuxapp-clang/82fb14f71b8c4e9384a2cf562c8298e1/dpdk/drivers/event/dpaa/dpaa_eventdev.c:37:10: fatal error: 'dpaa_sec_event.h' file not found
#include <dpaa_sec_event.h>
         ^
1 error generated.
  PMDINFO sw_evdev.o.pmd.c
make[6]: *** [dpaa_eventdev.o] Error 1
make[5]: *** [dpaa] Error 2
make[5]: *** Waiting for unfinished jobs....
  CC ssovf_evdev.o
  CC opdl_evdev.o
  CC sw_evdev.o.pmd.o
  INSTALL-LIB librte_pmd_skeleton_event.a
--
  INSTALL-LIB librte_pmd_sw_event.a
  AR librte_pmd_opdl_event.a
  INSTALL-LIB librte_pmd_opdl_event.a
  AR librte_pmd_octeontx2_event.a
  INSTALL-LIB librte_pmd_octeontx2_event.a
make[4]: *** [event] Error 2
make[3]: *** [drivers] Error 2
make[2]: *** [all] Error 2
make[1]: *** [pre_install] Error 2
make: *** [install] Error 2


*Make Build Failed #15:
OS: CENTOS76-64
Target: x86_64-native-linuxapp-gcc+debug
  LD dpaa2_hw_dpcon.o
  CC opdl_evdev.o
  AR librte_pmd_skeleton_event.a
  PMDINFO dsw_evdev.o.pmd.c
  INSTALL-LIB librte_pmd_skeleton_event.a
/tmp/CENTOS76-64_K3.10.0_GCC4.8.5/x86_64-native-linuxapp-gcc+debug/82fb14f71b8c4e9384a2cf562c8298e1/dpdk/drivers/event/dpaa/dpaa_eventdev.c:37:28: fatal error: dpaa_sec_event.h: No such file or directory
 #include <dpaa_sec_event.h>
                            ^
compilation terminated.
  CC dsw_evdev.o.pmd.o
  CC dpaa2_eventdev.o
--
  CC ssovf_evdev.o
  LD opdl_evdev.o
  LD sw_evdev.o
  PMDINFO dpaa2_eventdev.o.pmd.c
  CC dpaa2_eventdev.o.pmd.o
make[6]: *** [dpaa_eventdev.o] Error 1
make[5]: *** [dpaa] Error 2
make[5]: *** Waiting for unfinished jobs....
  CC otx2_evdev.o
  CC opdl_evdev_init.o
  CC sw_evdev_worker.o
  LD dpaa2_eventdev.o
--
  LD otx2_evdev.o
  AR librte_pmd_sw_event.a
  INSTALL-LIB librte_pmd_sw_event.a
  AR librte_pmd_octeontx2_event.a
  INSTALL-LIB librte_pmd_octeontx2_event.a
make[4]: *** [event] Error 2
make[3]: *** [drivers] Error 2
make[2]: *** [all] Error 2
make[1]: *** [pre_install] Error 2
make: *** [install] Error 2


*Make Build Failed #16:
OS: CENTOS76-64
Target: x86_64-native-linuxapp-gcc
  CC otx2_worker_dual.o
  CC ssovf_worker.o
  LD skeleton_eventdev.o
  CC dpaa2_hw_dpcon.o
  CC sw_evdev.o
/tmp/CENTOS76-64_K3.10.0_GCC4.8.5/x86_64-native-linuxapp-gcc/82fb14f71b8c4e9384a2cf562c8298e1/dpdk/drivers/event/dpaa/dpaa_eventdev.c:37:28: fatal error: dpaa_sec_event.h: No such file or directory
 #include <dpaa_sec_event.h>
                            ^
compilation terminated.
  CC sw_evdev_worker.o
  CC opdl_ring.o
--
  LD dpaa2_hw_dpcon.o
  CC sw_evdev_scheduler.o
  PMDINFO dsw_evdev.o.pmd.c
  CC dsw_evdev.o.pmd.o
  CC dpaa2_eventdev.o
make[6]: *** [dpaa_eventdev.o] Error 1
make[5]: *** [dpaa] Error 2
make[5]: *** Waiting for unfinished jobs....
  LD dsw_evdev.o
  CC sw_evdev_xstats.o
  PMDINFO opdl_evdev.o.pmd.c
  CC opdl_evdev.o.pmd.o
--
  PMDINFO otx2_evdev.o.pmd.c
  CC otx2_evdev.o.pmd.o
  LD otx2_evdev.o
  AR librte_pmd_octeontx2_event.a
  INSTALL-LIB librte_pmd_octeontx2_event.a
make[4]: *** [event] Error 2
make[3]: *** [drivers] Error 2
make[2]: *** [all] Error 2
make[1]: *** [pre_install] Error 2
make: *** [install] Error 2


*Make Build Failed #17:
OS: CENTOS76-64
Target: x86_64-native-linuxapp-icc
/tmp/CENTOS76-64_K3.10.0_ICC19.0.0/x86_64-native-linuxapp-icc/82fb14f71b8c4e9384a2cf562c8298e1/dpdk/drivers/event/dpaa/dpaa_eventdev.c(37): catastrophic error: cannot open source file "dpaa_sec_event.h"
  #include <dpaa_sec_event.h>
                             ^

compilation aborted for /tmp/CENTOS76-64_K3.10.0_ICC19.0.0/x86_64-native-linuxapp-icc/82fb14f71b8c4e9384a2cf562c8298e1/dpdk/drivers/event/dpaa/dpaa_eventdev.c (code 4)
make[6]: *** [dpaa_eventdev.o] Error 4
make[5]: *** [dpaa] Error 2
make[5]: *** Waiting for unfinished jobs....
  CC opdl_evdev_init.o
  PMDINFO sw_evdev.o.pmd.c
  CC sw_evdev.o.pmd.o
  LD skeleton_eventdev.o
--
  INSTALL-LIB librte_pmd_octeontx_ssovf.a
  AR librte_pmd_sw_event.a
  INSTALL-LIB librte_pmd_sw_event.a
  AR librte_pmd_octeontx2_event.a
  INSTALL-LIB librte_pmd_octeontx2_event.a
make[4]: *** [event] Error 2
make[3]: *** [drivers] Error 2
make[2]: *** [all] Error 2
make[1]: *** [pre_install] Error 2
make: *** [install] Error 2


*Make Build Failed #18:
OS: CENTOS76-64
Target: x86_64-native-linuxapp-gcc+shared
  CC dpaa_eventdev.o
  CC sw_evdev.o
  PMDINFO dsw_evdev.o.pmd.c
  CC dsw_evdev.o.pmd.o
  LD dsw_evdev.o
/tmp/CENTOS76-64_K3.10.0_GCC4.8.5/x86_64-native-linuxapp-gcc+shared/82fb14f71b8c4e9384a2cf562c8298e1/dpdk/drivers/event/dpaa/dpaa_eventdev.c:37:28: fatal error: dpaa_sec_event.h: No such file or directory
 #include <dpaa_sec_event.h>
                            ^
compilation terminated.
  CC dpaa2_hw_dpcon.o
  CC dpaa2_eventdev.o
--
  CC sw_evdev.o.pmd.o
  PMDINFO dpaa2_eventdev.o.pmd.c
  CC dpaa2_eventdev.o.pmd.o
  LD dpaa2_eventdev.o
  LD librte_pmd_skeleton_event.so.1.1
make[6]: *** [dpaa_eventdev.o] Error 1
make[5]: *** [dpaa] Error 2
make[5]: *** Waiting for unfinished jobs....
  CC ssovf_evdev.o
  CC otx2_worker.o
  INSTALL-LIB librte_pmd_skeleton_event.so.1.1
  LD sw_evdev.o
--
  LD otx2_evdev.o
  LD librte_pmd_sw_event.so.1.1
  INSTALL-LIB librte_pmd_sw_event.so.1.1
  LD librte_pmd_octeontx2_event.so.1.1
  INSTALL-LIB librte_pmd_octeontx2_event.so.1.1
make[4]: *** [event] Error 2
make[3]: *** [drivers] Error 2
make[2]: *** [all] Error 2
make[1]: *** [pre_install] Error 2
make: *** [install] Error 2

*Meson Build Failed #1:
OS: FC30-64
Target:build-gcc-static
FAILED: drivers/a715181@@tmp_rte_pmd_dpaa_event at sta/event_dpaa_dpaa_eventdev.c.o 
gcc -Idrivers/a715181@@tmp_rte_pmd_dpaa_event at sta -Idrivers -I../drivers -Idrivers/event/dpaa -I../drivers/event/dpaa -Idrivers/event/dpaa/../../crypto/dpaa_sec/ -I../drivers/event/dpaa/../../crypto/dpaa_sec/ -Ilib/librte_eventdev -I../lib/librte_eventdev -I. -I../ -Iconfig -I../config -Ilib/librte_eal/common/include -I../lib/librte_eal/common/include -I../lib/librte_eal/linux/eal/include -Ilib/librte_eal/common -I../lib/librte_eal/common -Ilib/librte_eal/common/include/arch/x86 -I../lib/librte_eal/common/include/arch/x86 -Ilib/librte_eal -I../lib/librte_eal -Ilib/librte_kvargs -I../lib/librte_kvargs -Ilib/librte_ring -I../lib/librte_ring -Ilib/librte_ethdev -I../lib/librte_ethdev -Ilib/librte_net -I../lib/librte_net -Ilib/librte_mbuf -I../lib/librte_mbuf -Ilib/librte_mempool -I../lib/librte_mempool -Ilib/librte_meter -I../lib/librte_meter -Ilib/librte_hash -I../lib/librte_hash -Ilib/librte_timer -I../lib/librte_timer -Ilib/librte_cryptodev -I../lib/librte_cryptodev -Idrivers/net/dpaa -I../drivers/net/dpaa -Idrivers/bus/pci -I../drivers/bus/pci -I../drivers/bus/pci/linux -Ilib/librte_pci -I../lib/librte_pci -Idrivers/bus/vdev -I../drivers/bus/vdev -Idrivers/mempool/dpaa -I../drivers/mempool/dpaa -Idrivers/bus/dpaa -I../drivers/bus/dpaa -I../drivers/bus/dpaa/include -I../drivers/bus/dpaa/base/qbman -Idrivers/common/dpaax -I../drivers/common/dpaax -Idrivers/crypto/dpaa_sec -I../drivers/crypto/dpaa_sec -Idrivers/crypto/dpaa_sec/../dpaa2_sec/ -I../drivers/crypto/dpaa_sec/../dpaa2_sec/ -Ilib/librte_security -I../lib/librte_security -fdiagnostics-color=always -pipe -D_FILE_OFFSET_BITS=64 -Wall -Winvalid-pch -Werror -O3 -include rte_config.h -Wunused-parameter -Wsign-compare -Wcast-qual -Wno-address-of-packed-member -D_GNU_SOURCE -fPIC -march=native -mno-avx512f -Wno-format-truncation -DALLOW_EXPERIMENTAL_API -MD -MQ 'drivers/a715181@@tmp_rte_pmd_dpaa_event at sta/event_dpaa_dpaa_eventdev.c.o' -MF 'drivers/a715181@@tmp_rte_pmd_dpaa_event at sta/event_dpaa_dpaa_eventdev.c.o.d' -o 'drivers/a715181@@tmp_rte_pmd_dpaa_event at sta/event_dpaa_dpaa_eventdev.c.o' -c ../drivers/event/dpaa/dpaa_eventdev.c
../drivers/event/dpaa/dpaa_eventdev.c:37:10: fatal error: dpaa_sec_event.h: No such file or directory
   37 | #include <dpaa_sec_event.h>
      |          ^~~~~~~~~~~~~~~~~~
compilation terminated.
[1266/1785] Linking target drivers/librte_pmd_qat.so.1.1.
[1267/1785] Compiling C object 'drivers/a715181@@tmp_rte_pmd_dpaa2_event at sta/event_dpaa2_dpaa2_eventdev.c.o'.
[1268/1785] Compiling C object 'drivers/a715181@@tmp_rte_pmd_octeontx2_event at sta/event_octeontx2_otx2_evdev_irq.c.o'.
[1269/1785] Compiling C object 'drivers/a715181@@tmp_rte_pmd_octeontx2_event at sta/event_octeontx2_otx2_evdev_adptr.c.o'.
[1270/1785] Compiling C object 'drivers/a715181@@tmp_rte_pmd_octeontx_crypto at sta/crypto_octeontx_otx_cryptodev_ops.c.o'.
[1271/1785] Compiling C object 'drivers/a715181@@tmp_rte_pmd_octeontx2_event at sta/event_octeontx2_otx2_evdev.c.o'.
[1272/1785] Compiling C object 'drivers/a715181@@tmp_rte_pmd_octeontx2_event at sta/event_octeontx2_otx2_worker_dual.c.o'.
ninja: build stopped: subcommand failed




*Meson Build Failed #2:
OS: SUSE15-64
Target:build-gcc-static
FAILED: drivers/a715181@@tmp_rte_pmd_dpaa_event at sta/event_dpaa_dpaa_eventdev.c.o 
gcc -Idrivers/a715181@@tmp_rte_pmd_dpaa_event at sta -Idrivers -I../drivers -Idrivers/event/dpaa -I../drivers/event/dpaa -Idrivers/event/dpaa/../../crypto/dpaa_sec/ -I../drivers/event/dpaa/../../crypto/dpaa_sec/ -Ilib/librte_eventdev -I../lib/librte_eventdev -I. -I../ -Iconfig -I../config -Ilib/librte_eal/common/include -I../lib/librte_eal/common/include -I../lib/librte_eal/linux/eal/include -Ilib/librte_eal/common -I../lib/librte_eal/common -Ilib/librte_eal/common/include/arch/x86 -I../lib/librte_eal/common/include/arch/x86 -Ilib/librte_eal -I../lib/librte_eal -Ilib/librte_kvargs -I../lib/librte_kvargs -Ilib/librte_ring -I../lib/librte_ring -Ilib/librte_ethdev -I../lib/librte_ethdev -Ilib/librte_net -I../lib/librte_net -Ilib/librte_mbuf -I../lib/librte_mbuf -Ilib/librte_mempool -I../lib/librte_mempool -Ilib/librte_meter -I../lib/librte_meter -Ilib/librte_hash -I../lib/librte_hash -Ilib/librte_timer -I../lib/librte_timer -Ilib/librte_cryptodev -I../lib/librte_cryptodev -Idrivers/net/dpaa -I../drivers/net/dpaa -Idrivers/bus/pci -I../drivers/bus/pci -I../drivers/bus/pci/linux -Ilib/librte_pci -I../lib/librte_pci -Idrivers/bus/vdev -I../drivers/bus/vdev -Idrivers/mempool/dpaa -I../drivers/mempool/dpaa -Idrivers/bus/dpaa -I../drivers/bus/dpaa -I../drivers/bus/dpaa/include -I../drivers/bus/dpaa/base/qbman -Idrivers/common/dpaax -I../drivers/common/dpaax -Idrivers/crypto/dpaa_sec -I../drivers/crypto/dpaa_sec -Idrivers/crypto/dpaa_sec/../dpaa2_sec/ -I../drivers/crypto/dpaa_sec/../dpaa2_sec/ -Ilib/librte_security -I../lib/librte_security -fdiagnostics-color=always -pipe -D_FILE_OFFSET_BITS=64 -Wall -Winvalid-pch -Werror -O3 -include rte_config.h -Wunused-parameter -Wsign-compare -Wcast-qual -D_GNU_SOURCE -fPIC -march=native -Wno-format-truncation -DALLOW_EXPERIMENTAL_API -MD -MQ 'drivers/a715181@@tmp_rte_pmd_dpaa_event at sta/event_dpaa_dpaa_eventdev.c.o' -MF 'drivers/a715181@@tmp_rte_pmd_dpaa_event at sta/event_dpaa_dpaa_eventdev.c.o.d' -o 'drivers/a715181@@tmp_rte_pmd_dpaa_event at sta/event_dpaa_dpaa_eventdev.c.o' -c ../drivers/event/dpaa/dpaa_eventdev.c
../drivers/event/dpaa/dpaa_eventdev.c:37:10: fatal error: dpaa_sec_event.h: No such file or directory
 #include <dpaa_sec_event.h>
          ^~~~~~~~~~~~~~~~~~
compilation terminated.
[1303/1832] Compiling C object 'drivers/a715181@@tmp_rte_pmd_qat at sta/compress_qat_qat_comp_pmd.c.o'.
[1304/1832] Compiling C object 'drivers/a715181@@tmp_rte_pmd_dpaa2_event at sta/event_dpaa2_dpaa2_eventdev.c.o'.
[1305/1832] Compiling C object 'drivers/a715181@@tmp_rte_pmd_zlib at sta/compress_zlib_zlib_pmd.c.o'.
[1306/1832] Compiling C object 'drivers/a715181@@tmp_rte_pmd_octeontx2_event at sta/event_octeontx2_otx2_evdev_irq.c.o'.
[1307/1832] Compiling C object 'drivers/a715181@@tmp_rte_pmd_dpaa2_event at sta/event_dpaa2_dpaa2_hw_dpcon.c.o'.
[1308/1832] Compiling C object 'drivers/a715181@@tmp_rte_pmd_octeontx_crypto at sta/crypto_octeontx_otx_cryptodev_ops.c.o'.
[1309/1832] Compiling C object 'drivers/a715181@@tmp_rte_pmd_octeontx2_event at sta/event_octeontx2_otx2_evdev.c.o'.
ninja: build stopped: subcommand failed




*Meson Build Failed #3:
OS: UB1604-32
Target:build-gcc-static
FAILED: drivers/a715181@@tmp_rte_pmd_dpaa_event at sta/event_dpaa_dpaa_eventdev.c.o 
gcc -Idrivers/a715181@@tmp_rte_pmd_dpaa_event at sta -Idrivers -I../drivers -Idrivers/event/dpaa -I../drivers/event/dpaa -Idrivers/event/dpaa/../../crypto/dpaa_sec/ -I../drivers/event/dpaa/../../crypto/dpaa_sec/ -Ilib/librte_eventdev -I../lib/librte_eventdev -I. -I../ -Iconfig -I../config -Ilib/librte_eal/common/include -I../lib/librte_eal/common/include -I../lib/librte_eal/linux/eal/include -Ilib/librte_eal/common -I../lib/librte_eal/common -Ilib/librte_eal/common/include/arch/x86 -I../lib/librte_eal/common/include/arch/x86 -Ilib/librte_eal -I../lib/librte_eal -Ilib/librte_kvargs -I../lib/librte_kvargs -Ilib/librte_ring -I../lib/librte_ring -Ilib/librte_ethdev -I../lib/librte_ethdev -Ilib/librte_net -I../lib/librte_net -Ilib/librte_mbuf -I../lib/librte_mbuf -Ilib/librte_mempool -I../lib/librte_mempool -Ilib/librte_meter -I../lib/librte_meter -Ilib/librte_hash -I../lib/librte_hash -Ilib/librte_timer -I../lib/librte_timer -Ilib/librte_cryptodev -I../lib/librte_cryptodev -Idrivers/net/dpaa -I../drivers/net/dpaa -Idrivers/bus/pci -I../drivers/bus/pci -I../drivers/bus/pci/linux -Ilib/librte_pci -I../lib/librte_pci -Idrivers/bus/vdev -I../drivers/bus/vdev -Idrivers/mempool/dpaa -I../drivers/mempool/dpaa -Idrivers/bus/dpaa -I../drivers/bus/dpaa -I../drivers/bus/dpaa/include -I../drivers/bus/dpaa/base/qbman -Idrivers/common/dpaax -I../drivers/common/dpaax -Idrivers/crypto/dpaa_sec -I../drivers/crypto/dpaa_sec -Idrivers/crypto/dpaa_sec/../dpaa2_sec/ -I../drivers/crypto/dpaa_sec/../dpaa2_sec/ -Ilib/librte_security -I../lib/librte_security -fdiagnostics-color=always -pipe -D_FILE_OFFSET_BITS=64 -Wall -Winvalid-pch -Werror -O3 -include rte_config.h -Wunused-parameter -Wsign-compare -Wcast-qual -Wno-pointer-to-int-cast -D_GNU_SOURCE -fPIC -march=native -DALLOW_EXPERIMENTAL_API -MD -MQ 'drivers/a715181@@tmp_rte_pmd_dpaa_event at sta/event_dpaa_dpaa_eventdev.c.o' -MF 'drivers/a715181@@tmp_rte_pmd_dpaa_event at sta/event_dpaa_dpaa_eventdev.c.o.d' -o 'drivers/a715181@@tmp_rte_pmd_dpaa_event at sta/event_dpaa_dpaa_eventdev.c.o' -c ../drivers/event/dpaa/dpaa_eventdev.c
../drivers/event/dpaa/dpaa_eventdev.c:37:28: fatal error: dpaa_sec_event.h: No such file or directory
compilation terminated.
[1138/1657] Generating rte_pmd_qat.pmd.c with a custom command.
[1139/1657] Compiling C object 'drivers/a715181@@tmp_rte_pmd_dpaa2_event at sta/event_dpaa2_dpaa2_hw_dpcon.c.o'.
[1140/1657] Compiling C object 'drivers/a715181@@tmp_rte_pmd_dpaa2_event at sta/event_dpaa2_dpaa2_eventdev.c.o'.
[1141/1657] Compiling C object 'drivers/a715181@@tmp_rte_pmd_octeontx_crypto at sta/crypto_octeontx_otx_cryptodev_ops.c.o'.
[1142/1657] Compiling C object 'drivers/a715181@@tmp_rte_pmd_octeontx2_event at sta/event_octeontx2_otx2_worker_dual.c.o'.
ninja: build stopped: subcommand failed




*Meson Build Failed #4:
OS: UB1804-64
Target:build-gcc-static
FAILED: drivers/a715181@@tmp_rte_pmd_dpaa_event at sta/event_dpaa_dpaa_eventdev.c.o 
gcc -Idrivers/a715181@@tmp_rte_pmd_dpaa_event at sta -Idrivers -I../drivers -Idrivers/event/dpaa -I../drivers/event/dpaa -Idrivers/event/dpaa/../../crypto/dpaa_sec/ -I../drivers/event/dpaa/../../crypto/dpaa_sec/ -Ilib/librte_eventdev -I../lib/librte_eventdev -I. -I../ -Iconfig -I../config -Ilib/librte_eal/common/include -I../lib/librte_eal/common/include -I../lib/librte_eal/linux/eal/include -Ilib/librte_eal/common -I../lib/librte_eal/common -Ilib/librte_eal/common/include/arch/x86 -I../lib/librte_eal/common/include/arch/x86 -Ilib/librte_eal -I../lib/librte_eal -Ilib/librte_kvargs -I../lib/librte_kvargs -Ilib/librte_ring -I../lib/librte_ring -Ilib/librte_ethdev -I../lib/librte_ethdev -Ilib/librte_net -I../lib/librte_net -Ilib/librte_mbuf -I../lib/librte_mbuf -Ilib/librte_mempool -I../lib/librte_mempool -Ilib/librte_meter -I../lib/librte_meter -Ilib/librte_hash -I../lib/librte_hash -Ilib/librte_timer -I../lib/librte_timer -Ilib/librte_cryptodev -I../lib/librte_cryptodev -Idrivers/net/dpaa -I../drivers/net/dpaa -Idrivers/bus/pci -I../drivers/bus/pci -I../drivers/bus/pci/linux -Ilib/librte_pci -I../lib/librte_pci -Idrivers/bus/vdev -I../drivers/bus/vdev -Idrivers/mempool/dpaa -I../drivers/mempool/dpaa -Idrivers/bus/dpaa -I../drivers/bus/dpaa -I../drivers/bus/dpaa/include -I../drivers/bus/dpaa/base/qbman -Idrivers/common/dpaax -I../drivers/common/dpaax -Idrivers/crypto/dpaa_sec -I../drivers/crypto/dpaa_sec -Idrivers/crypto/dpaa_sec/../dpaa2_sec/ -I../drivers/crypto/dpaa_sec/../dpaa2_sec/ -Ilib/librte_security -I../lib/librte_security -fdiagnostics-color=always -pipe -D_FILE_OFFSET_BITS=64 -Wall -Winvalid-pch -Werror -O3 -include rte_config.h -Wunused-parameter -Wsign-compare -Wcast-qual -D_GNU_SOURCE -fPIC -march=native -mno-avx512f -Wno-format-truncation -DALLOW_EXPERIMENTAL_API -MD -MQ 'drivers/a715181@@tmp_rte_pmd_dpaa_event at sta/event_dpaa_dpaa_eventdev.c.o' -MF 'drivers/a715181@@tmp_rte_pmd_dpaa_event at sta/event_dpaa_dpaa_eventdev.c.o.d' -o 'drivers/a715181@@tmp_rte_pmd_dpaa_event at sta/event_dpaa_dpaa_eventdev.c.o' -c ../drivers/event/dpaa/dpaa_eventdev.c
../drivers/event/dpaa/dpaa_eventdev.c:37:10: fatal error: dpaa_sec_event.h: No such file or directory
 #include <dpaa_sec_event.h>
          ^~~~~~~~~~~~~~~~~~
compilation terminated.
[1265/1792] Generating rte_pmd_zlib.pmd.c with a custom command.
[1266/1792] Linking static target drivers/librte_pmd_qat.a.
[1267/1792] Linking target drivers/librte_pmd_qat.so.1.1.
[1268/1792] Compiling C object 'drivers/a715181@@tmp_rte_pmd_dpaa2_event at sta/event_dpaa2_dpaa2_eventdev.c.o'.
[1269/1792] Compiling C object 'drivers/a715181@@tmp_rte_pmd_octeontx_crypto at sta/crypto_octeontx_otx_cryptodev_ops.c.o'.
ninja: build stopped: subcommand failed



DPDK STV team


More information about the test-report mailing list