[dpdk-test-report] |FAILURE| pw68314[v3, 2/2] mempool: use shared memzone for rte_mempool_ops

sys_stv at intel.com sys_stv at intel.com
Mon Apr 13 18:52:19 CEST 2020


Test-Label: Intel-compilation
Test-Status: FAILURE
http://dpdk.org/patch/68314

_Compilation issues_

Submitter: Tonghao Zhang <xiangxia.m.yue at gmail.com>
Date: 2020-04-13 14:21:54
Reply_mail: 1586787714-13890-2-git-send-email-xiangxia.m.yue at gmail.com
DPDK git baseline: Repo:dpdk, CommitID: 2a41db7589cb27dc491963f8c09b8dd452a8296d

Makefile build Summary: 23 Builds Done, 0 Successful, 23 Failures

Meson build Summary: 8 Builds Done, 2 Successful, 6 Failures

               +==============================================+===========+==========+
               |                   Makefile                   |   Meson   | Document |
+----------------+------+-------+------+------------+-----------+-----------+----------+
| os             | gcc  | clang | icc  | gcc+shared | gcc+debug | gcc/clang | pdf/html |
+----------------+------+-------+------+------------+-----------+-----------+----------+
| RHEL80-64      | FAIL |       |      |            |           |           |          |
| UB1804-64      | FAIL | FAIL  | FAIL |            |           | FAIL      | pass     |
| UB1604-32      | FAIL |       |      |            |           | FAIL      |          |
| CENTOS77-64    | FAIL | FAIL  | FAIL | FAIL       | FAIL      | FAIL      |          |
| UB1604-64      | FAIL | FAIL  |      |            |           |           |          |
| WIN10-64       |      |       |      |            |           | pass      |          |
| UB1910-64      | FAIL |       |      |            |           |           |          |
| FC31-64        | FAIL | FAIL  |      |            |           | FAIL      |          |
| CENTOS80-64    | FAIL |       |      |            |           |           |          |
| FreeBSD1201-64 | FAIL | FAIL  |      | FAIL       | FAIL      | FAIL      |          |
| RHEL77-64      | FAIL |       |      |            |           |           |          |
| SUSE15-64      | FAIL | FAIL  |      |            |           | FAIL      |          |
+----------------+------+-------+------+------------+-----------+-----------+----------+

Test environment and configuration as below:

** Makefile build **


OS: UB1804-64
	Kernel Version: 4.15.0-20-generic
	CPU info: Intel(R) Xeon(R) CPU E5-2699 v3 @ 2.30GHz
	GCC Version: gcc (Ubuntu 7.3.0-16ubuntu3) 7.3.0
	Clang Version: 6.0.0-1ubuntu2 (tags/RELEASE_600/final)
	x86_64-native-linuxapp-clang
	x86_64-native-linuxapp-icc
	x86_64-native-linuxapp-gcc


OS: UB1604-32
	Kernel Version: 4.4.0-131-generic
	CPU info: Intel(R) Xeon(R) Platinum 8180 CPU @ 2.50GHz
	GCC Version: gcc (Ubuntu 5.4.0-6ubuntu1~16.04.11) 5.4.0 20160609
	Clang Version: 3.8.0-2ubuntu4 (tags/RELEASE_380/final)
	i686-native-linuxapp-gcc


OS: CENTOS77-64
	Kernel Version: 3.10.0-1062.9.1.el7.x86_64
	CPU info: Intel(R) Xeon(R) CPU E5-2699 v3 @ 2.30GHz
	GCC Version: gcc (GCC) 4.8.5 20150623 (Red Hat 4.8.5-39)
	Clang Version: 3.4.2 (tags/RELEASE_34/dot2-final)
	x86_64-native-linuxapp-gcc+debug
	x86_64-native-linuxapp-gcc
	x86_64-native-linuxapp-clang
	x86_64-native-linuxapp-gcc+shared
	x86_64-native-linuxapp-icc


OS: UB1604-64
	Kernel Version: 4.4.0-176-generic
	CPU info: Intel(R) Xeon(R) CPU E5-2699 v3 @ 2.30GHz
	GCC Version: gcc (Ubuntu 5.4.0-6ubuntu1~16.04.12) 5.4.0 20160609
	Clang Version: 3.8.0-2ubuntu4 (tags/RELEASE_380/final)
	x86_64-native-linuxapp-clang
	x86_64-native-linuxapp-gcc


OS: CENTOS80-64
	Kernel Version: 4.18.0-80.11.2.el8_0.x86_64
	CPU info: Intel(R) Xeon(R) CPU E5-2699 v3 @ 2.30GHz
	GCC Version: gcc (GCC) 8.2.1 20180905 (Red Hat 8.2.1-3)
	Clang Version: 7.0.1 (tags/RELEASE_701/final)
	x86_64-native-linuxapp-gcc


OS: UB1910-64
	Kernel Version: 5.3.0-18-generic
	CPU info: Intel(R) Xeon(R) Platinum 8180 CPU @ 2.50GHz
	GCC Version: gcc (Ubuntu 9.2.1-9ubuntu2) 9.2.1 20191008
	Clang Version: 9.0.0-2 (tags/RELEASE_900/final)
	x86_64-native-linuxapp-gcc


OS: FC31-64
	Kernel Version: 5.3.15-300.fc31.x86_64
	CPU info: Intel(R) Xeon(R) CPU E5-2699 v4 @ 2.20GHz
	GCC Version: gcc (GCC) 9.2.1 20190827 (Red Hat 9.2.1-1)
	Clang Version: 9.0.0 (Fedora 9.0.0-1.fc31)
	x86_64-native-linuxapp-gcc
	x86_64-native-linuxapp-clang


OS: RHEL80-64
	Kernel Version: 4.18.0-80.el8.x86_64
	CPU info: Intel(R) Xeon(R) CPU E5-2699 v4 @ 2.20GHz
	GCC Version: gcc (GCC) 8.2.1 20180905 (Red Hat 8.2.1-3)
	Clang Version: 6.0.1 (tags/RELEASE_601/final)
	x86_64-native-linuxapp-gcc


OS: FreeBSD1201-64
	Kernel Version: 12.1-RELEASE
	CPU info: Intel(R) Xeon(R) CPU E5-2699 v3 @ 2.30GHz (2294.74-MHz K8-class CPU)
	GCC Version: gcc (FreeBSD Ports Collection) 9.2.0
	Clang Version: 8.0.1 (tags/RELEASE_801/final 366581) (based on LLVM 8.0.1)
	x86_64-native-bsdapp-clang
	x86_64-native-bsdapp-gcc+debug
	x86_64-native-bsdapp-gcc+shared
	x86_64-native-bsdapp-gcc


OS: RHEL77-64
	Kernel Version: 3.10.0-1062.9.1.el7.x86_64
	CPU info: Intel(R) Xeon(R) CPU E5-2699 v4 @ 2.20GHz
	GCC Version: gcc (GCC) 4.8.5 20150623 (Red Hat 4.8.5-39)
	Clang Version: 3.4.2 (tags/RELEASE_34/dot2-final)
	x86_64-native-linuxapp-gcc


OS: SUSE15-64
	Kernel Version: 4.12.14-lp150.11-default
	CPU info: Intel(R) Xeon(R) CPU E5-2699 v4 @ 2.20GHz
	GCC Version: gcc (SUSE Linux) 7.3.1 20180323 [gcc-7-branch revision 258812]
	Clang Version: 5.0.1 (tags/RELEASE_501/final 312548)
	x86_64-native-linuxapp-clang
	x86_64-native-linuxapp-gcc


** Meson build **


OS: UB1804-64
	Kernel Version: 4.15.0-20-generic
	CPU info: Intel(R) Xeon(R) CPU E5-2699 v4 @ 2.20GHz
	GCC Version: gcc (Ubuntu 7.3.0-27ubuntu1~18.04) 7.3.0
	Clang Version: 6.0.0-1ubuntu2 (tags/RELEASE_600/final)
	x86_64-native-linuxapp-doc
	./build-gcc-static
	./build-gcc-shared
	./build-clang-static
	./build-clang-shared
	./build-x86-default


OS: UB1604-32
	Kernel Version: 4.4.0-131-generic
	CPU info: Intel(R) Xeon(R) CPU E5-2699 v4 @ 2.20GHz
	GCC Version: gcc (Ubuntu 5.4.0-6ubuntu1~16.04.11) 5.4.0 20160609
	Clang Version: 3.8.0-2ubuntu4 (tags/RELEASE_380/final)
	./build-gcc-static
	./build-gcc-shared
	./build-clang-static
	./build-clang-shared
	./build-x86-default


OS: CENTOS77-64
	Kernel Version: 3.10.0-1062.12.1.el7.x86_64
	CPU info: Intel(R) Xeon(R) CPU E5-2699 v4 @ 2.20GHz
	GCC Version: gcc (GCC) 4.8.5 20150623 (Red Hat 4.8.5-39)
	Clang Version: 3.4.2 (tags/RELEASE_34/dot2-final)
	./build-gcc-static
	./build-gcc-shared
	./build-clang-static
	./build-clang-shared
	./build-x86-default


OS: WIN10-64
	Kernel Version: N/A
	CPU info: N/A
	GCC Version: N/A
	Clang Version: Clang 8.0.0
	x86_64-windows-clang


OS: FC31-64
	Kernel Version: 5.4.18-200.fc31.x86_64
	CPU info: Intel(R) Xeon(R) CPU E5-2699 v4 @ 2.20GHz
	GCC Version: gcc (GCC) 9.2.1 20190827 (Red Hat 9.2.1-1)
	Clang Version: 9.0.0 (Fedora 9.0.0-1.fc31)
	./build-gcc-static
	./build-gcc-shared
	./build-clang-static
	./build-clang-shared
	./build-x86-default


OS: FreeBSD1201-64
	Kernel Version: 12.1-RELEASE
	CPU info: Intel(R) Xeon(R) CPU E5-2699 v4 @ 2.20GHz (2194.98-MHz K8-class CPU)
	GCC Version: gcc (FreeBSD Ports Collection) 9.2.0
	Clang Version: 8.0.1 (tags/RELEASE_801/final 366581) (based on LLVM 8.0.1)
	./build-gcc-static
	./build-gcc-shared
	./build-clang-static
	./build-clang-shared
	./build-x86-default


OS: SUSE15-64
	Kernel Version: 4.12.14-lp150.12.82-default
	CPU info: Intel(R) Xeon(R) CPU E5-2699 v4 @ 2.20GHz
	GCC Version: gcc (SUSE Linux) 7.4.1 20190905 [gcc-7-branch revision 275407]
	Clang Version: 5.0.1 (tags/RELEASE_501/final 312548)
	./build-gcc-static
	./build-gcc-shared
	./build-clang-static
	./build-clang-shared
	./build-x86-default


*Make Build Failed #1:
OS: UB1604-64
Target: x86_64-native-linuxapp-clang
        ^
/root/UB1604-64_K4.4.0_Clang3.8.0/x86_64-native-linuxapp-clang/a5e0a69a896e40569699a930d48f4d62/dpdk/x86_64-native-linuxapp-clang/include/rte_init.h:61:5: note: 'rte_init_register' has been explicitly marked deprecated here
int rte_init_register(rte_init_cb_t cb, const void *arg,
    ^
1 error generated.
/root/UB1604-64_K4.4.0_Clang3.8.0/x86_64-native-linuxapp-clang/a5e0a69a896e40569699a930d48f4d62/dpdk/mk/internal/rte.compile-pre.mk:114: recipe for target 'rte_reorder.o' failed
make[5]: *** [rte_reorder.o] Error 1
/root/UB1604-64_K4.4.0_Clang3.8.0/x86_64-native-linuxapp-clang/a5e0a69a896e40569699a930d48f4d62/dpdk/mk/rte.subdir.mk:35: recipe for target 'librte_reorder' failed
make[4]: *** [librte_reorder] Error 2
make[4]: *** Waiting for unfinished jobs....
  CC rte_arp.o
  AR librte_member.a
  INSTALL-LIB librte_member.a
  AR librte_cryptodev.a
--
  INSTALL-LIB librte_bbdev.a
  AR librte_compressdev.a
  INSTALL-LIB librte_compressdev.a
  AR librte_net.a
  INSTALL-LIB librte_net.a
/root/UB1604-64_K4.4.0_Clang3.8.0/x86_64-native-linuxapp-clang/a5e0a69a896e40569699a930d48f4d62/dpdk/mk/rte.sdkbuild.mk:46: recipe for target 'lib' failed
make[3]: *** [lib] Error 2
/root/UB1604-64_K4.4.0_Clang3.8.0/x86_64-native-linuxapp-clang/a5e0a69a896e40569699a930d48f4d62/dpdk/mk/rte.sdkroot.mk:98: recipe for target 'all' failed
make[2]: *** [all] Error 2
/root/UB1604-64_K4.4.0_Clang3.8.0/x86_64-native-linuxapp-clang/a5e0a69a896e40569699a930d48f4d62/dpdk/mk/rte.sdkinstall.mk:60: recipe for target 'pre_install' failed
make[1]: *** [pre_install] Error 2
/root/UB1604-64_K4.4.0_Clang3.8.0/x86_64-native-linuxapp-clang/a5e0a69a896e40569699a930d48f4d62/dpdk/mk/rte.sdkroot.mk:77: recipe for target 'install' failed
make: *** [install] Error 2


*Make Build Failed #2:
OS: UB1804-64
Target: x86_64-native-linuxapp-clang
^
/root/UB1804-64_K4.15.0_Clang6.0.0/x86_64-native-linuxapp-clang/a5e0a69a896e40569699a930d48f4d62/dpdk/x86_64-native-linuxapp-clang/include/rte_compat.h:12:16: note: expanded from macro '__rte_experimental'
__attribute__((deprecated("Symbol is not yet part of stable ABI"), \
               ^
1 error generated.
/root/UB1804-64_K4.15.0_Clang6.0.0/x86_64-native-linuxapp-clang/a5e0a69a896e40569699a930d48f4d62/dpdk/mk/internal/rte.compile-pre.mk:114: recipe for target 'rte_reorder.o' failed
make[5]: *** [rte_reorder.o] Error 1
/root/UB1804-64_K4.15.0_Clang6.0.0/x86_64-native-linuxapp-clang/a5e0a69a896e40569699a930d48f4d62/dpdk/mk/rte.subdir.mk:35: recipe for target 'librte_reorder' failed
make[4]: *** [librte_reorder] Error 2
make[4]: *** Waiting for unfinished jobs....
  CC rte_arp.o
  AR librte_net.a
  INSTALL-LIB librte_net.a
  AR librte_compressdev.a
  INSTALL-LIB librte_compressdev.a
  AR librte_bbdev.a
  INSTALL-LIB librte_bbdev.a
  AR librte_cryptodev.a
  INSTALL-LIB librte_cryptodev.a
/root/UB1804-64_K4.15.0_Clang6.0.0/x86_64-native-linuxapp-clang/a5e0a69a896e40569699a930d48f4d62/dpdk/mk/rte.sdkbuild.mk:46: recipe for target 'lib' failed
make[3]: *** [lib] Error 2
/root/UB1804-64_K4.15.0_Clang6.0.0/x86_64-native-linuxapp-clang/a5e0a69a896e40569699a930d48f4d62/dpdk/mk/rte.sdkroot.mk:98: recipe for target 'all' failed
make[2]: *** [all] Error 2
/root/UB1804-64_K4.15.0_Clang6.0.0/x86_64-native-linuxapp-clang/a5e0a69a896e40569699a930d48f4d62/dpdk/mk/rte.sdkinstall.mk:60: recipe for target 'pre_install' failed
make[1]: *** [pre_install] Error 2
/root/UB1804-64_K4.15.0_Clang6.0.0/x86_64-native-linuxapp-clang/a5e0a69a896e40569699a930d48f4d62/dpdk/mk/rte.sdkroot.mk:77: recipe for target 'install' failed
make: *** [install] Error 2


*Make Build Failed #3:
OS: CENTOS77-64
Target: x86_64-native-linuxapp-gcc+debug
  ^
/root/CENTOS77-64_K3.10.0_GCC4.8.5/x86_64-native-linuxapp-gcc+debug/a5e0a69a896e40569699a930d48f4d62/dpdk/lib/librte_reorder/rte_reorder.c: At top level:
cc1: error: unrecognized command line option "-Wno-address-of-packed-member" [-Werror]
cc1: all warnings being treated as errors
  CC rte_bbdev.o
make[5]: *** [rte_reorder.o] Error 1
make[4]: *** [librte_reorder] Error 2
make[4]: *** Waiting for unfinished jobs....
  SYMLINK-FILE include/rte_esp.h
  SYMLINK-FILE include/rte_compressdev.h
  SYMLINK-FILE include/rte_sctp.h
  CC rte_lpm6.o
--
  AR librte_compressdev.a
  INSTALL-LIB librte_fib.a
  INSTALL-LIB librte_compressdev.a
  AR librte_net.a
  INSTALL-LIB librte_net.a
make[3]: *** [lib] Error 2
make[2]: *** [all] Error 2
make[1]: *** [pre_install] Error 2
make: *** [install] Error 2


*Make Build Failed #4:
OS: CENTOS77-64
Target: x86_64-native-linuxapp-gcc
  INSTALL-LIB librte_efd.a
  SYMLINK-FILE include/rte_bbdev_pmd.h
/root/CENTOS77-64_K3.10.0_GCC4.8.5/x86_64-native-linuxapp-gcc/a5e0a69a896e40569699a930d48f4d62/dpdk/lib/librte_reorder/rte_reorder.c: At top level:
cc1: error: unrecognized command line option "-Wno-address-of-packed-member" [-Werror]
cc1: all warnings being treated as errors
make[5]: *** [rte_reorder.o] Error 1
make[4]: *** [librte_reorder] Error 2
make[4]: *** Waiting for unfinished jobs....
  SYMLINK-FILE include/rte_crypto_sym.h
  SYMLINK-FILE include/rte_cryptodev.h
  AR librte_member.a
  SYMLINK-FILE include/rte_esp.h
--
  INSTALL-LIB librte_compressdev.a
  AR librte_net.a
  INSTALL-LIB librte_net.a
  AR librte_cryptodev.a
  INSTALL-LIB librte_cryptodev.a
make[3]: *** [lib] Error 2
make[2]: *** [all] Error 2
make[1]: *** [pre_install] Error 2
make: *** [install] Error 2


*Make Build Failed #5:
OS: CENTOS77-64
Target: x86_64-native-linuxapp-clang
        ^
/root/CENTOS77-64_K3.10.0_Clang3.4.2/x86_64-native-linuxapp-clang/a5e0a69a896e40569699a930d48f4d62/dpdk/x86_64-native-linuxapp-clang/include/rte_init.h:61:5: note: 'rte_init_register' declared here
int rte_init_register(rte_init_cb_t cb, const void *arg,
    ^
1 error generated.
make[5]: *** [rte_reorder.o] Error 1
make[4]: *** [librte_reorder] Error 2
make[4]: *** Waiting for unfinished jobs....
  CC rte_comp.o
  SYMLINK-FILE include/rte_arp.h
  SYMLINK-FILE include/rte_ether.h
  SYMLINK-FILE include/rte_gre.h
--
  AR librte_fib.a
  INSTALL-LIB librte_net.a
  INSTALL-LIB librte_fib.a
  AR librte_compressdev.a
  INSTALL-LIB librte_compressdev.a
make[3]: *** [lib] Error 2
make[2]: *** [all] Error 2
make[1]: *** [pre_install] Error 2
make: *** [install] Error 2


*Make Build Failed #6:
OS: CENTOS77-64
Target: x86_64-native-linuxapp-gcc+shared
  SYMLINK-FILE include/rte_tcp.h
  SYMLINK-FILE include/rte_bbdev.h
/root/CENTOS77-64_K3.10.0_GCC4.8.5/x86_64-native-linuxapp-gcc+shared/a5e0a69a896e40569699a930d48f4d62/dpdk/lib/librte_reorder/rte_reorder.c: At top level:
cc1: error: unrecognized command line option "-Wno-address-of-packed-member" [-Werror]
cc1: all warnings being treated as errors
make[5]: *** [rte_reorder.o] Error 1
make[4]: *** [librte_reorder] Error 2
make[4]: *** Waiting for unfinished jobs....
  SYMLINK-FILE include/rte_comp.h
  SYMLINK-FILE include/rte_bbdev_pmd.h
  SYMLINK-FILE include/rte_udp.h
  SYMLINK-FILE include/rte_esp.h
--
  INSTALL-LIB librte_compressdev.so.0.200.2
  INSTALL-LIB librte_member.so.20.0.2
  INSTALL-LIB librte_bbdev.so.0.200.2
  LD librte_fib.so.0.200.2
  INSTALL-LIB librte_fib.so.0.200.2
make[3]: *** [lib] Error 2
make[2]: *** [all] Error 2
make[1]: *** [pre_install] Error 2
make: *** [install] Error 2


*Make Build Failed #7:
OS: CENTOS80-64
Target: x86_64-native-linuxapp-gcc
/root/CENTOS80-64_K4.18.0_GCC8.2.1/x86_64-native-linuxapp-gcc/a5e0a69a896e40569699a930d48f4d62/dpdk/lib/librte_reorder/rte_reorder.c: At top level:
cc1: error: unrecognized command line option ‘-Wno-address-of-packed-member’ [-Werror]
cc1: all warnings being treated as errors
  SYMLINK-FILE include/rte_vxlan.h
  CC rte_net.o
make[5]: *** [/root/CENTOS80-64_K4.18.0_GCC8.2.1/x86_64-native-linuxapp-gcc/a5e0a69a896e40569699a930d48f4d62/dpdk/mk/internal/rte.compile-pre.mk:116: rte_reorder.o] Error 1
make[4]: *** [/root/CENTOS80-64_K4.18.0_GCC8.2.1/x86_64-native-linuxapp-gcc/a5e0a69a896e40569699a930d48f4d62/dpdk/mk/rte.subdir.mk:37: librte_reorder] Error 2
make[4]: *** Waiting for unfinished jobs....
  INSTALL-LIB librte_fib.a
  CC rte_net_crc.o
  CC rte_ether.o
  CC rte_arp.o
--
  INSTALL-LIB librte_cryptodev.a
  AR librte_net.a
  INSTALL-LIB librte_net.a
  AR librte_compressdev.a
  INSTALL-LIB librte_compressdev.a
make[3]: *** [/root/CENTOS80-64_K4.18.0_GCC8.2.1/x86_64-native-linuxapp-gcc/a5e0a69a896e40569699a930d48f4d62/dpdk/mk/rte.sdkbuild.mk:48: lib] Error 2
make[2]: *** [/root/CENTOS80-64_K4.18.0_GCC8.2.1/x86_64-native-linuxapp-gcc/a5e0a69a896e40569699a930d48f4d62/dpdk/mk/rte.sdkroot.mk:99: all] Error 2
make[1]: *** [/root/CENTOS80-64_K4.18.0_GCC8.2.1/x86_64-native-linuxapp-gcc/a5e0a69a896e40569699a930d48f4d62/dpdk/mk/rte.sdkinstall.mk:61: pre_install] Error 2
make: *** [/root/CENTOS80-64_K4.18.0_GCC8.2.1/x86_64-native-linuxapp-gcc/a5e0a69a896e40569699a930d48f4d62/dpdk/mk/rte.sdkroot.mk:77: install] Error 2


*Make Build Failed #8:
OS: CENTOS77-64
Target: x86_64-native-linuxapp-icc
  	^

  LD bbdev_null.o
  CC otx_cryptodev_capabilities.o
compilation aborted for /root/CENTOS77-64_K3.10.0_ICC19.0.0/x86_64-native-linuxapp-icc/a5e0a69a896e40569699a930d48f4d62/dpdk/drivers/net/ark/ark_ethdev.c (code 2)
make[6]: *** [ark_ethdev.o] Error 2
  CC otx2_cryptodev_capabilities.o
make[5]: *** [ark] Error 2
make[5]: *** Waiting for unfinished jobs....
  PMDINFO ifcvf_vdpa.o.pmd.c
  CC ifcvf_vdpa.o.pmd.o
  CC ifcvf.o
  AR librte_pmd_bbdev_null.a
--
  CC otx_cryptodev_mbox.o
  LD rte_eth_af_packet.o
  AR librte_pmd_af_packet.a
  AR librte_pmd_isal_comp.a
  INSTALL-LIB librte_pmd_af_packet.a
make[4]: *** [net] Error 2
make[4]: *** Waiting for unfinished jobs....
  CC rte_aesni_mb_pmd_ops.o
  INSTALL-LIB librte_pmd_isal_comp.a
== Build drivers/compress/octeontx
  CC qat_device.o
--
  INSTALL-LIB librte_pmd_dpaa2_sec.a
  AR librte_pmd_octeontx2_crypto.a
  INSTALL-LIB librte_pmd_octeontx2_crypto.a
  AR librte_pmd_octeontx_crypto.a
  INSTALL-LIB librte_pmd_octeontx_crypto.a
make[3]: *** [drivers] Error 2
make[2]: *** [all] Error 2
make[1]: *** [pre_install] Error 2
make: *** [install] Error 2


*Make Build Failed #9:
OS: FreeBSD1201-64
Target: x86_64-native-bsdapp-clang
/root/FreeBSD1201-64_K12.1_Clang8.0.1/x86_64-native-bsdapp-clang/a5e0a69a896e40569699a930d48f4d62/dpdk/x86_64-native-bsdapp-clang/include/rte_compat.h:12:16: note: expanded from macro '__rte_experimental'
__attribute__((deprecated("Symbol is not yet part of stable ABI"), \
               ^
1 error  SYMLINK-FILE include/rte_sctp.h
 generated.
gmake[5]: *** [/root/FreeBSD1201-64_K12.1_Clang8.0.1/x86_64-native-bsdapp-clang/a5e0a69a896e40569699a930d48f4d62/dpdk/mk/internal/rte.compile-pre.mk:116: rte_reorder.o] Error 1
  CC rte_member_vbf.o
gmake[4]: *** [/root/FreeBSD1201-64_K12.1_Clang8.0.1/x86_64-native-bsdapp-clang/a5e0a69a896e40569699a930d48f4d62/dpdk/mk/rte.subdir.mk:37: librte_reorder] Error 2
gmake[4]: *** Waiting for unfinished jobs....
  SYMLINK-FILE include/rte_compressdev_pmd.h
  CC rte_cryptodev_pmd.o
  INSTALL-LIB librte_fib.a
  AR librte_lpm.a
--
  INSTALL-LIB librte_compressdev.a
  AR librte_bbdev.a
  INSTALL-LIB librte_bbdev.a
  AR librte_net.a
  INSTALL-LIB librte_net.a
gmake[3]: *** [/root/FreeBSD1201-64_K12.1_Clang8.0.1/x86_64-native-bsdapp-clang/a5e0a69a896e40569699a930d48f4d62/dpdk/mk/rte.sdkbuild.mk:48: lib] Error 2
gmake[2]: *** [/root/FreeBSD1201-64_K12.1_Clang8.0.1/x86_64-native-bsdapp-clang/a5e0a69a896e40569699a930d48f4d62/dpdk/mk/rte.sdkroot.mk:99: all] Error 2
gmake[1]: *** [/root/FreeBSD1201-64_K12.1_Clang8.0.1/x86_64-native-bsdapp-clang/a5e0a69a896e40569699a930d48f4d62/dpdk/mk/rte.sdkinstall.mk:61: pre_install] Error 2
gmake: *** [/root/FreeBSD1201-64_K12.1_Clang8.0.1/x86_64-native-bsdapp-clang/a5e0a69a896e40569699a930d48f4d62/dpdk/mk/rte.sdkroot.mk:77: install] Error 2


*Make Build Failed #10:
OS: FreeBSD1201-64
Target: x86_64-native-bsdapp-gcc+debug
/root/FreeBSD1201-64_K12.1_GCC7.3.0/x86_64-native-bsdapp-gcc+debug/a5e0a69a896e40569699a930d48f4d62/dpdk/x86_64-native-bsdapp-gcc/include/rte_init.h:61:5: note: declared here
   61 | int rte_init_register(rte_init_cb_t cb, const void *arg,
      |     ^~~~~~~~~~~~~~~~~
  CC rte_cryptodev.o
cc1: all warnings being treated as errors
gmake[5]: *** [/root/FreeBSD1201-64_K12.1_GCC7.3.0/x86_64-native-bsdapp-gcc+debug/a5e0a69a896e40569699a930d48f4d62/dpdk/mk/internal/rte.compile-pre.mk:116: rte_reorder.o] Error 1
gmake[4]: *** [/root/FreeBSD1201-64_K12.1_GCC7.3.0/x86_64-native-bsdapp-gcc+debug/a5e0a69a896e40569699a930d48f4d62/dpdk/mk/rte.subdir.mk:37: librte_reorder] Error 2
gmake[4]: *** Waiting for unfinished jobs....
  SYMLINK-FILE include/rte_arp.h
  CC rte_compressdev_pmd.o
  SYMLINK-FILE include/rte_efd.h
  CC rte_cryptodev_pmd.o
--
  INSTALL-LIB librte_net.a
  AR librte_lpm.a
  INSTALL-LIB librte_lpm.a
  AR librte_compressdev.a
  INSTALL-LIB librte_compressdev.a
gmake[3]: *** [/root/FreeBSD1201-64_K12.1_GCC7.3.0/x86_64-native-bsdapp-gcc+debug/a5e0a69a896e40569699a930d48f4d62/dpdk/mk/rte.sdkbuild.mk:48: lib] Error 2
gmake[2]: *** [/root/FreeBSD1201-64_K12.1_GCC7.3.0/x86_64-native-bsdapp-gcc+debug/a5e0a69a896e40569699a930d48f4d62/dpdk/mk/rte.sdkroot.mk:99: all] Error 2
gmake[1]: *** [/root/FreeBSD1201-64_K12.1_GCC7.3.0/x86_64-native-bsdapp-gcc+debug/a5e0a69a896e40569699a930d48f4d62/dpdk/mk/rte.sdkinstall.mk:61: pre_install] Error 2
gmake: *** [/root/FreeBSD1201-64_K12.1_GCC7.3.0/x86_64-native-bsdapp-gcc+debug/a5e0a69a896e40569699a930d48f4d62/dpdk/mk/rte.sdkroot.mk:77: install] Error 2


*Make Build Failed #11:
OS: FreeBSD1201-64
Target: x86_64-native-bsdapp-gcc+shared
  SYMLINK-FILE include/rte_mpls.h
  SYMLINK-FILE include/rte_crypto_asym.h
  SYMLINK-FILE include/rte_higig.h
  SYMLINK-FILE include/rte_gtp.h
cc1: all warnings being treated as errors
gmake[5]: *** [/root/FreeBSD1201-64_K12.1_GCC7.3.0/x86_64-native-bsdapp-gcc+shared/a5e0a69a896e40569699a930d48f4d62/dpdk/mk/internal/rte.compile-pre.mk:116: rte_reorder.o] Error 1
gmake[4]: *** [/root/FreeBSD1201-64_K12.1_GCC7.3.0/x86_64-native-bsdapp-gcc+shared/a5e0a69a896e40569699a930d48f4d62/dpdk/mk/rte.subdir.mk:37: librte_reorder] Error 2
gmake[4]: *** Waiting for unfinished jobs....
  CC rte_cryptodev.o
  SYMLINK-FILE include/rte_vxlan.h
  CC rte_comp.o
  CC rte_net.o
--
  INSTALL-LIB librte_efd.so.20.0.2
  LD librte_fib.so.0.200.2
  INSTALL-LIB librte_fib.so.0.200.2
  LD librte_lpm.so.20.0.2
  INSTALL-LIB librte_lpm.so.20.0.2
gmake[3]: *** [/root/FreeBSD1201-64_K12.1_GCC7.3.0/x86_64-native-bsdapp-gcc+shared/a5e0a69a896e40569699a930d48f4d62/dpdk/mk/rte.sdkbuild.mk:48: lib] Error 2
gmake[2]: *** [/root/FreeBSD1201-64_K12.1_GCC7.3.0/x86_64-native-bsdapp-gcc+shared/a5e0a69a896e40569699a930d48f4d62/dpdk/mk/rte.sdkroot.mk:99: all] Error 2
gmake[1]: *** [/root/FreeBSD1201-64_K12.1_GCC7.3.0/x86_64-native-bsdapp-gcc+shared/a5e0a69a896e40569699a930d48f4d62/dpdk/mk/rte.sdkinstall.mk:61: pre_install] Error 2
gmake: *** [/root/FreeBSD1201-64_K12.1_GCC7.3.0/x86_64-native-bsdapp-gcc+shared/a5e0a69a896e40569699a930d48f4d62/dpdk/mk/rte.sdkroot.mk:77: install] Error 2


*Make Build Failed #12:
OS: FreeBSD1201-64
Target: x86_64-native-bsdapp-gcc
/root/FreeBSD1201-64_K12.1_GCC9.2.0/x86_64-native-bsdapp-gcc/a5e0a69a896e40569699a930d48f4d62/dpdk/x86_64-native-bsdapp-gcc/include/rte_init.h:61:5: note: declared here
   61 | int rte_init_register(rte_init_cb_t cb, const void *arg,
      |     ^~~~~~~~~~~~~~~~~
  SYMLINK-FILE include/rte_crypto_asym.h
cc1: all warnings being treated as errors
gmake[5]: *** [/root/FreeBSD1201-64_K12.1_GCC9.2.0/x86_64-native-bsdapp-gcc/a5e0a69a896e40569699a930d48f4d62/dpdk/mk/internal/rte.compile-pre.mk:116: rte_reorder.o] Error 1
gmake[4]: *** [/root/FreeBSD1201-64_K12.1_GCC9.2.0/x86_64-native-bsdapp-gcc/a5e0a69a896e40569699a930d48f4d62/dpdk/mk/rte.subdir.mk:37: librte_reorder] Error 2
gmake[4]: *** Waiting for unfinished jobs....
  CC rte_comp.o
  CC rte_cryptodev.o
  SYMLINK-FILE include/rte_net.h
  SYMLINK-FILE include/rte_net_crc.h
--
  INSTALL-LIB librte_cryptodev.a
  AR librte_net.a
  INSTALL-LIB librte_net.a
  AR librte_fib.a
  INSTALL-LIB librte_fib.a
gmake[3]: *** [/root/FreeBSD1201-64_K12.1_GCC9.2.0/x86_64-native-bsdapp-gcc/a5e0a69a896e40569699a930d48f4d62/dpdk/mk/rte.sdkbuild.mk:48: lib] Error 2
gmake[2]: *** [/root/FreeBSD1201-64_K12.1_GCC9.2.0/x86_64-native-bsdapp-gcc/a5e0a69a896e40569699a930d48f4d62/dpdk/mk/rte.sdkroot.mk:99: all] Error 2
gmake[1]: *** [/root/FreeBSD1201-64_K12.1_GCC9.2.0/x86_64-native-bsdapp-gcc/a5e0a69a896e40569699a930d48f4d62/dpdk/mk/rte.sdkinstall.mk:61: pre_install] Error 2
gmake: *** [/root/FreeBSD1201-64_K12.1_GCC9.2.0/x86_64-native-bsdapp-gcc/a5e0a69a896e40569699a930d48f4d62/dpdk/mk/rte.sdkroot.mk:77: install] Error 2


*Make Build Failed #13:
OS: UB1604-32
Target: i686-native-linuxapp-gcc
  SYMLINK-FILE include/rte_arp.h
  SYMLINK-FILE include/rte_lpm.h
/root/UB1604-32_K4.4.0_GCC5.4.0/i686-native-linuxapp-gcc/a5e0a69a896e40569699a930d48f4d62/dpdk/lib/librte_reorder/rte_reorder.c: At top level:
cc1: error: unrecognized command line option ‘-Wno-address-of-packed-member’ [-Werror]
cc1: all warnings being treated as errors
/root/UB1604-32_K4.4.0_GCC5.4.0/i686-native-linuxapp-gcc/a5e0a69a896e40569699a930d48f4d62/dpdk/mk/internal/rte.compile-pre.mk:114: recipe for target 'rte_reorder.o' failed
make[5]: *** [rte_reorder.o] Error 1
/root/UB1604-32_K4.4.0_GCC5.4.0/i686-native-linuxapp-gcc/a5e0a69a896e40569699a930d48f4d62/dpdk/mk/rte.subdir.mk:35: recipe for target 'librte_reorder' failed
make[4]: *** [librte_reorder] Error 2
make[4]: *** Waiting for unfinished jobs....
  SYMLINK-FILE include/rte_ether.h
  CC rte_member_ht.o
  CC dir24_8.o
  SYMLINK-FILE include/rte_lpm6.h
--
  INSTALL-LIB librte_cryptodev.a
  AR librte_lpm.a
  INSTALL-LIB librte_lpm.a
  AR librte_compressdev.a
  INSTALL-LIB librte_compressdev.a
/root/UB1604-32_K4.4.0_GCC5.4.0/i686-native-linuxapp-gcc/a5e0a69a896e40569699a930d48f4d62/dpdk/mk/rte.sdkbuild.mk:46: recipe for target 'lib' failed
make[3]: *** [lib] Error 2
/root/UB1604-32_K4.4.0_GCC5.4.0/i686-native-linuxapp-gcc/a5e0a69a896e40569699a930d48f4d62/dpdk/mk/rte.sdkroot.mk:98: recipe for target 'all' failed
make[2]: *** [all] Error 2
/root/UB1604-32_K4.4.0_GCC5.4.0/i686-native-linuxapp-gcc/a5e0a69a896e40569699a930d48f4d62/dpdk/mk/rte.sdkinstall.mk:60: recipe for target 'pre_install' failed
make[1]: *** [pre_install] Error 2
/root/UB1604-32_K4.4.0_GCC5.4.0/i686-native-linuxapp-gcc/a5e0a69a896e40569699a930d48f4d62/dpdk/mk/rte.sdkroot.mk:77: recipe for target 'install' failed
make: *** [install] Error 2


*Make Build Failed #14:
OS: SUSE15-64
Target: x86_64-native-linuxapp-clang
__attribute__((deprecated("Symbol is not yet part of stable ABI"), \
               ^
1 error generated.
  SYMLINK-FILE include/rte_vxlan.h
  CC rte_net.o
make[5]: *** [/root/SUSE15-64_K4.12.14_Clang5.0.1/x86_64-native-linuxapp-clang/a5e0a69a896e40569699a930d48f4d62/dpdk/mk/internal/rte.compile-pre.mk:116: rte_reorder.o] Error 1
make[5]: *** Waiting for unfinished jobs....
make[4]: *** [/root/SUSE15-64_K4.12.14_Clang5.0.1/x86_64-native-linuxapp-clang/a5e0a69a896e40569699a930d48f4d62/dpdk/mk/rte.subdir.mk:37: librte_reorder] Error 2
make[4]: *** Waiting for unfinished jobs....
== Build lib/librte_member
  CC rte_net_crc.o
  SYMLINK-FILE include/rte_lpm.h
  SYMLINK-FILE include/rte_lpm6.h
--
  INSTALL-LIB librte_lpm.a
  AR librte_compressdev.a
  INSTALL-LIB librte_compressdev.a
  AR librte_net.a
  INSTALL-LIB librte_net.a
make[3]: *** [/root/SUSE15-64_K4.12.14_Clang5.0.1/x86_64-native-linuxapp-clang/a5e0a69a896e40569699a930d48f4d62/dpdk/mk/rte.sdkbuild.mk:48: lib] Error 2
make[2]: *** [/root/SUSE15-64_K4.12.14_Clang5.0.1/x86_64-native-linuxapp-clang/a5e0a69a896e40569699a930d48f4d62/dpdk/mk/rte.sdkroot.mk:99: all] Error 2
make[1]: *** [/root/SUSE15-64_K4.12.14_Clang5.0.1/x86_64-native-linuxapp-clang/a5e0a69a896e40569699a930d48f4d62/dpdk/mk/rte.sdkinstall.mk:61: pre_install] Error 2
make: *** [/root/SUSE15-64_K4.12.14_Clang5.0.1/x86_64-native-linuxapp-clang/a5e0a69a896e40569699a930d48f4d62/dpdk/mk/rte.sdkroot.mk:77: install] Error 2


*Make Build Failed #15:
OS: RHEL77-64
Target: x86_64-native-linuxapp-gcc
  ^
  SYMLINK-FILE include/rte_fib6.h
/root/RHEL77-64_K3.10.0_GCC4.8.5/x86_64-native-linuxapp-gcc/a5e0a69a896e40569699a930d48f4d62/dpdk/lib/librte_reorder/rte_reorder.c: At top level:
cc1: error: unrecognized command line option "-Wno-address-of-packed-member" [-Werror]
cc1: all warnings being treated as errors
make[5]: *** [rte_reorder.o] Error 1
make[4]: *** [librte_reorder] Error 2
make[4]: *** Waiting for unfinished jobs....
  SYMLINK-FILE include/rte_icmp.h
  CC rte_fib.o
  CC rte_fib6.o
  SYMLINK-FILE include/rte_arp.h
--
  INSTALL-LIB librte_net.a
  AR librte_member.a
  INSTALL-LIB librte_member.a
  AR librte_lpm.a
  INSTALL-LIB librte_lpm.a
make[3]: *** [lib] Error 2
make[2]: *** [all] Error 2
make[1]: *** [pre_install] Error 2
make: *** [install] Error 2


*Make Build Failed #16:
OS: RHEL80-64
Target: x86_64-native-linuxapp-gcc
== Build lib/librte_member
  CC rte_comp.o
/root/RHEL80-64_K3.10.0_GCC8.2.1/x86_64-native-linuxapp-gcc/a5e0a69a896e40569699a930d48f4d62/dpdk/lib/librte_reorder/rte_reorder.c: At top level:
cc1: error: unrecognized command line option ‘-Wno-address-of-packed-member’ [-Werror]
cc1: all warnings being treated as errors
make[5]: *** [/root/RHEL80-64_K3.10.0_GCC8.2.1/x86_64-native-linuxapp-gcc/a5e0a69a896e40569699a930d48f4d62/dpdk/mk/internal/rte.compile-pre.mk:116: rte_reorder.o] Error 1
make[4]: *** [/root/RHEL80-64_K3.10.0_GCC8.2.1/x86_64-native-linuxapp-gcc/a5e0a69a896e40569699a930d48f4d62/dpdk/mk/rte.subdir.mk:37: librte_reorder] Error 2
make[4]: *** Waiting for unfinished jobs....
  CC rte_net_crc.o
  CC rte_ether.o
  SYMLINK-FILE include/rte_lpm.h
  SYMLINK-FILE include/rte_lpm6.h
--
  INSTALL-LIB librte_net.a
  AR librte_lpm.a
  INSTALL-LIB librte_lpm.a
  AR librte_member.a
  INSTALL-LIB librte_member.a
make[3]: *** [/root/RHEL80-64_K3.10.0_GCC8.2.1/x86_64-native-linuxapp-gcc/a5e0a69a896e40569699a930d48f4d62/dpdk/mk/rte.sdkbuild.mk:48: lib] Error 2
make[2]: *** [/root/RHEL80-64_K3.10.0_GCC8.2.1/x86_64-native-linuxapp-gcc/a5e0a69a896e40569699a930d48f4d62/dpdk/mk/rte.sdkroot.mk:99: all] Error 2
make[1]: *** [/root/RHEL80-64_K3.10.0_GCC8.2.1/x86_64-native-linuxapp-gcc/a5e0a69a896e40569699a930d48f4d62/dpdk/mk/rte.sdkinstall.mk:61: pre_install] Error 2
make: *** [/root/RHEL80-64_K3.10.0_GCC8.2.1/x86_64-native-linuxapp-gcc/a5e0a69a896e40569699a930d48f4d62/dpdk/mk/rte.sdkroot.mk:77: install] Error 2


*Make Build Failed #17:
OS: FC31-64
Target: x86_64-native-linuxapp-gcc
  SYMLINK-FILE include/rte_gtp.h
  SYMLINK-FILE include/rte_vxlan.h
  CC rte_member_ht.o
  CC rte_net.o
cc1: all warnings being treated as errors
make[5]: *** [/root/FC31-64_K5.3.14_GCC9.2.1/x86_64-native-linuxapp-gcc/a5e0a69a896e40569699a930d48f4d62/dpdk/mk/internal/rte.compile-pre.mk:116: rte_reorder.o] Error 1
make[4]: *** [/root/FC31-64_K5.3.14_GCC9.2.1/x86_64-native-linuxapp-gcc/a5e0a69a896e40569699a930d48f4d62/dpdk/mk/rte.subdir.mk:37: librte_reorder] Error 2
make[4]: *** Waiting for unfinished jobs....
  CC rte_net_crc.o
  CC dir24_8.o
  CC trie.o
  AR librte_lpm.a
--
  INSTALL-LIB librte_net.a
  AR librte_cryptodev.a
  INSTALL-LIB librte_cryptodev.a
  AR librte_compressdev.a
  INSTALL-LIB librte_compressdev.a
make[3]: *** [/root/FC31-64_K5.3.14_GCC9.2.1/x86_64-native-linuxapp-gcc/a5e0a69a896e40569699a930d48f4d62/dpdk/mk/rte.sdkbuild.mk:48: lib] Error 2
make[2]: *** [/root/FC31-64_K5.3.14_GCC9.2.1/x86_64-native-linuxapp-gcc/a5e0a69a896e40569699a930d48f4d62/dpdk/mk/rte.sdkroot.mk:99: all] Error 2
make[1]: *** [/root/FC31-64_K5.3.14_GCC9.2.1/x86_64-native-linuxapp-gcc/a5e0a69a896e40569699a930d48f4d62/dpdk/mk/rte.sdkinstall.mk:61: pre_install] Error 2
make: *** [/root/FC31-64_K5.3.14_GCC9.2.1/x86_64-native-linuxapp-gcc/a5e0a69a896e40569699a930d48f4d62/dpdk/mk/rte.sdkroot.mk:77: install] Error 2


*Make Build Failed #18:
OS: SUSE15-64
Target: x86_64-native-linuxapp-gcc
  CC rte_comp.o
  SYMLINK-FILE include/rte_gtp.h
/root/SUSE15-64_K4.12.14_GCC7.3.1/x86_64-native-linuxapp-gcc/a5e0a69a896e40569699a930d48f4d62/dpdk/lib/librte_reorder/rte_reorder.c: At top level:
cc1: error: unrecognized command line option ‘-Wno-address-of-packed-member’ [-Werror]
cc1: all warnings being treated as errors
make[5]: *** [/root/SUSE15-64_K4.12.14_GCC7.3.1/x86_64-native-linuxapp-gcc/a5e0a69a896e40569699a930d48f4d62/dpdk/mk/internal/rte.compile-pre.mk:116: rte_reorder.o] Error 1
make[4]: *** [/root/SUSE15-64_K4.12.14_GCC7.3.1/x86_64-native-linuxapp-gcc/a5e0a69a896e40569699a930d48f4d62/dpdk/mk/rte.subdir.mk:35: librte_reorder] Error 2
make[4]: *** Waiting for unfinished jobs....
  SYMLINK-FILE include/rte_vxlan.h
  CC rte_net.o
  CC rte_net_crc.o
  CC rte_ether.o
--
  INSTALL-LIB librte_compressdev.a
  AR librte_cryptodev.a
  INSTALL-LIB librte_cryptodev.a
  AR librte_net.a
  INSTALL-LIB librte_net.a
make[3]: *** [/root/SUSE15-64_K4.12.14_GCC7.3.1/x86_64-native-linuxapp-gcc/a5e0a69a896e40569699a930d48f4d62/dpdk/mk/rte.sdkbuild.mk:48: lib] Error 2
make[2]: *** [/root/SUSE15-64_K4.12.14_GCC7.3.1/x86_64-native-linuxapp-gcc/a5e0a69a896e40569699a930d48f4d62/dpdk/mk/rte.sdkroot.mk:99: all] Error 2
make[1]: *** [/root/SUSE15-64_K4.12.14_GCC7.3.1/x86_64-native-linuxapp-gcc/a5e0a69a896e40569699a930d48f4d62/dpdk/mk/rte.sdkinstall.mk:61: pre_install] Error 2
make: *** [/root/SUSE15-64_K4.12.14_GCC7.3.1/x86_64-native-linuxapp-gcc/a5e0a69a896e40569699a930d48f4d62/dpdk/mk/rte.sdkroot.mk:77: install] Error 2


*Make Build Failed #19:
OS: FC31-64
Target: x86_64-native-linuxapp-clang
^
/root/FC31-64_K5.3.14_Clang9.0.0/x86_64-native-linuxapp-clang/a5e0a69a896e40569699a930d48f4d62/dpdk/x86_64-native-linuxapp-clang/include/rte_compat.h:12:16: note: expanded from macro '__rte_experimental'
__attribute__((deprecated("Symbol is not yet part of stable ABI"), \
               ^
1 error generated.
make[5]: *** [/root/FC31-64_K5.3.14_Clang9.0.0/x86_64-native-linuxapp-clang/a5e0a69a896e40569699a930d48f4d62/dpdk/mk/internal/rte.compile-pre.mk:116: rte_reorder.o] Error 1
  CC rte_net.o
  CC rte_net_crc.o
  AR librte_fib.a
  INSTALL-LIB librte_fib.a
make[4]: *** [/root/FC31-64_K5.3.14_Clang9.0.0/x86_64-native-linuxapp-clang/a5e0a69a896e40569699a930d48f4d62/dpdk/mk/rte.subdir.mk:35: librte_reorder] Error 2
make[4]: *** Waiting for unfinished jobs....
  CC rte_ether.o
== Build lib/librte_efd
  CC rte_arp.o
  AR librte_compressdev.a
--
  INSTALL-LIB librte_compressdev.a
  AR librte_net.a
  INSTALL-LIB librte_net.a
  AR librte_efd.a
  INSTALL-LIB librte_efd.a
make[3]: *** [/root/FC31-64_K5.3.14_Clang9.0.0/x86_64-native-linuxapp-clang/a5e0a69a896e40569699a930d48f4d62/dpdk/mk/rte.sdkbuild.mk:48: lib] Error 2
make[2]: *** [/root/FC31-64_K5.3.14_Clang9.0.0/x86_64-native-linuxapp-clang/a5e0a69a896e40569699a930d48f4d62/dpdk/mk/rte.sdkroot.mk:99: all] Error 2
make[1]: *** [/root/FC31-64_K5.3.14_Clang9.0.0/x86_64-native-linuxapp-clang/a5e0a69a896e40569699a930d48f4d62/dpdk/mk/rte.sdkinstall.mk:61: pre_install] Error 2
make: *** [/root/FC31-64_K5.3.14_Clang9.0.0/x86_64-native-linuxapp-clang/a5e0a69a896e40569699a930d48f4d62/dpdk/mk/rte.sdkroot.mk:77: install] Error 2


*Make Build Failed #20:
OS: UB1604-64
Target: x86_64-native-linuxapp-gcc
  CC rte_lpm.o
/root/UB1604-64_K4.4.0_GCC5.4.0/x86_64-native-linuxapp-gcc/a5e0a69a896e40569699a930d48f4d62/dpdk/lib/librte_reorder/rte_reorder.c: At top level:
cc1: error: unrecognized command line option ‘-Wno-address-of-packed-member’ [-Werror]
cc1: all warnings being treated as errors
  CC dir24_8.o
/root/UB1604-64_K4.4.0_GCC5.4.0/x86_64-native-linuxapp-gcc/a5e0a69a896e40569699a930d48f4d62/dpdk/mk/internal/rte.compile-pre.mk:114: recipe for target 'rte_reorder.o' failed
make[5]: *** [rte_reorder.o] Error 1
/root/UB1604-64_K4.4.0_GCC5.4.0/x86_64-native-linuxapp-gcc/a5e0a69a896e40569699a930d48f4d62/dpdk/mk/rte.subdir.mk:35: recipe for target 'librte_reorder' failed
make[4]: *** [librte_reorder] Error 2
make[4]: *** Waiting for unfinished jobs....
  CC rte_cryptodev_pmd.o
  CC rte_member_ht.o
  CC rte_lpm6.o
  CC trie.o
--
  INSTALL-LIB librte_compressdev.a
  AR librte_fib.a
  INSTALL-LIB librte_fib.a
  AR librte_member.a
  INSTALL-LIB librte_member.a
/root/UB1604-64_K4.4.0_GCC5.4.0/x86_64-native-linuxapp-gcc/a5e0a69a896e40569699a930d48f4d62/dpdk/mk/rte.sdkbuild.mk:46: recipe for target 'lib' failed
make[3]: *** [lib] Error 2
/root/UB1604-64_K4.4.0_GCC5.4.0/x86_64-native-linuxapp-gcc/a5e0a69a896e40569699a930d48f4d62/dpdk/mk/rte.sdkroot.mk:98: recipe for target 'all' failed
make[2]: *** [all] Error 2
/root/UB1604-64_K4.4.0_GCC5.4.0/x86_64-native-linuxapp-gcc/a5e0a69a896e40569699a930d48f4d62/dpdk/mk/rte.sdkinstall.mk:60: recipe for target 'pre_install' failed
make[1]: *** [pre_install] Error 2
/root/UB1604-64_K4.4.0_GCC5.4.0/x86_64-native-linuxapp-gcc/a5e0a69a896e40569699a930d48f4d62/dpdk/mk/rte.sdkroot.mk:77: recipe for target 'install' failed
make: *** [install] Error 2


*Make Build Failed #21:
OS: UB1910-64
Target: x86_64-native-linuxapp-gcc
  SYMLINK-FILE include/rte_higig.h
  SYMLINK-FILE include/rte_gtp.h
  SYMLINK-FILE include/rte_vxlan.h
  CC rte_net.o
cc1: all warnings being treated as errors
make[5]: *** [/root/UB1910-64_K5.3.0_GCC9.2.1/x86_64-native-linuxapp-gcc/a5e0a69a896e40569699a930d48f4d62/dpdk/mk/internal/rte.compile-pre.mk:116: rte_reorder.o] Error 1
make[4]: *** [/root/UB1910-64_K5.3.0_GCC9.2.1/x86_64-native-linuxapp-gcc/a5e0a69a896e40569699a930d48f4d62/dpdk/mk/rte.subdir.mk:37: librte_reorder] Error 2
make[4]: *** Waiting for unfinished jobs....
  CC rte_net_crc.o
  CC rte_member_ht.o
  CC rte_member_vbf.o
  AR librte_efd.a
--
  INSTALL-LIB librte_net.a
  AR librte_bbdev.a
  INSTALL-LIB librte_bbdev.a
  AR librte_compressdev.a
  INSTALL-LIB librte_compressdev.a
make[3]: *** [/root/UB1910-64_K5.3.0_GCC9.2.1/x86_64-native-linuxapp-gcc/a5e0a69a896e40569699a930d48f4d62/dpdk/mk/rte.sdkbuild.mk:48: lib] Error 2
make[2]: *** [/root/UB1910-64_K5.3.0_GCC9.2.1/x86_64-native-linuxapp-gcc/a5e0a69a896e40569699a930d48f4d62/dpdk/mk/rte.sdkroot.mk:99: all] Error 2
make[1]: *** [/root/UB1910-64_K5.3.0_GCC9.2.1/x86_64-native-linuxapp-gcc/a5e0a69a896e40569699a930d48f4d62/dpdk/mk/rte.sdkinstall.mk:61: pre_install] Error 2
make: *** [/root/UB1910-64_K5.3.0_GCC9.2.1/x86_64-native-linuxapp-gcc/a5e0a69a896e40569699a930d48f4d62/dpdk/mk/rte.sdkroot.mk:77: install] Error 2


*Make Build Failed #22:
OS: UB1804-64
Target: x86_64-native-linuxapp-icc
/root/UB1804-64_K4.15.0_ICC19.0.0/x86_64-native-linuxapp-icc/a5e0a69a896e40569699a930d48f4d62/dpdk/x86_64-native-linuxapp-icc/include/rte_mempool.h(933): error #1786: function "rte_init_register" (declared at line 61 of "/root/UB1804-64_K4.15.0_ICC19.0.0/x86_64-native-linuxapp-icc/a5e0a69a896e40569699a930d48f4d62/dpdk/x86_64-native-linuxapp-icc/include/rte_init.h") was declared deprecated ("Symbol is not yet part of stable ABI")
  	rte_init_register(mempool_ops_register_cb, (const void *)ops,
  	^

compilation aborted for /root/UB1804-64_K4.15.0_ICC19.0.0/x86_64-native-linuxapp-icc/a5e0a69a896e40569699a930d48f4d62/dpdk/drivers/net/ark/ark_ethdev.c (code 2)
/root/UB1804-64_K4.15.0_ICC19.0.0/x86_64-native-linuxapp-icc/a5e0a69a896e40569699a930d48f4d62/dpdk/mk/internal/rte.compile-pre.mk:114: recipe for target 'ark_ethdev.o' failed
make[6]: *** [ark_ethdev.o] Error 2
/root/UB1804-64_K4.15.0_ICC19.0.0/x86_64-native-linuxapp-icc/a5e0a69a896e40569699a930d48f4d62/dpdk/mk/rte.subdir.mk:35: recipe for target 'ark' failed
make[5]: *** [ark] Error 2
/root/UB1804-64_K4.15.0_ICC19.0.0/x86_64-native-linuxapp-icc/a5e0a69a896e40569699a930d48f4d62/dpdk/mk/rte.subdir.mk:35: recipe for target 'net' failed
make[4]: *** [net] Error 2
make[4]: *** Waiting for unfinished jobs....
  SYMLINK-FILE include/rte_cryptodev_scheduler_operations.h
== Build drivers/compress/zlib
  SYMLINK-FILE include/rte_cryptodev_scheduler.h
  CC scheduler_pmd_ops.o
--
  INSTALL-LIB librte_pmd_dpaa2_sec.a
  AR librte_pmd_octeontx2_crypto.a
  INSTALL-LIB librte_pmd_octeontx2_crypto.a
  AR librte_pmd_octeontx_crypto.a
  INSTALL-LIB librte_pmd_octeontx_crypto.a
/root/UB1804-64_K4.15.0_ICC19.0.0/x86_64-native-linuxapp-icc/a5e0a69a896e40569699a930d48f4d62/dpdk/mk/rte.sdkbuild.mk:46: recipe for target 'drivers' failed
make[3]: *** [drivers] Error 2
/root/UB1804-64_K4.15.0_ICC19.0.0/x86_64-native-linuxapp-icc/a5e0a69a896e40569699a930d48f4d62/dpdk/mk/rte.sdkroot.mk:98: recipe for target 'all' failed
make[2]: *** [all] Error 2
/root/UB1804-64_K4.15.0_ICC19.0.0/x86_64-native-linuxapp-icc/a5e0a69a896e40569699a930d48f4d62/dpdk/mk/rte.sdkinstall.mk:60: recipe for target 'pre_install' failed
make[1]: *** [pre_install] Error 2
/root/UB1804-64_K4.15.0_ICC19.0.0/x86_64-native-linuxapp-icc/a5e0a69a896e40569699a930d48f4d62/dpdk/mk/rte.sdkroot.mk:77: recipe for target 'install' failed
make: *** [install] Error 2


*Make Build Failed #23:
OS: UB1804-64
Target: x86_64-native-linuxapp-gcc
  CC rte_ether.o
  CC rte_comp.o
/root/UB1804-64_K4.15.0_GCC7.3.0/x86_64-native-linuxapp-gcc/a5e0a69a896e40569699a930d48f4d62/dpdk/lib/librte_reorder/rte_reorder.c: At top level:
cc1: error: unrecognized command line option ‘-Wno-address-of-packed-member’ [-Werror]
cc1: all warnings being treated as errors
/root/UB1804-64_K4.15.0_GCC7.3.0/x86_64-native-linuxapp-gcc/a5e0a69a896e40569699a930d48f4d62/dpdk/mk/internal/rte.compile-pre.mk:114: recipe for target 'rte_reorder.o' failed
make[5]: *** [rte_reorder.o] Error 1
/root/UB1804-64_K4.15.0_GCC7.3.0/x86_64-native-linuxapp-gcc/a5e0a69a896e40569699a930d48f4d62/dpdk/mk/rte.subdir.mk:35: recipe for target 'librte_reorder' failed
make[4]: *** [librte_reorder] Error 2
make[4]: *** Waiting for unfinished jobs....
  CC rte_arp.o
  AR librte_hash.a
  INSTALL-LIB librte_hash.a
  AR librte_fib.a
--
  INSTALL-LIB librte_cryptodev.a
  AR librte_net.a
  INSTALL-LIB librte_net.a
  AR librte_compressdev.a
  INSTALL-LIB librte_compressdev.a
/root/UB1804-64_K4.15.0_GCC7.3.0/x86_64-native-linuxapp-gcc/a5e0a69a896e40569699a930d48f4d62/dpdk/mk/rte.sdkbuild.mk:46: recipe for target 'lib' failed
make[3]: *** [lib] Error 2
/root/UB1804-64_K4.15.0_GCC7.3.0/x86_64-native-linuxapp-gcc/a5e0a69a896e40569699a930d48f4d62/dpdk/mk/rte.sdkroot.mk:98: recipe for target 'all' failed
make[2]: *** [all] Error 2
/root/UB1804-64_K4.15.0_GCC7.3.0/x86_64-native-linuxapp-gcc/a5e0a69a896e40569699a930d48f4d62/dpdk/mk/rte.sdkinstall.mk:60: recipe for target 'pre_install' failed
make[1]: *** [pre_install] Error 2
/root/UB1804-64_K4.15.0_GCC7.3.0/x86_64-native-linuxapp-gcc/a5e0a69a896e40569699a930d48f4d62/dpdk/mk/rte.sdkroot.mk:77: recipe for target 'install' failed
make: *** [install] Error 2

*Meson Build Failed #1:
OS: UB1604-32
Target:./build-gcc-static
FAILED: lib/76b5a35@@rte_gso at sta/librte_gso_gso_udp4.c.o 
gcc -Ilib/76b5a35@@rte_gso at sta -Ilib -I../lib -Ilib/librte_gso -I../lib/librte_gso -I. -I../ -Iconfig -I../config -Ilib/librte_eal/include -I../lib/librte_eal/include -Ilib/librte_eal/linux/include -I../lib/librte_eal/linux/include -Ilib/librte_eal/common -I../lib/librte_eal/common -Ilib/librte_eal/x86/include -I../lib/librte_eal/x86/include -Ilib/librte_eal -I../lib/librte_eal -Ilib/librte_kvargs -I../lib/librte_kvargs -Ilib/librte_ethdev -I../lib/librte_ethdev -Ilib/librte_net -I../lib/librte_net -Ilib/librte_mbuf -I../lib/librte_mbuf -Ilib/librte_mempool -I../lib/librte_mempool -Ilib/librte_ring -I../lib/librte_ring -Ilib/librte_meter -I../lib/librte_meter -fdiagnostics-color=always -pipe -D_FILE_OFFSET_BITS=64 -Wall -Winvalid-pch -Werror -O2 -g -include rte_config.h -Wextra -Wcast-qual -Wdeprecated -Wformat-nonliteral -Wformat-security -Wmissing-declarations -Wmissing-prototypes -Wnested-externs -Wold-style-definition -Wpointer-arith -Wsign-compare -Wstrict-prototypes -Wundef -Wwrite-strings -Wno-missing-field-initializers -Wno-pointer-to-int-cast -D_GNU_SOURCE -fPIC -march=native -MD -MQ 'lib/76b5a35@@rte_gso at sta/librte_gso_gso_udp4.c.o' -MF 'lib/76b5a35@@rte_gso at sta/librte_gso_gso_udp4.c.o.d' -o 'lib/76b5a35@@rte_gso at sta/librte_gso_gso_udp4.c.o' -c ../lib/librte_gso/gso_udp4.c
In file included from ../lib/librte_mbuf/rte_mbuf.h:38:0,
                 from ../lib/librte_gso/gso_common.h:10,
                 from ../lib/librte_gso/gso_udp4.c:5:
../lib/librte_mempool/rte_mempool.h: In function ‘mempool_ops_register’:
../lib/librte_mempool/rte_mempool.h:933:2: error: ‘rte_init_register’ is deprecated: Symbol is not yet part of stable ABI [-Werror=deprecated-declarations]
  rte_init_register(mempool_ops_register_cb, (const void *)ops,
  ^
In file included from ../lib/librte_mempool/rte_mempool.h:53:0,
                 from ../lib/librte_mbuf/rte_mbuf.h:38,
                 from ../lib/librte_gso/gso_common.h:10,
                 from ../lib/librte_gso/gso_udp4.c:5:
../lib/librte_eal/include/rte_init.h:61:5: note: declared here
 int rte_init_register(rte_init_cb_t cb, const void *arg,
     ^
cc1: all warnings being treated as errors
[100/1979] Generating net.exp_chk with a meson_exe.py custom command.
[101/1979] Compiling C object 'lib/76b5a35@@rte_cfgfile at sta/librte_cfgfile_rte_cfgfile.c.o'.
[102/1979] Compiling C object 'lib/76b5a35@@rte_cmdline at sta/librte_cmdline_cmdline_cirbuf.c.o'.
[103/1979] Generating pci.exp_chk with a meson_exe.py custom command.
[104/1979] Compiling C object 'lib/76b5a35@@rte_ethdev at sta/librte_ethdev_rte_mtr.c.o'.
[105/1979] Compiling C object 'lib/76b5a35@@rte_ethdev at sta/librte_ethdev_rte_tm.c.o'.
[106/1979] Generating mbuf.exp_chk with a meson_exe.py custom command.
[107/1979] Generating eal.exp_chk with a meson_exe.py custom command.
[108/1979] Compiling C object 'lib/76b5a35@@rte_ethdev at sta/librte_ethdev_rte_flow.c.o'.
ninja: build stopped: subcommand failed




*Meson Build Failed #2:
OS: FC31-64
Target:./build-gcc-static
FAILED: lib/76b5a35@@rte_gso at sta/librte_gso_gso_tunnel_tcp4.c.o 
gcc -Ilib/76b5a35@@rte_gso at sta -Ilib -I../lib -Ilib/librte_gso -I../lib/librte_gso -I. -I../ -Iconfig -I../config -Ilib/librte_eal/include -I../lib/librte_eal/include -Ilib/librte_eal/linux/include -I../lib/librte_eal/linux/include -Ilib/librte_eal/common -I../lib/librte_eal/common -Ilib/librte_eal/x86/include -I../lib/librte_eal/x86/include -Ilib/librte_eal -I../lib/librte_eal -Ilib/librte_kvargs -I../lib/librte_kvargs -Ilib/librte_ethdev -I../lib/librte_ethdev -Ilib/librte_net -I../lib/librte_net -Ilib/librte_mbuf -I../lib/librte_mbuf -Ilib/librte_mempool -I../lib/librte_mempool -Ilib/librte_ring -I../lib/librte_ring -Ilib/librte_meter -I../lib/librte_meter -fdiagnostics-color=always -pipe -D_FILE_OFFSET_BITS=64 -Wall -Winvalid-pch -Werror -O2 -g -include rte_config.h -Wextra -Wcast-qual -Wdeprecated -Wformat-nonliteral -Wformat-security -Wmissing-declarations -Wmissing-prototypes -Wnested-externs -Wold-style-definition -Wpointer-arith -Wsign-compare -Wstrict-prototypes -Wundef -Wwrite-strings -Wno-address-of-packed-member -Wno-packed-not-aligned -Wno-missing-field-initializers -D_GNU_SOURCE -fPIC -march=native -Wno-format-truncation -MD -MQ 'lib/76b5a35@@rte_gso at sta/librte_gso_gso_tunnel_tcp4.c.o' -MF 'lib/76b5a35@@rte_gso at sta/librte_gso_gso_tunnel_tcp4.c.o.d' -o 'lib/76b5a35@@rte_gso at sta/librte_gso_gso_tunnel_tcp4.c.o' -c ../lib/librte_gso/gso_tunnel_tcp4.c
In file included from ../lib/librte_mbuf/rte_mbuf.h:38,
                 from ../lib/librte_gso/gso_common.h:10,
                 from ../lib/librte_gso/gso_tunnel_tcp4.c:5:
../lib/librte_mempool/rte_mempool.h: In function ‘mempool_ops_register’:
../lib/librte_mempool/rte_mempool.h:933:2: error: ‘rte_init_register’ is deprecated: Symbol is not yet part of stable ABI [-Werror=deprecated-declarations]
  933 |  rte_init_register(mempool_ops_register_cb, (const void *)ops,
      |  ^~~~~~~~~~~~~~~~~
In file included from ../lib/librte_mempool/rte_mempool.h:53,
                 from ../lib/librte_mbuf/rte_mbuf.h:38,
                 from ../lib/librte_gso/gso_common.h:10,
                 from ../lib/librte_gso/gso_tunnel_tcp4.c:5:
../lib/librte_eal/include/rte_init.h:61:5: note: declared here
   61 | int rte_init_register(rte_init_cb_t cb, const void *arg,
      |     ^~~~~~~~~~~~~~~~~
cc1: all warnings being treated as errors
[96/2254] Compiling C object 'lib/76b5a35@@rte_cmdline at sta/librte_cmdline_cmdline.c.o'.
[97/2254] Generating mempool.exp_chk with a meson_exe.py custom command.
[98/2254] Compiling C object 'lib/76b5a35@@rte_cmdline at sta/librte_cmdline_cmdline_cirbuf.c.o'.
[99/2254] Compiling C object 'lib/76b5a35@@rte_mbuf at sta/librte_mbuf_rte_mbuf.c.o'.
[100/2254] Compiling C object 'lib/76b5a35@@rte_gso at sta/librte_gso_rte_gso.c.o'.
FAILED: lib/76b5a35@@rte_gso at sta/librte_gso_rte_gso.c.o 
gcc -Ilib/76b5a35@@rte_gso at sta -Ilib -I../lib -Ilib/librte_gso -I../lib/librte_gso -I. -I../ -Iconfig -I../config -Ilib/librte_eal/include -I../lib/librte_eal/include -Ilib/librte_eal/linux/include -I../lib/librte_eal/linux/include -Ilib/librte_eal/common -I../lib/librte_eal/common -Ilib/librte_eal/x86/include -I../lib/librte_eal/x86/include -Ilib/librte_eal -I../lib/librte_eal -Ilib/librte_kvargs -I../lib/librte_kvargs -Ilib/librte_ethdev -I../lib/librte_ethdev -Ilib/librte_net -I../lib/librte_net -Ilib/librte_mbuf -I../lib/librte_mbuf -Ilib/librte_mempool -I../lib/librte_mempool -Ilib/librte_ring -I../lib/librte_ring -Ilib/librte_meter -I../lib/librte_meter -fdiagnostics-color=always -pipe -D_FILE_OFFSET_BITS=64 -Wall -Winvalid-pch -Werror -O2 -g -include rte_config.h -Wextra -Wcast-qual -Wdeprecated -Wformat-nonliteral -Wformat-security -Wmissing-declarations -Wmissing-prototypes -Wnested-externs -Wold-style-definition -Wpointer-arith -Wsign-compare -Wstrict-prototypes -Wundef -Wwrite-strings -Wno-address-of-packed-member -Wno-packed-not-aligned -Wno-missing-field-initializers -D_GNU_SOURCE -fPIC -march=native -Wno-format-truncation -MD -MQ 'lib/76b5a35@@rte_gso at sta/librte_gso_rte_gso.c.o' -MF 'lib/76b5a35@@rte_gso at sta/librte_gso_rte_gso.c.o.d' -o 'lib/76b5a35@@rte_gso at sta/librte_gso_rte_gso.c.o' -c ../lib/librte_gso/rte_gso.c
In file included from ../lib/librte_mbuf/rte_mbuf.h:38,
                 from ../lib/librte_net/rte_ether.h:23,
                 from ../lib/librte_ethdev/rte_ethdev.h:159,
                 from ../lib/librte_gso/rte_gso.c:8:
../lib/librte_mempool/rte_mempool.h: In function ‘mempool_ops_register’:
../lib/librte_mempool/rte_mempool.h:933:2: error: ‘rte_init_register’ is deprecated: Symbol is not yet part of stable ABI [-Werror=deprecated-declarations]
  933 |  rte_init_register(mempool_ops_register_cb, (const void *)ops,
      |  ^~~~~~~~~~~~~~~~~
In file included from ../lib/librte_mempool/rte_mempool.h:53,
                 from ../lib/librte_mbuf/rte_mbuf.h:38,
                 from ../lib/librte_net/rte_ether.h:23,
                 from ../lib/librte_ethdev/rte_ethdev.h:159,
                 from ../lib/librte_gso/rte_gso.c:8:
../lib/librte_eal/include/rte_init.h:61:5: note: declared here
   61 | int rte_init_register(rte_init_cb_t cb, const void *arg,
      |     ^~~~~~~~~~~~~~~~~
cc1: all warnings being treated as errors
[101/2254] Generating net.exp_chk with a meson_exe.py custom command.
[102/2254] Compiling C object 'lib/76b5a35@@rte_ethdev at sta/librte_ethdev_rte_mtr.c.o'.
[103/2254] Generating pci.exp_chk with a meson_exe.py custom command.
[104/2254] Compiling C object 'lib/76b5a35@@rte_ethdev at sta/librte_ethdev_rte_tm.c.o'.
[105/2254] Generating eal.exp_chk with a meson_exe.py custom command.
[106/2254] Compiling C object 'lib/76b5a35@@rte_ethdev at sta/librte_ethdev_rte_ethdev.c.o'.
ninja: build stopped: subcommand failed




*Meson Build Failed #3:
OS: CENTOS77-64
Target:./build-gcc-static
FAILED: lib/76b5a35@@rte_gso at sta/librte_gso_rte_gso.c.o 
gcc -Ilib/76b5a35@@rte_gso at sta -Ilib -I../lib -Ilib/librte_gso -I../lib/librte_gso -I. -I../ -Iconfig -I../config -Ilib/librte_eal/include -I../lib/librte_eal/include -Ilib/librte_eal/linux/include -I../lib/librte_eal/linux/include -Ilib/librte_eal/common -I../lib/librte_eal/common -Ilib/librte_eal/x86/include -I../lib/librte_eal/x86/include -Ilib/librte_eal -I../lib/librte_eal -Ilib/librte_kvargs -I../lib/librte_kvargs -Ilib/librte_ethdev -I../lib/librte_ethdev -Ilib/librte_net -I../lib/librte_net -Ilib/librte_mbuf -I../lib/librte_mbuf -Ilib/librte_mempool -I../lib/librte_mempool -Ilib/librte_ring -I../lib/librte_ring -Ilib/librte_meter -I../lib/librte_meter -pipe -D_FILE_OFFSET_BITS=64 -Wall -Winvalid-pch -Werror -O2 -g -include rte_config.h -Wextra -Wcast-qual -Wdeprecated -Wformat-nonliteral -Wformat-security -Wmissing-declarations -Wmissing-prototypes -Wnested-externs -Wold-style-definition -Wpointer-arith -Wsign-compare -Wstrict-prototypes -Wundef -Wwrite-strings -Wno-missing-field-initializers -D_GNU_SOURCE -fPIC -march=native -MD -MQ 'lib/76b5a35@@rte_gso at sta/librte_gso_rte_gso.c.o' -MF 'lib/76b5a35@@rte_gso at sta/librte_gso_rte_gso.c.o.d' -o 'lib/76b5a35@@rte_gso at sta/librte_gso_rte_gso.c.o' -c ../lib/librte_gso/rte_gso.c
In file included from ../lib/librte_mbuf/rte_mbuf.h:38:0,
                 from ../lib/librte_net/rte_ether.h:23,
                 from ../lib/librte_ethdev/rte_ethdev.h:159,
                 from ../lib/librte_gso/rte_gso.c:8:
../lib/librte_mempool/rte_mempool.h: In function ‘mempool_ops_register’:
../lib/librte_mempool/rte_mempool.h:933:2: error: ‘rte_init_register’ is deprecated (declared at ../lib/librte_eal/include/rte_init.h:61): Symbol is not yet part of stable ABI [-Werror=deprecated-declarations]
  rte_init_register(mempool_ops_register_cb, (const void *)ops,
  ^
cc1: all warnings being treated as errors
[92/2245] Compiling C object 'lib/76b5a35@@rte_mbuf at sta/librte_mbuf_rte_mbuf.c.o'.
[93/2245] Compiling C object 'lib/76b5a35@@rte_ethdev at sta/librte_ethdev_rte_class_eth.c.o'.
[94/2245] Compiling C object 'lib/76b5a35@@rte_ethdev at sta/librte_ethdev_rte_mtr.c.o'.
[95/2245] Generating mempool.exp_chk with a meson_exe.py custom command.
[96/2245] Compiling C object 'lib/76b5a35@@rte_ethdev at sta/librte_ethdev_rte_tm.c.o'.
[97/2245] Generating meter.exp_chk with a meson_exe.py custom command.
[98/2245] Generating net.exp_chk with a meson_exe.py custom command.
[99/2245] Generating eal.exp_chk with a meson_exe.py custom command.
[100/2245] Compiling C object 'lib/76b5a35@@rte_ethdev at sta/librte_ethdev_rte_ethdev.c.o'.
ninja: build stopped: subcommand failed




*Meson Build Failed #4:
OS: UB1804-64
Target:./build-gcc-static
FAILED: lib/76b5a35@@rte_gso at sta/librte_gso_rte_gso.c.o 
gcc -Ilib/76b5a35@@rte_gso at sta -Ilib -I../lib -Ilib/librte_gso -I../lib/librte_gso -I. -I../ -Iconfig -I../config -Ilib/librte_eal/include -I../lib/librte_eal/include -Ilib/librte_eal/linux/include -I../lib/librte_eal/linux/include -Ilib/librte_eal/common -I../lib/librte_eal/common -Ilib/librte_eal/x86/include -I../lib/librte_eal/x86/include -Ilib/librte_eal -I../lib/librte_eal -Ilib/librte_kvargs -I../lib/librte_kvargs -Ilib/librte_ethdev -I../lib/librte_ethdev -Ilib/librte_net -I../lib/librte_net -Ilib/librte_mbuf -I../lib/librte_mbuf -Ilib/librte_mempool -I../lib/librte_mempool -Ilib/librte_ring -I../lib/librte_ring -Ilib/librte_meter -I../lib/librte_meter -fdiagnostics-color=always -pipe -D_FILE_OFFSET_BITS=64 -Wall -Winvalid-pch -Werror -O2 -g -include rte_config.h -Wextra -Wcast-qual -Wdeprecated -Wformat-nonliteral -Wformat-security -Wmissing-declarations -Wmissing-prototypes -Wnested-externs -Wold-style-definition -Wpointer-arith -Wsign-compare -Wstrict-prototypes -Wundef -Wwrite-strings -Wno-missing-field-initializers -D_GNU_SOURCE -fPIC -march=native -mno-avx512f -Wno-format-truncation -MD -MQ 'lib/76b5a35@@rte_gso at sta/librte_gso_rte_gso.c.o' -MF 'lib/76b5a35@@rte_gso at sta/librte_gso_rte_gso.c.o.d' -o 'lib/76b5a35@@rte_gso at sta/librte_gso_rte_gso.c.o' -c ../lib/librte_gso/rte_gso.c
In file included from ../lib/librte_mbuf/rte_mbuf.h:38:0,
                 from ../lib/librte_net/rte_ether.h:23,
                 from ../lib/librte_ethdev/rte_ethdev.h:159,
                 from ../lib/librte_gso/rte_gso.c:8:
../lib/librte_mempool/rte_mempool.h: In function ‘mempool_ops_register’:
../lib/librte_mempool/rte_mempool.h:933:2: error: ‘rte_init_register’ is deprecated: Symbol is not yet part of stable ABI [-Werror=deprecated-declarations]
  rte_init_register(mempool_ops_register_cb, (const void *)ops,
  ^~~~~~~~~~~~~~~~~
In file included from ../lib/librte_mempool/rte_mempool.h:53:0,
                 from ../lib/librte_mbuf/rte_mbuf.h:38,
                 from ../lib/librte_net/rte_ether.h:23,
                 from ../lib/librte_ethdev/rte_ethdev.h:159,
                 from ../lib/librte_gso/rte_gso.c:8:
../lib/librte_eal/include/rte_init.h:61:5: note: declared here
 int rte_init_register(rte_init_cb_t cb, const void *arg,
     ^~~~~~~~~~~~~~~~~
cc1: all warnings being treated as errors
[100/2167] Generating net.exp_chk with a meson_exe.py custom command.
[101/2167] Generating pci.exp_chk with a meson_exe.py custom command.
[102/2167] Compiling C object 'lib/76b5a35@@rte_cmdline at sta/librte_cmdline_cmdline_cirbuf.c.o'.
[103/2167] Generating mbuf.exp_chk with a meson_exe.py custom command.
[104/2167] Compiling C object 'lib/76b5a35@@rte_ethdev at sta/librte_ethdev_rte_mtr.c.o'.
[105/2167] Compiling C object 'lib/76b5a35@@rte_cmdline at sta/librte_cmdline_cmdline_parse.c.o'.
[106/2167] Compiling C object 'lib/76b5a35@@rte_ethdev at sta/librte_ethdev_rte_tm.c.o'.
[107/2167] Generating eal.exp_chk with a meson_exe.py custom command.
[108/2167] Compiling C object 'lib/76b5a35@@rte_ethdev at sta/librte_ethdev_rte_ethdev.c.o'.
ninja: build stopped: subcommand failed




*Meson Build Failed #5:
OS: FreeBSD1201-64
Target:./build-gcc-static
FAILED: lib/76b5a35@@rte_bitratestats at sta/librte_bitratestats_rte_bitrate.c.o 
gcc -Ilib/76b5a35@@rte_bitratestats at sta -Ilib -I../lib -Ilib/librte_bitratestats -I../lib/librte_bitratestats -I. -I../ -Iconfig -I../config -Ilib/librte_eal/include -I../lib/librte_eal/include -Ilib/librte_eal/freebsd/include -I../lib/librte_eal/freebsd/include -Ilib/librte_eal/common -I../lib/librte_eal/common -Ilib/librte_eal/x86/include -I../lib/librte_eal/x86/include -Ilib/librte_eal -I../lib/librte_eal -Ilib/librte_kvargs -I../lib/librte_kvargs -Ilib/librte_ethdev -I../lib/librte_ethdev -Ilib/librte_net -I../lib/librte_net -Ilib/librte_mbuf -I../lib/librte_mbuf -Ilib/librte_mempool -I../lib/librte_mempool -Ilib/librte_ring -I../lib/librte_ring -Ilib/librte_meter -I../lib/librte_meter -Ilib/librte_metrics -I../lib/librte_metrics -fdiagnostics-color=always -pipe -D_FILE_OFFSET_BITS=64 -Wall -Winvalid-pch -Werror -O2 -g -include rte_config.h -Wextra -Wcast-qual -Wdeprecated -Wformat-nonliteral -Wformat-security -Wmissing-declarations -Wmissing-prototypes -Wnested-externs -Wold-style-definition -Wpointer-arith -Wsign-compare -Wstrict-prototypes -Wundef -Wwrite-strings -Wno-address-of-packed-member -Wno-packed-not-aligned -Wno-missing-field-initializers -D_GNU_SOURCE -D__BSD_VISIBLE -fPIC -march=native -Wno-format-truncation -MD -MQ 'lib/76b5a35@@rte_bitratestats at sta/librte_bitratestats_rte_bitrate.c.o' -MF 'lib/76b5a35@@rte_bitratestats at sta/librte_bitratestats_rte_bitrate.c.o.d' -o 'lib/76b5a35@@rte_bitratestats at sta/librte_bitratestats_rte_bitrate.c.o' -c ../lib/librte_bitratestats/rte_bitrate.c
In file included from ../lib/librte_mbuf/rte_mbuf.h:38,
                 from ../lib/librte_net/rte_ether.h:23,
                 from ../lib/librte_ethdev/rte_ethdev.h:159,
                 from ../lib/librte_bitratestats/rte_bitrate.c:6:
../lib/librte_mempool/rte_mempool.h: In function 'mempool_ops_register':
../lib/librte_mempool/rte_mempool.h:933:2: error: 'rte_init_register' is deprecated: Symbol is not yet part of stable ABI [-Werror=deprecated-declarations]
  933 |  rte_init_register(mempool_ops_register_cb, (const void *)ops,
      |  ^~~~~~~~~~~~~~~~~
In file included from ../lib/librte_mempool/rte_mempool.h:53,
                 from ../lib/librte_mbuf/rte_mbuf.h:38,
                 from ../lib/librte_net/rte_ether.h:23,
                 from ../lib/librte_ethdev/rte_ethdev.h:159,
                 from ../lib/librte_bitratestats/rte_bitrate.c:6:
../lib/librte_eal/include/rte_init.h:61:5: note: declared here
   61 | int rte_init_register(rte_init_cb_t cb, const void *arg,
      |     ^~~~~~~~~~~~~~~~~
cc1: all warnings being treated as errors
[136/1646] Compiling C object 'lib/76b5a35@@rte_cfgfile at sta/librte_cfgfile_rte_cfgfile.c.o'.
[137/1646] Compiling C object 'lib/76b5a35@@rte_acl at sta/librte_acl_acl_run_sse.c.o'.
[138/1646] Compiling C object 'lib/76b5a35@@rte_compressdev at sta/librte_compressdev_rte_compressdev_pmd.c.o'.
[139/1646] Generating eal.exp_chk with a meson_exe.py custom command.
[140/1646] Generating ethdev.exp_chk with a meson_exe.py custom command.
[141/1646] Compiling C object 'lib/76b5a35@@rte_bbdev at sta/librte_bbdev_rte_bbdev.c.o'.
[142/1646] Compiling C object 'lib/76b5a35@@rte_compressdev at sta/librte_compressdev_rte_compressdev.c.o'.
[143/1646] Compiling C object 'lib/76b5a35@@rte_acl at sta/librte_acl_acl_run_avx2.c.o'.
[144/1646] Compiling C object 'lib/76b5a35@@rte_hash at sta/librte_hash_rte_cuckoo_hash.c.o'.
ninja: build stopped: subcommand failed




*Meson Build Failed #6:
OS: SUSE15-64
Target:./build-gcc-static
FAILED: lib/76b5a35@@rte_gso at sta/librte_gso_rte_gso.c.o 
gcc -Ilib/76b5a35@@rte_gso at sta -Ilib -I../lib -Ilib/librte_gso -I../lib/librte_gso -I. -I../ -Iconfig -I../config -Ilib/librte_eal/include -I../lib/librte_eal/include -Ilib/librte_eal/linux/include -I../lib/librte_eal/linux/include -Ilib/librte_eal/common -I../lib/librte_eal/common -Ilib/librte_eal/x86/include -I../lib/librte_eal/x86/include -Ilib/librte_eal -I../lib/librte_eal -Ilib/librte_kvargs -I../lib/librte_kvargs -Ilib/librte_ethdev -I../lib/librte_ethdev -Ilib/librte_net -I../lib/librte_net -Ilib/librte_mbuf -I../lib/librte_mbuf -Ilib/librte_mempool -I../lib/librte_mempool -Ilib/librte_ring -I../lib/librte_ring -Ilib/librte_meter -I../lib/librte_meter -fdiagnostics-color=always -pipe -D_FILE_OFFSET_BITS=64 -Wall -Winvalid-pch -Werror -O2 -g -include rte_config.h -Wextra -Wcast-qual -Wdeprecated -Wformat-nonliteral -Wformat-security -Wmissing-declarations -Wmissing-prototypes -Wnested-externs -Wold-style-definition -Wpointer-arith -Wsign-compare -Wstrict-prototypes -Wundef -Wwrite-strings -Wno-missing-field-initializers -D_GNU_SOURCE -fPIC -march=native -Wno-format-truncation -MD -MQ 'lib/76b5a35@@rte_gso at sta/librte_gso_rte_gso.c.o' -MF 'lib/76b5a35@@rte_gso at sta/librte_gso_rte_gso.c.o.d' -o 'lib/76b5a35@@rte_gso at sta/librte_gso_rte_gso.c.o' -c ../lib/librte_gso/rte_gso.c
In file included from ../lib/librte_mbuf/rte_mbuf.h:38:0,
                 from ../lib/librte_net/rte_ether.h:23,
                 from ../lib/librte_ethdev/rte_ethdev.h:159,
                 from ../lib/librte_gso/rte_gso.c:8:
../lib/librte_mempool/rte_mempool.h: In function ‘mempool_ops_register’:
../lib/librte_mempool/rte_mempool.h:933:2: error: ‘rte_init_register’ is deprecated: Symbol is not yet part of stable ABI [-Werror=deprecated-declarations]
  rte_init_register(mempool_ops_register_cb, (const void *)ops,
  ^~~~~~~~~~~~~~~~~
In file included from ../lib/librte_mempool/rte_mempool.h:53:0,
                 from ../lib/librte_mbuf/rte_mbuf.h:38,
                 from ../lib/librte_net/rte_ether.h:23,
                 from ../lib/librte_ethdev/rte_ethdev.h:159,
                 from ../lib/librte_gso/rte_gso.c:8:
../lib/librte_eal/include/rte_init.h:61:5: note: declared here
 int rte_init_register(rte_init_cb_t cb, const void *arg,
     ^~~~~~~~~~~~~~~~~
cc1: all warnings being treated as errors
[94/2157] Generating meter.exp_chk with a meson_exe.py custom command.
[95/2157] Compiling C object 'lib/76b5a35@@rte_mbuf at sta/librte_mbuf_rte_mbuf.c.o'.
[96/2157] Generating mempool.exp_chk with a meson_exe.py custom command.
[97/2157] Compiling C object 'lib/76b5a35@@rte_pci at sta/librte_pci_rte_pci.c.o'.
[98/2157] Compiling C object 'lib/76b5a35@@rte_cmdline at sta/librte_cmdline_cmdline.c.o'.
[99/2157] Generating net.exp_chk with a meson_exe.py custom command.
[100/2157] Compiling C object 'lib/76b5a35@@rte_ethdev at sta/librte_ethdev_rte_tm.c.o'.
[101/2157] Generating eal.exp_chk with a meson_exe.py custom command.
[102/2157] Compiling C object 'lib/76b5a35@@rte_ethdev at sta/librte_ethdev_rte_ethdev.c.o'.
ninja: build stopped: subcommand failed



DPDK STV team


More information about the test-report mailing list