[dpdk-test-report] |FAILURE| pw68992net/af_packet: changes to accomodate jumbo frames

sys_stv at intel.com sys_stv at intel.com
Tue Apr 21 12:10:08 CEST 2020


Test-Label: Intel-compilation
Test-Status: FAILURE
http://dpdk.org/patch/68992

_Compilation issues_

Submitter: Kiran KN <kirankn at juniper.net>
Date: 2020-04-21 07:50:53
Reply_mail: 4725E5D1-40EC-4CF5-AC95-DE0DDA41C228 at juniper.net
DPDK git baseline: Repo:dpdk-next-net, CommitID: 5a66bec3c61064e6812e16fea1705a9539a35e41

Makefile build Summary: 22 Builds Done, 18 Successful, 4 Failures

Meson build Summary: 8 Builds Done, 7 Successful, 1 Failures

               +==============================================+===========+==========+
               |                   Makefile                   |   Meson   | Document |
+----------------+------+-------+------+------------+-----------+-----------+----------+
| os             | gcc  | clang | icc  | gcc+shared | gcc+debug | gcc/clang | pdf/html |
+----------------+------+-------+------+------------+-----------+-----------+----------+
| RHEL80-64      | pass |       |      |            |           |           |          |
| UB1804-64      | pass | pass  | pass |            |           | pass      | pass     |
| FC32-64        |      | pass  |      |            |           |           |          |
| UB1604-32      |      |       |      |            |           | pass      |          |
| CENTOS77-64    | pass |       |      |            |           |           |          |
| UB1604-64      | pass |       |      |            |           |           |          |
| CENTOS80-64    | pass | pass  | pass | pass       | pass      | pass      |          |
| UB1804-32      | pass |       |      |            |           |           |          |
| UB1910-64      | pass |       |      |            |           |           |          |
| FC31-64        | pass |       |      |            |           | pass      |          |
| WIN10-64       |      |       |      |            |           | pass      |          |
| FreeBSD1201-64 | FAIL | FAIL  |      | FAIL       | FAIL      | FAIL      |          |
| RHEL77-64      | pass |       |      |            |           |           |          |
| SUSE15-64      | pass | pass  |      |            |           | pass      |          |
+----------------+------+-------+------+------------+-----------+-----------+----------+

Test environment and configuration as below:

** Makefile build **


OS: UB1804-64
	Kernel Version: 4.15.0-20-generic
	CPU info: Intel(R) Xeon(R) CPU E5-2699 v3 @ 2.30GHz
	GCC Version: gcc (Ubuntu 7.3.0-16ubuntu3) 7.3.0
	Clang Version: 6.0.0-1ubuntu2 (tags/RELEASE_600/final)
	x86_64-native-linuxapp-clang
	x86_64-native-linuxapp-icc
	x86_64-native-linuxapp-gcc


OS: FC32-64
	Kernel Version: 5.6.0-0.rc7.git0.2.fc32.x86_64
	CPU info: Intel(R) Xeon(R) CPU E5-2699 v4 @ 2.20GHz
	GCC Version: gcc (GCC) 10.0.1 20200311 (Red Hat 10.0.1-0.9)
	Clang Version: 10.0.0 (Fedora 10.0.0-0.3.rc4.fc32)
	x86_64-native-linuxapp-clang


OS: CENTOS77-64
	Kernel Version: 3.10.0-1062.9.1.el7.x86_64
	CPU info: Intel(R) Xeon(R) CPU E5-2699 v3 @ 2.30GHz
	GCC Version: gcc (GCC) 4.8.5 20150623 (Red Hat 4.8.5-39)
	Clang Version: 3.4.2 (tags/RELEASE_34/dot2-final)
	x86_64-native-linuxapp-gcc


OS: UB1604-64
	Kernel Version: 4.13.0-36-generic
	CPU info: Intel(R) Xeon(R) Platinum 8180 CPU @ 2.50GHz
	GCC Version: gcc (Ubuntu 5.4.0-6ubuntu1~16.04.9) 5.4.0 20160609
	Clang Version: NA
	x86_64-native-linuxapp-gcc


OS: UB1804-32
	Kernel Version: 4.15.0-20-generic
	CPU info: Intel(R) Xeon(R) Platinum 8180 CPU @ 2.50GHz
	GCC Version: gcc (Ubuntu 7.5.0-3ubuntu1~18.04) 7.5.0
	Clang Version: 6.0.0-1ubuntu2 (tags/RELEASE_600/final)
	i686-native-linuxapp-gcc


OS: CENTOS80-64
	Kernel Version: 4.18.0-80.11.2.el8_0.x86_64
	CPU info: Intel(R) Xeon(R) CPU E5-2699 v3 @ 2.30GHz
	GCC Version: gcc (GCC) 8.2.1 20180905 (Red Hat 8.2.1-3)
	Clang Version: 7.0.1 (tags/RELEASE_701/final)
	x86_64-native-linuxapp-gcc+debug
	x86_64-native-linuxapp-gcc+shared
	x86_64-native-linuxapp-gcc
	x86_64-native-linuxapp-clang
	x86_64-native-linuxapp-icc


OS: UB1910-64
	Kernel Version: 5.3.0-18-generic
	CPU info: Intel(R) Xeon(R) Platinum 8180 CPU @ 2.50GHz
	GCC Version: gcc (Ubuntu 9.2.1-9ubuntu2) 9.2.1 20191008
	Clang Version: 9.0.0-2 (tags/RELEASE_900/final)
	x86_64-native-linuxapp-gcc


OS: FC31-64
	Kernel Version: 5.3.15-300.fc31.x86_64
	CPU info: Intel(R) Xeon(R) CPU E5-2699 v4 @ 2.20GHz
	GCC Version: gcc (GCC) 9.2.1 20190827 (Red Hat 9.2.1-1)
	Clang Version: 9.0.0 (Fedora 9.0.0-1.fc31)
	x86_64-native-linuxapp-gcc


OS: RHEL80-64
	Kernel Version: 4.18.0-80.el8.x86_64
	CPU info: Intel(R) Xeon(R) CPU E5-2699 v4 @ 2.20GHz
	GCC Version: gcc (GCC) 8.2.1 20180905 (Red Hat 8.2.1-3)
	Clang Version: 6.0.1 (tags/RELEASE_601/final)
	x86_64-native-linuxapp-gcc


OS: FreeBSD1201-64
	Kernel Version: 12.1-RELEASE
	CPU info: Intel(R) Xeon(R) CPU E5-2699 v3 @ 2.30GHz (2294.74-MHz K8-class CPU)
	GCC Version: gcc (FreeBSD Ports Collection) 9.2.0
	Clang Version: 8.0.1 (tags/RELEASE_801/final 366581) (based on LLVM 8.0.1)
	x86_64-native-bsdapp-clang
	x86_64-native-bsdapp-gcc+debug
	x86_64-native-bsdapp-gcc
	x86_64-native-bsdapp-gcc+shared


OS: RHEL77-64
	Kernel Version: 3.10.0-1062.9.1.el7.x86_64
	CPU info: Intel(R) Xeon(R) CPU E5-2699 v4 @ 2.20GHz
	GCC Version: gcc (GCC) 4.8.5 20150623 (Red Hat 4.8.5-39)
	Clang Version: 3.4.2 (tags/RELEASE_34/dot2-final)
	x86_64-native-linuxapp-gcc


OS: SUSE15-64
	Kernel Version: 4.12.14-lp150.11-default
	CPU info: Intel(R) Xeon(R) CPU E5-2699 v4 @ 2.20GHz
	GCC Version: gcc (SUSE Linux) 7.3.1 20180323 [gcc-7-branch revision 258812]
	Clang Version: 5.0.1 (tags/RELEASE_501/final 312548)
	x86_64-native-linuxapp-clang
	x86_64-native-linuxapp-gcc


** Meson build **


OS: UB1804-64
	Kernel Version: 4.15.0-20-generic
	CPU info: Intel(R) Xeon(R) CPU E5-2699 v4 @ 2.20GHz
	GCC Version: gcc (Ubuntu 7.3.0-27ubuntu1~18.04) 7.3.0
	Clang Version: 6.0.0-1ubuntu2 (tags/RELEASE_600/final)
	x86_64-native-linuxapp-doc
	./build-gcc-static
	./build-gcc-shared
	./build-clang-static
	./build-clang-shared
	./build-x86-default


OS: UB1604-32
	Kernel Version: 4.4.0-131-generic
	CPU info: Intel(R) Xeon(R) CPU E5-2699 v4 @ 2.20GHz
	GCC Version: gcc (Ubuntu 5.4.0-6ubuntu1~16.04.11) 5.4.0 20160609
	Clang Version: 3.8.0-2ubuntu4 (tags/RELEASE_380/final)
	./build-gcc-static
	./build-gcc-shared
	./build-clang-static
	./build-clang-shared
	./build-x86-default


OS: CENTOS80-64
	Kernel Version: 4.18.0-80.11.2.el8_0.x86_64
	CPU info: Intel(R) Xeon(R) CPU E5-2699 v4 @ 2.20GHz
	GCC Version: gcc (GCC) 8.2.1 20180905 (Red Hat 8.2.1-3)
	Clang Version: 7.0.1 (tags/RELEASE_701/final)
	./build-gcc-static
	./build-gcc-shared
	./build-clang-static
	./build-clang-shared
	./build-x86-default


OS: FC31-64
	Kernel Version: 5.4.18-200.fc31.x86_64
	CPU info: Intel(R) Xeon(R) CPU E5-2699 v4 @ 2.20GHz
	GCC Version: gcc (GCC) 9.2.1 20190827 (Red Hat 9.2.1-1)
	Clang Version: 9.0.0 (Fedora 9.0.0-1.fc31)
	./build-gcc-static
	./build-gcc-shared
	./build-clang-static
	./build-clang-shared
	./build-x86-default


OS: WIN10-64
	Kernel Version: N/A
	CPU info: N/A
	GCC Version: N/A
	Clang Version: Clang 8.0.0
	x86_64-windows-clang


OS: FreeBSD1201-64
	Kernel Version: 12.1-RELEASE
	CPU info: Intel(R) Xeon(R) CPU E5-2699 v4 @ 2.20GHz (2194.98-MHz K8-class CPU)
	GCC Version: gcc (FreeBSD Ports Collection) 9.2.0
	Clang Version: 8.0.1 (tags/RELEASE_801/final 366581) (based on LLVM 8.0.1)
	./build-gcc-static
	./build-gcc-shared
	./build-clang-static
	./build-clang-shared
	./build-x86-default


OS: SUSE15-64
	Kernel Version: 4.12.14-lp150.12.82-default
	CPU info: Intel(R) Xeon(R) CPU E5-2699 v4 @ 2.20GHz
	GCC Version: gcc (SUSE Linux) 7.4.1 20190905 [gcc-7-branch revision 275407]
	Clang Version: 5.0.1 (tags/RELEASE_501/final 312548)
	./build-gcc-static
	./build-gcc-shared
	./build-clang-static
	./build-clang-shared
	./build-x86-default


*Make Build Failed #1:
OS: FreeBSD1201-64
Target: x86_64-native-bsdapp-clang
/root/FreeBSD1201-64_K12.1_Clang8.0.1/x86_64-native-bsdapp-clang/7ec4f674f8ca47a483c572cb6d9e0854/dpdk/drivers/net/bnxt/tf_core/stack.c:76:11: error: use of undeclared identifier 'ENODATA'
                return -ENODATA;
                        ^
1 error generated.
  CC sfc_ev.o
gmake[6]: *** [/root/FreeBSD1201-64_K12.1_Clang8.0.1/x86_64-native-bsdapp-clang/7ec4f674f8ca47a483c572cb6d9e0854/dpdk/mk/internal/rte.compile-pre.mk:116: tf_core/stack.o] Error 1
gmake[6]: *** Waiting for unfinished jobs....
  CC otx2_rss.o
  CC tf_core/tf_em.o
  PMDINFO nicvf_ethdev.o.pmd.c
  CC nicvf_ethdev.o.pmd.o
  LD nicvf_ethdev.o
  CC sfc_port.o
  CC vmxnet3_ethdev.o
  CC virtio_rxtx.o
gmake[5]: *** [/root/FreeBSD1201-64_K12.1_Clang8.0.1/x86_64-native-bsdapp-clang/7ec4f674f8ca47a483c572cb6d9e0854/dpdk/mk/rte.subdir.mk:35: bnxt] Error 2
gmake[5]: *** Waiting for unfinished jobs....
  CC nicvf_bsvf.o
  CC virtio_ethdev.o
  CC ecore_init_ops.o
  CC otx2_mac.o
--
  CC hunt_nic.o
  CC medford_nic.o
  CC medford2_nic.o
  AR librte_pmd_sfc_efx.a
  INSTALL-LIB librte_pmd_sfc_efx.a
gmake[4]: *** [/root/FreeBSD1201-64_K12.1_Clang8.0.1/x86_64-native-bsdapp-clang/7ec4f674f8ca47a483c572cb6d9e0854/dpdk/mk/rte.subdir.mk:35: net] Error 2
gmake[3]: *** [/root/FreeBSD1201-64_K12.1_Clang8.0.1/x86_64-native-bsdapp-clang/7ec4f674f8ca47a483c572cb6d9e0854/dpdk/mk/rte.sdkbuild.mk:46: drivers] Error 2
gmake[2]: *** [/root/FreeBSD1201-64_K12.1_Clang8.0.1/x86_64-native-bsdapp-clang/7ec4f674f8ca47a483c572cb6d9e0854/dpdk/mk/rte.sdkroot.mk:99: all] Error 2
gmake[1]: *** [/root/FreeBSD1201-64_K12.1_Clang8.0.1/x86_64-native-bsdapp-clang/7ec4f674f8ca47a483c572cb6d9e0854/dpdk/mk/rte.sdkinstall.mk:61: pre_install] Error 2
gmake: *** [/root/FreeBSD1201-64_K12.1_Clang8.0.1/x86_64-native-bsdapp-clang/7ec4f674f8ca47a483c572cb6d9e0854/dpdk/mk/rte.sdkroot.mk:77: install] Error 2


*Make Build Failed #2:
OS: FreeBSD1201-64
Target: x86_64-native-bsdapp-gcc+debug
/root/FreeBSD1201-64_K12.1_GCC7.3.0/x86_64-native-bsdapp-gcc+debug/7ec4f674f8ca47a483c572cb6d9e0854/dpdk/drivers/net/bnxt/tf_core/stack.c: In function 'stack_pop':
/root/FreeBSD1201-64_K12.1_GCC7.3.0/x86_64-native-bsdapp-gcc+debug/7ec4f674f8ca47a483c572cb6d9e0854/dpdk/drivers/net/bnxt/tf_core/stack.c:76:11: error: 'ENODATA' undeclared (first use in this function)
   76 |   return -ENODATA;
      |           ^~~~~~~
/root/FreeBSD1201-64_K12.1_GCC7.3.0/x86_64-native-bsdapp-gcc+debug/7ec4f674f8ca47a483c572cb6d9e0854/dpdk/drivers/net/bnxt/tf_core/stack.c:76:11: note: each undeclared identifier is reported only once for each function it appears in
gmake[6]: *** [/root/FreeBSD1201-64_K12.1_GCC7.3.0/x86_64-native-bsdapp-gcc+debug/7ec4f674f8ca47a483c572cb6d9e0854/dpdk/mk/internal/rte.compile-pre.mk:116: tf_core/stack.o] Error 1
gmake[5]: *** [/root/FreeBSD1201-64_K12.1_GCC7.3.0/x86_64-native-bsdapp-gcc+debug/7ec4f674f8ca47a483c572cb6d9e0854/dpdk/mk/rte.subdir.mk:37: bnxt] Error 2
gmake[5]: *** Waiting for unfinished jobs....
  CC otx2_ptp.o
  CC sfc_intr.o
  CC ice_generic_flow.o
  CC sfc_ev.o
--
  CC hunt_nic.o
  CC medford_nic.o
  CC medford2_nic.o
  AR librte_pmd_sfc_efx.a
  INSTALL-LIB librte_pmd_sfc_efx.a
gmake[4]: *** [/root/FreeBSD1201-64_K12.1_GCC7.3.0/x86_64-native-bsdapp-gcc+debug/7ec4f674f8ca47a483c572cb6d9e0854/dpdk/mk/rte.subdir.mk:35: net] Error 2
gmake[3]: *** [/root/FreeBSD1201-64_K12.1_GCC7.3.0/x86_64-native-bsdapp-gcc+debug/7ec4f674f8ca47a483c572cb6d9e0854/dpdk/mk/rte.sdkbuild.mk:46: drivers] Error 2
gmake[2]: *** [/root/FreeBSD1201-64_K12.1_GCC7.3.0/x86_64-native-bsdapp-gcc+debug/7ec4f674f8ca47a483c572cb6d9e0854/dpdk/mk/rte.sdkroot.mk:99: all] Error 2
gmake[1]: *** [/root/FreeBSD1201-64_K12.1_GCC7.3.0/x86_64-native-bsdapp-gcc+debug/7ec4f674f8ca47a483c572cb6d9e0854/dpdk/mk/rte.sdkinstall.mk:61: pre_install] Error 2
gmake: *** [/root/FreeBSD1201-64_K12.1_GCC7.3.0/x86_64-native-bsdapp-gcc+debug/7ec4f674f8ca47a483c572cb6d9e0854/dpdk/mk/rte.sdkroot.mk:77: install] Error 2


*Make Build Failed #3:
OS: FreeBSD1201-64
Target: x86_64-native-bsdapp-gcc
/root/FreeBSD1201-64_K12.1_GCC9.2.0/x86_64-native-bsdapp-gcc/7ec4f674f8ca47a483c572cb6d9e0854/dpdk/drivers/net/bnxt/tf_core/stack.c: In function 'stack_pop':
/root/FreeBSD1201-64_K12.1_GCC9.2.0/x86_64-native-bsdapp-gcc/7ec4f674f8ca47a483c572cb6d9e0854/dpdk/drivers/net/bnxt/tf_core/stack.c:76:11: error: 'ENODATA' undeclared (first use in this function)
   76 |   return -ENODATA;
      |           ^~~~~~~
/root/FreeBSD1201-64_K12.1_GCC9.2.0/x86_64-native-bsdapp-gcc/7ec4f674f8ca47a483c572cb6d9e0854/dpdk/drivers/net/bnxt/tf_core/stack.c:76:11: note: each undeclared identifier is reported only once for each function it appears in
gmake[6]: *** [/root/FreeBSD1201-64_K12.1_GCC9.2.0/x86_64-native-bsdapp-gcc/7ec4f674f8ca47a483c572cb6d9e0854/dpdk/mk/internal/rte.compile-pre.mk:116: tf_core/stack.o] Error 1
gmake[5]: *** [/root/FreeBSD1201-64_K12.1_GCC9.2.0/x86_64-native-bsdapp-gcc/7ec4f674f8ca47a483c572cb6d9e0854/dpdk/mk/rte.subdir.mk:37: bnxt] Error 2
gmake[5]: *** Waiting for unfinished jobs....
  CC nicvf_hw.o
  CC ixgbe_ipsec.o
  CC ecore_dcbx.o
  CC otx2_lookup.o
--
  CC medford_nic.o
  CC hunt_nic.o
  CC medford2_nic.o
  AR librte_pmd_sfc_efx.a
  INSTALL-LIB librte_pmd_sfc_efx.a
gmake[4]: *** [/root/FreeBSD1201-64_K12.1_GCC9.2.0/x86_64-native-bsdapp-gcc/7ec4f674f8ca47a483c572cb6d9e0854/dpdk/mk/rte.subdir.mk:35: net] Error 2
gmake[3]: *** [/root/FreeBSD1201-64_K12.1_GCC9.2.0/x86_64-native-bsdapp-gcc/7ec4f674f8ca47a483c572cb6d9e0854/dpdk/mk/rte.sdkbuild.mk:46: drivers] Error 2
gmake[2]: *** [/root/FreeBSD1201-64_K12.1_GCC9.2.0/x86_64-native-bsdapp-gcc/7ec4f674f8ca47a483c572cb6d9e0854/dpdk/mk/rte.sdkroot.mk:99: all] Error 2
gmake[1]: *** [/root/FreeBSD1201-64_K12.1_GCC9.2.0/x86_64-native-bsdapp-gcc/7ec4f674f8ca47a483c572cb6d9e0854/dpdk/mk/rte.sdkinstall.mk:61: pre_install] Error 2
gmake: *** [/root/FreeBSD1201-64_K12.1_GCC9.2.0/x86_64-native-bsdapp-gcc/7ec4f674f8ca47a483c572cb6d9e0854/dpdk/mk/rte.sdkroot.mk:77: install] Error 2


*Make Build Failed #4:
OS: FreeBSD1201-64
Target: x86_64-native-bsdapp-gcc+shared
/root/FreeBSD1201-64_K12.1_GCC7.3.0/x86_64-native-bsdapp-gcc+shared/7ec4f674f8ca47a483c572cb6d9e0854/dpdk/drivers/net/bnxt/tf_core/stack.c: In function 'stack_pop':
/root/FreeBSD1201-64_K12.1_GCC7.3.0/x86_64-native-bsdapp-gcc+shared/7ec4f674f8ca47a483c572cb6d9e0854/dpdk/drivers/net/bnxt/tf_core/stack.c:76:11: error: 'ENODATA' undeclared (first use in this function)
   76 |   return -ENODATA;
      |           ^~~~~~~
/root/FreeBSD1201-64_K12.1_GCC7.3.0/x86_64-native-bsdapp-gcc+shared/7ec4f674f8ca47a483c572cb6d9e0854/dpdk/drivers/net/bnxt/tf_core/stack.c:76:11: note: each undeclared identifier is reported only once for each function it appears in
gmake[6]: *** [/root/FreeBSD1201-64_K12.1_GCC7.3.0/x86_64-native-bsdapp-gcc+shared/7ec4f674f8ca47a483c572cb6d9e0854/dpdk/mk/internal/rte.compile-pre.mk:116: tf_core/stack.o] Error 1
gmake[6]: *** Waiting for unfinished jobs....
  LD librte_pmd_virtio.so.20.0.2
  CC otx2_ethdev_sec.o
  CC qede_ethdev.o
  INSTALL-LIB librte_pmd_ixgbe.so.20.0.2
gmake[5]: *** [/root/FreeBSD1201-64_K12.1_GCC7.3.0/x86_64-native-bsdapp-gcc+shared/7ec4f674f8ca47a483c572cb6d9e0854/dpdk/mk/rte.subdir.mk:35: bnxt] Error 2
gmake[5]: *** Waiting for unfinished jobs....
  CC efx_ev.o
  INSTALL-LIB librte_pmd_virtio.so.20.0.2
  CC efx_evb.o
  CC otx2_ethdev_debug.o
--
  CC hunt_nic.o
  CC medford_nic.o
  CC medford2_nic.o
  LD librte_pmd_sfc_efx.so.20.0.2
  INSTALL-LIB librte_pmd_sfc_efx.so.20.0.2
gmake[4]: *** [/root/FreeBSD1201-64_K12.1_GCC7.3.0/x86_64-native-bsdapp-gcc+shared/7ec4f674f8ca47a483c572cb6d9e0854/dpdk/mk/rte.subdir.mk:35: net] Error 2
gmake[3]: *** [/root/FreeBSD1201-64_K12.1_GCC7.3.0/x86_64-native-bsdapp-gcc+shared/7ec4f674f8ca47a483c572cb6d9e0854/dpdk/mk/rte.sdkbuild.mk:46: drivers] Error 2
gmake[2]: *** [/root/FreeBSD1201-64_K12.1_GCC7.3.0/x86_64-native-bsdapp-gcc+shared/7ec4f674f8ca47a483c572cb6d9e0854/dpdk/mk/rte.sdkroot.mk:99: all] Error 2
gmake[1]: *** [/root/FreeBSD1201-64_K12.1_GCC7.3.0/x86_64-native-bsdapp-gcc+shared/7ec4f674f8ca47a483c572cb6d9e0854/dpdk/mk/rte.sdkinstall.mk:61: pre_install] Error 2
gmake: *** [/root/FreeBSD1201-64_K12.1_GCC7.3.0/x86_64-native-bsdapp-gcc+shared/7ec4f674f8ca47a483c572cb6d9e0854/dpdk/mk/rte.sdkroot.mk:77: install] Error 2

*Meson Build Failed #1:
OS: FreeBSD1201-64
Target:./build-gcc-static
FAILED: drivers/a715181@@tmp_rte_pmd_bnxt at sta/net_bnxt_tf_core_stack.c.o 
gcc -Idrivers/a715181@@tmp_rte_pmd_bnxt at sta -Idrivers -I../drivers -Idrivers/net/bnxt -I../drivers/net/bnxt -I../drivers/net/bnxt/tf_ulp -I../drivers/net/bnxt/tf_core -Ilib/librte_ethdev -I../lib/librte_ethdev -I. -I../ -Iconfig -I../config -Ilib/librte_eal/include -I../lib/librte_eal/include -Ilib/librte_eal/freebsd/include -I../lib/librte_eal/freebsd/include -Ilib/librte_eal/common -I../lib/librte_eal/common -Ilib/librte_eal/x86/include -I../lib/librte_eal/x86/include -Ilib/librte_eal -I../lib/librte_eal -Ilib/librte_kvargs -I../lib/librte_kvargs -Ilib/librte_net -I../lib/librte_net -Ilib/librte_mbuf -I../lib/librte_mbuf -Ilib/librte_mempool -I../lib/librte_mempool -Ilib/librte_ring -I../lib/librte_ring -Ilib/librte_meter -I../lib/librte_meter -Idrivers/bus/pci -I../drivers/bus/pci -I../drivers/bus/pci/bsd -Ilib/librte_pci -I../lib/librte_pci -Idrivers/bus/vdev -I../drivers/bus/vdev -fdiagnostics-color=always -pipe -D_FILE_OFFSET_BITS=64 -Wall -Winvalid-pch -Werror -O2 -g -include rte_config.h -Wextra -Wcast-qual -Wdeprecated -Wformat-nonliteral -Wformat-security -Wmissing-declarations -Wmissing-prototypes -Wnested-externs -Wold-style-definition -Wpointer-arith -Wsign-compare -Wstrict-prototypes -Wundef -Wwrite-strings -Wno-address-of-packed-member -Wno-packed-not-aligned -Wno-missing-field-initializers -D_GNU_SOURCE -D__BSD_VISIBLE -fPIC -march=native -DALLOW_EXPERIMENTAL_API -Wno-format-truncation -MD -MQ 'drivers/a715181@@tmp_rte_pmd_bnxt at sta/net_bnxt_tf_core_stack.c.o' -MF 'drivers/a715181@@tmp_rte_pmd_bnxt at sta/net_bnxt_tf_core_stack.c.o.d' -o 'drivers/a715181@@tmp_rte_pmd_bnxt at sta/net_bnxt_tf_core_stack.c.o' -c ../drivers/net/bnxt/tf_core/stack.c
../drivers/net/bnxt/tf_core/stack.c: In function 'stack_pop':
../drivers/net/bnxt/tf_core/stack.c:76:11: error: 'ENODATA' undeclared (first use in this function)
   76 |   return -ENODATA;
      |           ^~~~~~~
../drivers/net/bnxt/tf_core/stack.c:76:11: note: each undeclared identifier is reported only once for each function it appears in
[671/1692] Compiling C object 'drivers/a715181@@tmp_rte_pmd_bnxt at sta/net_bnxt_tf_core_tf_em.c.o'.
[672/1692] Compiling C object 'drivers/net/fm10k/base/cb94eca@@fm10k_base at sta/fm10k_mbx.c.o'.
[673/1692] Compiling C object 'drivers/net/fm10k/base/cb94eca@@fm10k_base at sta/fm10k_pf.c.o'.
[674/1692] Compiling C object 'drivers/a715181@@tmp_rte_pmd_bnxt at sta/net_bnxt_tf_core_tfp.c.o'.
[675/1692] Compiling C object 'drivers/a715181@@tmp_rte_pmd_bnxt at sta/net_bnxt_tf_core_tf_rm.c.o'.
[676/1692] Compiling C object 'drivers/a715181@@tmp_rte_pmd_bnxt at sta/net_bnxt_tf_core_tf_tbl.c.o'.
[677/1692] Compiling C object 'drivers/a715181@@tmp_rte_pmd_failsafe at sta/net_failsafe_failsafe_ops.c.o'.
[678/1692] Compiling C object 'drivers/a715181@@tmp_rte_pmd_fm10k at sta/net_fm10k_fm10k_rxtx.c.o'.
[679/1692] Compiling C object 'drivers/a715181@@tmp_rte_pmd_fm10k at sta/net_fm10k_fm10k_ethdev.c.o'.
ninja: build stopped: subcommand failed



DPDK STV team


More information about the test-report mailing list