[dpdk-test-report] |FAILURE| pw(75327) [v2] vhost: add device reset status

sys_stv at intel.com sys_stv at intel.com
Mon Aug 10 07:08:35 CEST 2020


Test-Label: Intel-compilation
Test-Status: FAILURE
http://dpdk.org/patch/75327

_Compilation issues_

Submitter: Chenbo Xia <chenbo.xia at intel.com>
Date: 2020-08-10 13:11:05
Reply_mail: 20200810131105.17006-1-chenbo.xia at intel.com

DPDK git baseline: Repo:dpdk-next-virtio, CommitID: 89f6a4be217f22f7592b616d5d69c775530dce88


Meson build Summary: 8 Builds Done, 3 Successful, 5 Failures, 0 Blocked

Makefile build Summary: 20 Builds Done, 4 Successful, 16 Failures, 0 Blocked

                +==============================================+===========+==========+
                |                   Makefile                   |   Meson   | Document |
+----------------+------+-------+------+------------+-----------+-----------+----------+
| os             | gcc  | clang | icc  | gcc+shared | gcc+debug | gcc/clang | pdf/html |
+----------------+------+-------+------+------------+-----------+-----------+----------+
| CENTOS82-64    | FAIL | FAIL  | FAIL | FAIL       | FAIL      | FAIL      |          |
| RHEL82-64      | FAIL |       |      |            |           |           |          |
| UB1804-64      | FAIL |       |      |            |           |           |          |
| FC32-64        | FAIL | FAIL  |      |            |           | FAIL      |          |
| CENTOS77-64    | FAIL |       |      |            |           |           |          |
| UB2004-64      | FAIL | FAIL  | FAIL |            |           | FAIL      | pass     |
| WIN10-64       |      |       |      |            |           | pass      |          |
| UB2004-32      | FAIL |       |      |            |           |           |          |
| UB1804-32      |      |       |      |            |           | FAIL      |          |
| FreeBSD1201-64 | pass | pass  |      | pass       | pass      | pass      |          |
| SUSE15-64      | FAIL | FAIL  |      |            |           | FAIL      |          |
+----------------+------+-------+------+------------+-----------+-----------+----------+
Test environment and configuration as below:

** Makefile build **


OS: CENTOS82-64
	Kernel Version: 4.18.0-193.el8.x86_64
	CPU info: Intel(R) Xeon(R) Platinum 8280M CPU @ 2.70GHz
	GCC Version: gcc (GCC) 8.3.1 20191121 (Red Hat 8.3.1-5)
	Clang Version: 9.0.1 (Red Hat 9.0.1-2.module_el8.2.0+309+0c7b6b03)
	x86_64-native-linuxapp-gcc
	x86_64-native-linuxapp-clang
	x86_64-native-linuxapp-icc
	x86_64-native-linuxapp-gcc+shared
	x86_64-native-linuxapp-gcc+debug


OS: RHEL82-64
	Kernel Version: 4.18.0-193.el8.x86_64
	CPU info: Intel(R) Xeon(R) Platinum 8280M CPU @ 2.70GHz
	GCC Version: gcc (GCC) 8.3.1 20191121 (Red Hat 8.3.1-5)
	Clang Version: 8.0.1 (Red Hat 8.0.1-1.module_el8.1.0+215+a01033fb)
	x86_64-native-linuxapp-gcc


OS: UB1804-64
	Kernel Version: 4.15.0-29-generic
	CPU info: Intel(R) Xeon(R) Platinum 8180 CPU @ 2.50GHz
	GCC Version: gcc (Ubuntu 7.5.0-3ubuntu1~18.04) 7.5.0
	Clang Version: 6.0.0-1ubuntu2 (tags/RELEASE_600/final)
	x86_64-native-linuxapp-gcc


OS: FC32-64
	Kernel Version: 5.6.0-0.rc7.git0.2.fc32.x86_64
	CPU info: Intel(R) Xeon(R) Platinum 8280M CPU @ 2.70GHz
	GCC Version: gcc (GCC) 10.0.1 20200311 (Red Hat 10.0.1-0.9)
	Clang Version: 10.0.0 (Fedora 10.0.0-0.3.rc4.fc32)
	x86_64-native-linuxapp-gcc
	x86_64-native-linuxapp-clang


OS: CENTOS77-64
	Kernel Version: 3.10.0-1062.9.1.el7.x86_64
	CPU info: Intel(R) Xeon(R) Platinum 8280M CPU @ 2.70GHz
	GCC Version: gcc (GCC) 4.8.5 20150623 (Red Hat 4.8.5-39)
	Clang Version: 3.4.2 (tags/RELEASE_34/dot2-final)
	x86_64-native-linuxapp-gcc


OS: UB2004-64
	Kernel Version: 5.4.0-26-generic
	CPU info: Intel(R) Xeon(R) Platinum 8180 CPU @ 2.50GHz
	GCC Version: gcc (Ubuntu 10-20200416-0ubuntu1) 10.0.1 20200416 (experimental) [master revision 3c3f12e2a76:dcee354ce56:44b326839d864fc10c459916abcc97f35a9ac3de]
	Clang Version: 10.0.0-4ubuntu1
	x86_64-native-linuxapp-clang
	x86_64-native-linuxapp-gcc
	x86_64-native-linuxapp-icc


OS: UB2004-32
	Kernel Version: 5.4.0-26-generic
	CPU info: Intel(R) Xeon(R) Platinum 8180 CPU @ 2.50GHz
	GCC Version: gcc (Ubuntu 9.3.0-10ubuntu2) 9.3.0
	Clang Version: 10.0.0-4ubuntu1
	i686-native-linuxapp-gcc


OS: FreeBSD1201-64
	Kernel Version: 12.1-RELEASE
	CPU info: Intel(R) Xeon(R) CPU E5-2699 v3 @ 2.30GHz (2294.74-MHz K8-class CPU)
	GCC Version: gcc (FreeBSD Ports Collection) 9.2.0
	Clang Version: 8.0.1 (tags/RELEASE_801/final 366581) (based on LLVM 8.0.1)
	x86_64-native-bsdapp-gcc
	x86_64-native-bsdapp-clang
	x86_64-native-bsdapp-gcc+shared
	x86_64-native-bsdapp-gcc+debug


OS: SUSE15-64
	Kernel Version: 4.12.14-lp150.11-default
	CPU info: Intel(R) Xeon(R) CPU E5-2699 v4 @ 2.20GHz
	GCC Version: gcc (SUSE Linux) 7.3.1 20180323 [gcc-7-branch revision 258812]
	Clang Version: 5.0.1 (tags/RELEASE_501/final 312548)
	x86_64-native-linuxapp-clang
	x86_64-native-linuxapp-gcc

** Meson build **


OS: CENTOS82-64
	Kernel Version: 4.18.0-193.el8.x86_64
	CPU info: Intel(R) Xeon(R) CPU E5-2699 v4 @ 2.20GHz
	GCC Version: gcc (GCC) 8.3.1 20191121 (Red Hat 8.3.1-5)
	Clang Version: 9.0.1 (Red Hat 9.0.1-2.module_el8.2.0+309+0c7b6b03)
	./build-gcc-static
	./build-gcc-shared
	./build-clang-static
	./build-clang-shared
	./build-x86-default


OS: UB2004-64
	Kernel Version: 5.4.0-26-generic
	CPU info: Intel(R) Xeon(R) Platinum 8180 CPU @ 2.50GHz
	GCC Version: gcc (Ubuntu 9.3.0-10ubuntu2) 9.3.0
	Clang Version: 10.0.0-4ubuntu1
	x86_64-native-linuxapp-doc
	./build-gcc-static
	./build-gcc-shared
	./build-clang-static
	./build-clang-shared
	./build-x86-default


OS: FC32-64
	Kernel Version: 5.6.0-0.rc7.git0.2.fc32.x86_64
	CPU info: Intel(R) Xeon(R) CPU E5-2699 v4 @ 2.20GHz
	GCC Version: gcc (GCC) 10.0.1 20200311 (Red Hat 10.0.1-0.9)
	Clang Version: 10.0.0 (Fedora 10.0.0-0.3.rc4.fc32)
	./build-gcc-static
	./build-gcc-shared
	./build-clang-static
	./build-clang-shared
	./build-x86-default


OS: WIN10-64
	Kernel Version: N/A
	CPU info: N/A
	GCC Version: N/A
	Clang Version: Clang 8.0.0
	x86_64-windows-clang


OS: UB1804-32
	Kernel Version: 4.15.0-20-generic
	CPU info: Intel(R) Xeon(R) CPU E5-2699 v4 @ 2.20GHz
	GCC Version: gcc (Ubuntu 7.5.0-3ubuntu1~18.04) 7.5.0
	Clang Version: 6.0.0-1ubuntu2 (tags/RELEASE_600/final)
	./build-gcc-static
	./build-gcc-shared
	./build-clang-static
	./build-clang-shared
	./build-x86-default


OS: FreeBSD1201-64
	Kernel Version: 12.1-RELEASE
	CPU info: Intel(R) Xeon(R) CPU E5-2699 v4 @ 2.20GHz (2194.97-MHz K8-class CPU)
	GCC Version: gcc (FreeBSD Ports Collection) 9.2.0
	Clang Version: 8.0.1 (tags/RELEASE_801/final 366581) (based on LLVM 8.0.1)
	./build-gcc-static
	./build-gcc-shared
	./build-clang-static
	./build-clang-shared
	./build-x86-default


OS: SUSE15-64
	Kernel Version: 4.12.14-lp150.12.82-default
	CPU info: Intel(R) Xeon(R) CPU E5-2699 v4 @ 2.20GHz
	GCC Version: gcc (SUSE Linux) 7.4.1 20190905 [gcc-7-branch revision 275407]
	Clang Version: 5.0.1 (tags/RELEASE_501/final 312548)
	./build-gcc-static
	./build-gcc-shared
	./build-clang-static
	./build-clang-shared
	./build-x86-default



*Meson Build Failed #1:
OS: CENTOS82-64
Target:./build-gcc-static
FAILED: lib/76b5a35@@rte_vhost at sta/librte_vhost_vhost_user.c.o 
gcc -Ilib/76b5a35@@rte_vhost at sta -Ilib -I../lib -Ilib/librte_vhost -I../lib/librte_vhost -I. -I../ -Iconfig -I../config -Ilib/librte_eal/include -I../lib/librte_eal/include -Ilib/librte_eal/linux/include -I../lib/librte_eal/linux/include -Ilib/librte_eal/x86/include -I../lib/librte_eal/x86/include -Ilib/librte_eal/common -I../lib/librte_eal/common -Ilib/librte_eal -I../lib/librte_eal -Ilib/librte_kvargs -I../lib/librte_kvargs -Ilib/librte_telemetry/../librte_metrics -I../lib/librte_telemetry/../librte_metrics -Ilib/librte_telemetry -I../lib/librte_telemetry -Ilib/librte_ethdev -I../lib/librte_ethdev -Ilib/librte_net -I../lib/librte_net -Ilib/librte_mbuf -I../lib/librte_mbuf -Ilib/librte_mempool -I../lib/librte_mempool -Ilib/librte_ring -I../lib/librte_ring -Ilib/librte_meter -I../lib/librte_meter -Ilib/librte_cryptodev -I../lib/librte_cryptodev -Ilib/librte_hash -I../lib/librte_hash -Ilib/librte_pci -I../lib/librte_pci -fdiagnostics-color=always -pipe -D_FILE_OFFSET_BITS=64 -Wall -Winvalid-pch -Werror -O2 -g -include rte_config.h -Wextra -Wcast-qual -Wdeprecated -Wformat-nonliteral -Wformat-security -Wmissing-declarations -Wmissing-prototypes -Wnested-externs -Wold-style-definition -Wpointer-arith -Wsign-compare -Wstrict-prototypes -Wundef -Wwrite-strings -Wno-packed-not-aligned -Wno-missing-field-initializers -D_GNU_SOURCE -fPIC -march=native -mno-avx512f -DALLOW_EXPERIMENTAL_API -DALLOW_INTERNAL_API -Wno-format-truncation -DVHOST_GCC_UNROLL_PRAGMA -fno-strict-aliasing -MD -MQ 'lib/76b5a35@@rte_vhost at sta/librte_vhost_vhost_user.c.o' -MF 'lib/76b5a35@@rte_vhost at sta/librte_vhost_vhost_user.c.o.d' -o 'lib/76b5a35@@rte_vhost at sta/librte_vhost_vhost_user.c.o' -c ../lib/librte_vhost/vhost_user.c
In file included from ../lib/librte_vhost/iotlb.h:10,
                 from ../lib/librte_vhost/vhost_user.c:49:
../lib/librte_vhost/vhost_user.c: In function ‘vhost_user_set_status’:
../lib/librte_vhost/vhost_user.c:2542:20: error: ‘VIRTIO_CONFIG_STATUS_RESET’ undeclared (first use in this function); did you mean ‘VIRTIO_CONFIG_S_NEEDS_RESET’?
    (dev->status == VIRTIO_CONFIG_STATUS_RESET),
                    ^~~~~~~~~~~~~~~~~~~~~~~~~~
../lib/librte_vhost/vhost.h:541:27: note: in definition of macro ‘VHOST_LOG_CONFIG’
   "VHOST_CONFIG: " fmt, ##args)
                           ^~~~
../lib/librte_vhost/vhost_user.c:2542:20: note: each undeclared identifier is reported only once for each function it appears in
    (dev->status == VIRTIO_CONFIG_STATUS_RESET),
                    ^~~~~~~~~~~~~~~~~~~~~~~~~~
../lib/librte_vhost/vhost.h:541:27: note: in definition of macro ‘VHOST_LOG_CONFIG’
   "VHOST_CONFIG: " fmt, ##args)
                           ^~~~
[418/2395] Generating security.sym_chk with a meson_exe.py custom command.
[419/2395] Compiling C object 'lib/76b5a35@@rte_sched at sta/librte_sched_rte_sched.c.o'.
[420/2395] Generating symbol file 'lib/76b5a35@@rte_reorder at sha/librte_reorder.so.20.0.3.symbols'.
[421/2395] Generating rib.sym_chk with a meson_exe.py custom command.
[422/2395] Generating symbol file 'lib/76b5a35@@rte_stack at sha/librte_stack.so.20.0.3.symbols'.
[423/2395] Compiling C object 'lib/76b5a35@@rte_ipsec at sta/librte_ipsec_sa.c.o'.
[424/2395] Compiling C object 'lib/76b5a35@@rte_vhost at sta/librte_vhost_vhost.c.o'.
[425/2395] Compiling C object 'lib/76b5a35@@rte_ipsec at sta/librte_ipsec_esp_outb.c.o'.
[426/2395] Compiling C object 'lib/76b5a35@@rte_ipsec at sta/librte_ipsec_esp_inb.c.o'.
[427/2395] Compiling C object 'lib/76b5a35@@rte_vhost at sta/librte_vhost_vhost_crypto.c.o'.
[428/2395] Compiling C object 'lib/76b5a35@@rte_vhost at sta/librte_vhost_virtio_net.c.o'.
ninja: build stopped: subcommand failed




*Meson Build Failed #2:
OS: FC32-64
Target:./build-gcc-static
FAILED: lib/76b5a35@@rte_vhost at sta/librte_vhost_vhost_user.c.o 
gcc -Ilib/76b5a35@@rte_vhost at sta -Ilib -I../lib -Ilib/librte_vhost -I../lib/librte_vhost -I. -I../ -Iconfig -I../config -Ilib/librte_eal/include -I../lib/librte_eal/include -Ilib/librte_eal/linux/include -I../lib/librte_eal/linux/include -Ilib/librte_eal/x86/include -I../lib/librte_eal/x86/include -Ilib/librte_eal/common -I../lib/librte_eal/common -Ilib/librte_eal -I../lib/librte_eal -Ilib/librte_kvargs -I../lib/librte_kvargs -Ilib/librte_telemetry/../librte_metrics -I../lib/librte_telemetry/../librte_metrics -Ilib/librte_telemetry -I../lib/librte_telemetry -Ilib/librte_ethdev -I../lib/librte_ethdev -Ilib/librte_net -I../lib/librte_net -Ilib/librte_mbuf -I../lib/librte_mbuf -Ilib/librte_mempool -I../lib/librte_mempool -Ilib/librte_ring -I../lib/librte_ring -Ilib/librte_meter -I../lib/librte_meter -Ilib/librte_cryptodev -I../lib/librte_cryptodev -Ilib/librte_hash -I../lib/librte_hash -Ilib/librte_pci -I../lib/librte_pci -fdiagnostics-color=always -pipe -D_FILE_OFFSET_BITS=64 -Wall -Winvalid-pch -Werror -O2 -g -include rte_config.h -Wextra -Wcast-qual -Wdeprecated -Wformat-nonliteral -Wformat-security -Wmissing-declarations -Wmissing-prototypes -Wnested-externs -Wold-style-definition -Wpointer-arith -Wsign-compare -Wstrict-prototypes -Wundef -Wwrite-strings -Wno-address-of-packed-member -Wno-packed-not-aligned -Wno-missing-field-initializers -Wno-zero-length-bounds -D_GNU_SOURCE -fPIC -march=native -DALLOW_EXPERIMENTAL_API -DALLOW_INTERNAL_API -Wno-format-truncation -DVHOST_GCC_UNROLL_PRAGMA -fno-strict-aliasing -MD -MQ 'lib/76b5a35@@rte_vhost at sta/librte_vhost_vhost_user.c.o' -MF 'lib/76b5a35@@rte_vhost at sta/librte_vhost_vhost_user.c.o.d' -o 'lib/76b5a35@@rte_vhost at sta/librte_vhost_vhost_user.c.o' -c ../lib/librte_vhost/vhost_user.c
In file included from ../lib/librte_vhost/iotlb.h:10,
                 from ../lib/librte_vhost/vhost_user.c:49:
../lib/librte_vhost/vhost_user.c: In function ‘vhost_user_set_status’:
../lib/librte_vhost/vhost_user.c:2542:20: error: ‘VIRTIO_CONFIG_STATUS_RESET’ undeclared (first use in this function); did you mean ‘VIRTIO_CONFIG_S_NEEDS_RESET’?
 2542 |    (dev->status == VIRTIO_CONFIG_STATUS_RESET),
      |                    ^~~~~~~~~~~~~~~~~~~~~~~~~~
../lib/librte_vhost/vhost.h:541:27: note: in definition of macro ‘VHOST_LOG_CONFIG’
  541 |   "VHOST_CONFIG: " fmt, ##args)
      |                           ^~~~
../lib/librte_vhost/vhost_user.c:2542:20: note: each undeclared identifier is reported only once for each function it appears in
 2542 |    (dev->status == VIRTIO_CONFIG_STATUS_RESET),
      |                    ^~~~~~~~~~~~~~~~~~~~~~~~~~
../lib/librte_vhost/vhost.h:541:27: note: in definition of macro ‘VHOST_LOG_CONFIG’
  541 |   "VHOST_CONFIG: " fmt, ##args)
      |                           ^~~~
[425/2396] Generating rib.sym_chk with a meson_exe.py custom command.
[426/2396] Compiling C object 'lib/76b5a35@@rte_ipsec at sta/librte_ipsec_ipsec_sad.c.o'.
[427/2396] Generating sched.sym_chk with a meson_exe.py custom command.
[428/2396] Generating symbol file 'lib/76b5a35@@rte_security at sha/librte_security.so.20.0.3.symbols'.
[429/2396] Compiling C object 'lib/76b5a35@@rte_ipsec at sta/librte_ipsec_ses.c.o'.
[430/2396] Compiling C object 'lib/76b5a35@@rte_ipsec at sta/librte_ipsec_sa.c.o'.
[431/2396] Compiling C object 'lib/76b5a35@@rte_vhost at sta/librte_vhost_vhost.c.o'.
[432/2396] Compiling C object 'lib/76b5a35@@rte_ipsec at sta/librte_ipsec_esp_outb.c.o'.
[433/2396] Compiling C object 'lib/76b5a35@@rte_ipsec at sta/librte_ipsec_esp_inb.c.o'.
[434/2396] Compiling C object 'lib/76b5a35@@rte_vhost at sta/librte_vhost_vhost_crypto.c.o'.
[435/2396] Compiling C object 'lib/76b5a35@@rte_vhost at sta/librte_vhost_virtio_net.c.o'.
ninja: build stopped: subcommand failed




*Meson Build Failed #3:
OS: SUSE15-64
Target:./build-gcc-static
FAILED: lib/76b5a35@@rte_vhost at sta/librte_vhost_vhost_user.c.o 
gcc -Ilib/76b5a35@@rte_vhost at sta -Ilib -I../lib -Ilib/librte_vhost -I../lib/librte_vhost -I. -I../ -Iconfig -I../config -Ilib/librte_eal/include -I../lib/librte_eal/include -Ilib/librte_eal/linux/include -I../lib/librte_eal/linux/include -Ilib/librte_eal/x86/include -I../lib/librte_eal/x86/include -Ilib/librte_eal/common -I../lib/librte_eal/common -Ilib/librte_eal -I../lib/librte_eal -Ilib/librte_kvargs -I../lib/librte_kvargs -Ilib/librte_telemetry/../librte_metrics -I../lib/librte_telemetry/../librte_metrics -Ilib/librte_telemetry -I../lib/librte_telemetry -Ilib/librte_ethdev -I../lib/librte_ethdev -Ilib/librte_net -I../lib/librte_net -Ilib/librte_mbuf -I../lib/librte_mbuf -Ilib/librte_mempool -I../lib/librte_mempool -Ilib/librte_ring -I../lib/librte_ring -Ilib/librte_meter -I../lib/librte_meter -Ilib/librte_cryptodev -I../lib/librte_cryptodev -Ilib/librte_hash -I../lib/librte_hash -Ilib/librte_pci -I../lib/librte_pci -fdiagnostics-color=always -pipe -D_FILE_OFFSET_BITS=64 -Wall -Winvalid-pch -Werror -O2 -g -include rte_config.h -Wextra -Wcast-qual -Wdeprecated -Wformat-nonliteral -Wformat-security -Wmissing-declarations -Wmissing-prototypes -Wnested-externs -Wold-style-definition -Wpointer-arith -Wsign-compare -Wstrict-prototypes -Wundef -Wwrite-strings -Wno-missing-field-initializers -D_GNU_SOURCE -fPIC -march=native -DALLOW_EXPERIMENTAL_API -DALLOW_INTERNAL_API -Wno-format-truncation -fno-strict-aliasing -MD -MQ 'lib/76b5a35@@rte_vhost at sta/librte_vhost_vhost_user.c.o' -MF 'lib/76b5a35@@rte_vhost at sta/librte_vhost_vhost_user.c.o.d' -o 'lib/76b5a35@@rte_vhost at sta/librte_vhost_vhost_user.c.o' -c ../lib/librte_vhost/vhost_user.c
In file included from ../lib/librte_vhost/iotlb.h:10:0,
                 from ../lib/librte_vhost/vhost_user.c:49:
../lib/librte_vhost/vhost_user.c: In function ‘vhost_user_set_status’:
../lib/librte_vhost/vhost_user.c:2542:20: error: ‘VIRTIO_CONFIG_STATUS_RESET’ undeclared (first use in this function); did you mean ‘VIRTIO_CONFIG_S_NEEDS_RESET’?
    (dev->status == VIRTIO_CONFIG_STATUS_RESET),
                    ^
../lib/librte_vhost/vhost.h:541:27: note: in definition of macro ‘VHOST_LOG_CONFIG’
   "VHOST_CONFIG: " fmt, ##args)
                           ^~~~
../lib/librte_vhost/vhost_user.c:2542:20: note: each undeclared identifier is reported only once for each function it appears in
    (dev->status == VIRTIO_CONFIG_STATUS_RESET),
                    ^
../lib/librte_vhost/vhost.h:541:27: note: in definition of macro ‘VHOST_LOG_CONFIG’
   "VHOST_CONFIG: " fmt, ##args)
                           ^~~~
[423/2290] Generating symbol file 'lib/76b5a35@@rte_stack at sha/librte_stack.so.20.0.3.symbols'.
[424/2290] Generating rib.sym_chk with a meson_exe.py custom command.
[425/2290] Compiling C object 'lib/76b5a35@@rte_ipsec at sta/librte_ipsec_ses.c.o'.
[426/2290] Generating sched.sym_chk with a meson_exe.py custom command.
[427/2290] Generating symbol file 'lib/76b5a35@@rte_security at sha/librte_security.so.20.0.3.symbols'.
[428/2290] Compiling C object 'lib/76b5a35@@rte_vhost at sta/librte_vhost_vhost.c.o'.
[429/2290] Compiling C object 'lib/76b5a35@@rte_ipsec at sta/librte_ipsec_esp_outb.c.o'.
[430/2290] Compiling C object 'lib/76b5a35@@rte_vhost at sta/librte_vhost_vhost_crypto.c.o'.
[431/2290] Compiling C object 'lib/76b5a35@@rte_vhost at sta/librte_vhost_virtio_net.c.o'.
ninja: build stopped: subcommand failed




*Meson Build Failed #4:
OS: UB1804-32
Target:./build-gcc-static
FAILED: lib/76b5a35@@rte_vhost at sta/librte_vhost_vhost_user.c.o 
gcc -Ilib/76b5a35@@rte_vhost at sta -Ilib -I../lib -Ilib/librte_vhost -I../lib/librte_vhost -I. -I../ -Iconfig -I../config -Ilib/librte_eal/include -I../lib/librte_eal/include -Ilib/librte_eal/linux/include -I../lib/librte_eal/linux/include -Ilib/librte_eal/x86/include -I../lib/librte_eal/x86/include -Ilib/librte_eal/common -I../lib/librte_eal/common -Ilib/librte_eal -I../lib/librte_eal -Ilib/librte_kvargs -I../lib/librte_kvargs -Ilib/librte_telemetry/../librte_metrics -I../lib/librte_telemetry/../librte_metrics -Ilib/librte_telemetry -I../lib/librte_telemetry -Ilib/librte_ethdev -I../lib/librte_ethdev -Ilib/librte_net -I../lib/librte_net -Ilib/librte_mbuf -I../lib/librte_mbuf -Ilib/librte_mempool -I../lib/librte_mempool -Ilib/librte_ring -I../lib/librte_ring -Ilib/librte_meter -I../lib/librte_meter -Ilib/librte_cryptodev -I../lib/librte_cryptodev -Ilib/librte_hash -I../lib/librte_hash -Ilib/librte_pci -I../lib/librte_pci -fdiagnostics-color=always -pipe -D_FILE_OFFSET_BITS=64 -Wall -Winvalid-pch -Werror -O2 -g -include rte_config.h -Wextra -Wcast-qual -Wdeprecated -Wformat-nonliteral -Wformat-security -Wmissing-declarations -Wmissing-prototypes -Wnested-externs -Wold-style-definition -Wpointer-arith -Wsign-compare -Wstrict-prototypes -Wundef -Wwrite-strings -Wno-missing-field-initializers -Wno-pointer-to-int-cast -D_GNU_SOURCE -m32 -fPIC -march=native -DALLOW_EXPERIMENTAL_API -DALLOW_INTERNAL_API -Wno-format-truncation -fno-strict-aliasing -MD -MQ 'lib/76b5a35@@rte_vhost at sta/librte_vhost_vhost_user.c.o' -MF 'lib/76b5a35@@rte_vhost at sta/librte_vhost_vhost_user.c.o.d' -o 'lib/76b5a35@@rte_vhost at sta/librte_vhost_vhost_user.c.o' -c ../lib/librte_vhost/vhost_user.c
In file included from ../lib/librte_vhost/iotlb.h:10:0,
                 from ../lib/librte_vhost/vhost_user.c:49:
../lib/librte_vhost/vhost_user.c: In function ‘vhost_user_set_status’:
../lib/librte_vhost/vhost_user.c:2542:20: error: ‘VIRTIO_CONFIG_STATUS_RESET’ undeclared (first use in this function); did you mean ‘VIRTIO_CONFIG_S_NEEDS_RESET’?
    (dev->status == VIRTIO_CONFIG_STATUS_RESET),
                    ^
../lib/librte_vhost/vhost.h:541:27: note: in definition of macro ‘VHOST_LOG_CONFIG’
   "VHOST_CONFIG: " fmt, ##args)
                           ^~~~
../lib/librte_vhost/vhost_user.c:2542:20: note: each undeclared identifier is reported only once for each function it appears in
    (dev->status == VIRTIO_CONFIG_STATUS_RESET),
                    ^
../lib/librte_vhost/vhost.h:541:27: note: in definition of macro ‘VHOST_LOG_CONFIG’
   "VHOST_CONFIG: " fmt, ##args)
                           ^~~~
[415/2136] Generating rib.sym_chk with a meson_exe.py custom command.
[416/2136] Compiling C object 'lib/76b5a35@@rte_sched at sta/librte_sched_rte_sched.c.o'.
[417/2136] Generating symbol file 'lib/76b5a35@@rte_security at sha/librte_security.so.20.0.3.symbols'.
[418/2136] Compiling C object 'lib/76b5a35@@rte_ipsec at sta/librte_ipsec_ses.c.o'.
[419/2136] Compiling C object 'lib/76b5a35@@rte_ipsec at sta/librte_ipsec_sa.c.o'.
[420/2136] Compiling C object 'lib/76b5a35@@rte_ipsec at sta/librte_ipsec_ipsec_sad.c.o'.
[421/2136] Compiling C object 'lib/76b5a35@@rte_vhost at sta/librte_vhost_vhost.c.o'.
[422/2136] Compiling C object 'lib/76b5a35@@rte_ipsec at sta/librte_ipsec_esp_inb.c.o'.
[423/2136] Compiling C object 'lib/76b5a35@@rte_ipsec at sta/librte_ipsec_esp_outb.c.o'.
[424/2136] Compiling C object 'lib/76b5a35@@rte_vhost at sta/librte_vhost_vhost_crypto.c.o'.
[425/2136] Compiling C object 'lib/76b5a35@@rte_vhost at sta/librte_vhost_virtio_net.c.o'.
ninja: build stopped: subcommand failed




*Meson Build Failed #5:
OS: UB2004-64
Target:./build-gcc-static
FAILED: lib/76b5a35@@rte_vhost at sta/librte_vhost_vhost_user.c.o 
gcc -Ilib/76b5a35@@rte_vhost at sta -Ilib -I../lib -Ilib/librte_vhost -I../lib/librte_vhost -I. -I../ -Iconfig -I../config -Ilib/librte_eal/include -I../lib/librte_eal/include -Ilib/librte_eal/linux/include -I../lib/librte_eal/linux/include -Ilib/librte_eal/x86/include -I../lib/librte_eal/x86/include -Ilib/librte_eal/common -I../lib/librte_eal/common -Ilib/librte_eal -I../lib/librte_eal -Ilib/librte_kvargs -I../lib/librte_kvargs -Ilib/librte_telemetry/../librte_metrics -I../lib/librte_telemetry/../librte_metrics -Ilib/librte_telemetry -I../lib/librte_telemetry -Ilib/librte_ethdev -I../lib/librte_ethdev -Ilib/librte_net -I../lib/librte_net -Ilib/librte_mbuf -I../lib/librte_mbuf -Ilib/librte_mempool -I../lib/librte_mempool -Ilib/librte_ring -I../lib/librte_ring -Ilib/librte_meter -I../lib/librte_meter -Ilib/librte_cryptodev -I../lib/librte_cryptodev -Ilib/librte_hash -I../lib/librte_hash -Ilib/librte_pci -I../lib/librte_pci -fdiagnostics-color=always -pipe -D_FILE_OFFSET_BITS=64 -Wall -Winvalid-pch -Werror -O2 -g -include rte_config.h -Wextra -Wcast-qual -Wdeprecated -Wformat-nonliteral -Wformat-security -Wmissing-declarations -Wmissing-prototypes -Wnested-externs -Wold-style-definition -Wpointer-arith -Wsign-compare -Wstrict-prototypes -Wundef -Wwrite-strings -Wno-address-of-packed-member -Wno-packed-not-aligned -Wno-missing-field-initializers -D_GNU_SOURCE -fPIC -march=native -DALLOW_EXPERIMENTAL_API -DALLOW_INTERNAL_API -Wno-format-truncation -DVHOST_GCC_UNROLL_PRAGMA -fno-strict-aliasing -MD -MQ 'lib/76b5a35@@rte_vhost at sta/librte_vhost_vhost_user.c.o' -MF 'lib/76b5a35@@rte_vhost at sta/librte_vhost_vhost_user.c.o.d' -o 'lib/76b5a35@@rte_vhost at sta/librte_vhost_vhost_user.c.o' -c ../lib/librte_vhost/vhost_user.c
In file included from ../lib/librte_vhost/iotlb.h:10,
                 from ../lib/librte_vhost/vhost_user.c:49:
../lib/librte_vhost/vhost_user.c: In function ‘vhost_user_set_status’:
../lib/librte_vhost/vhost_user.c:2542:20: error: ‘VIRTIO_CONFIG_STATUS_RESET’ undeclared (first use in this function); did you mean ‘VIRTIO_CONFIG_S_NEEDS_RESET’?
 2542 |    (dev->status == VIRTIO_CONFIG_STATUS_RESET),
      |                    ^~~~~~~~~~~~~~~~~~~~~~~~~~
../lib/librte_vhost/vhost.h:541:27: note: in definition of macro ‘VHOST_LOG_CONFIG’
  541 |   "VHOST_CONFIG: " fmt, ##args)
      |                           ^~~~
../lib/librte_vhost/vhost_user.c:2542:20: note: each undeclared identifier is reported only once for each function it appears in
 2542 |    (dev->status == VIRTIO_CONFIG_STATUS_RESET),
      |                    ^~~~~~~~~~~~~~~~~~~~~~~~~~
../lib/librte_vhost/vhost.h:541:27: note: in definition of macro ‘VHOST_LOG_CONFIG’
  541 |   "VHOST_CONFIG: " fmt, ##args)
      |                           ^~~~
[425/2386] Generating rte_ipsec_mingw with a custom command.
[426/2386] Generating sched.sym_chk with a meson_exe.py custom command.
[427/2386] Generating rib.sym_chk with a meson_exe.py custom command.
[428/2386] Compiling C object 'lib/76b5a35@@rte_vhost at sta/librte_vhost_vhost.c.o'.
[429/2386] Compiling C object 'lib/76b5a35@@rte_ipsec at sta/librte_ipsec_ses.c.o'.
[430/2386] Compiling C object 'lib/76b5a35@@rte_ipsec at sta/librte_ipsec_sa.c.o'.
[431/2386] Compiling C object 'lib/76b5a35@@rte_ipsec at sta/librte_ipsec_ipsec_sad.c.o'.
[432/2386] Compiling C object 'lib/76b5a35@@rte_ipsec at sta/librte_ipsec_esp_inb.c.o'.
[433/2386] Compiling C object 'lib/76b5a35@@rte_ipsec at sta/librte_ipsec_esp_outb.c.o'.
[434/2386] Compiling C object 'lib/76b5a35@@rte_vhost at sta/librte_vhost_vhost_crypto.c.o'.
[435/2386] Compiling C object 'lib/76b5a35@@rte_vhost at sta/librte_vhost_virtio_net.c.o'.
ninja: build stopped: subcommand failed



*Makefile Build Failed #1:
OS: CENTOS77-64
Target: x86_64-native-linuxapp-gcc
In file included from /root/CENTOS77-64_K3.10.0_GCC4.8.5/x86_64-native-linuxapp-gcc/333e1dc4ca5242f09683eb4e05d1af39/dpdk/lib/librte_vhost/iotlb.h:10:0,
                 from /root/CENTOS77-64_K3.10.0_GCC4.8.5/x86_64-native-linuxapp-gcc/333e1dc4ca5242f09683eb4e05d1af39/dpdk/lib/librte_vhost/vhost_user.c:49:
/root/CENTOS77-64_K3.10.0_GCC4.8.5/x86_64-native-linuxapp-gcc/333e1dc4ca5242f09683eb4e05d1af39/dpdk/lib/librte_vhost/vhost_user.c: In function ‘vhost_user_set_status’:
/root/CENTOS77-64_K3.10.0_GCC4.8.5/x86_64-native-linuxapp-gcc/333e1dc4ca5242f09683eb4e05d1af39/dpdk/lib/librte_vhost/vhost_user.c:2542:20: error: ‘VIRTIO_CONFIG_STATUS_RESET’ undeclared (first use in this function)
    (dev->status == VIRTIO_CONFIG_STATUS_RESET),
                    ^
/root/CENTOS77-64_K3.10.0_GCC4.8.5/x86_64-native-linuxapp-gcc/333e1dc4ca5242f09683eb4e05d1af39/dpdk/lib/librte_vhost/vhost.h:541:27: note: in definition of macro ‘VHOST_LOG_CONFIG’
--
                           ^
/root/CENTOS77-64_K3.10.0_GCC4.8.5/x86_64-native-linuxapp-gcc/333e1dc4ca5242f09683eb4e05d1af39/dpdk/lib/librte_vhost/vhost_user.c: At top level:
cc1: warning: unrecognized command line option "-Wno-address-of-packed-member" [enabled by default]
make[5]: *** [vhost_user.o] Error 1
make[4]: *** [librte_vhost] Error 2
make[4]: *** Waiting for unfinished jobs....
  CC sa.o
  AR librte_bitratestats.a
--
  INSTALL-LIB librte_ipsec.a
  AR librte_bpf.a
  INSTALL-LIB librte_bpf.a
make[3]: *** [lib] Error 2
make[2]: *** [all] Error 2
make[1]: *** [pre_install] Error 2
make: *** [install] Error 2


*Makefile Build Failed #2:
OS: CENTOS82-64
Target: x86_64-native-linuxapp-gcc
In file included from /root/CENTOS82-64_K4.18.0_GCC8.3.1/x86_64-native-linuxapp-gcc/333e1dc4ca5242f09683eb4e05d1af39/dpdk/lib/librte_vhost/iotlb.h:10,
                 from /root/CENTOS82-64_K4.18.0_GCC8.3.1/x86_64-native-linuxapp-gcc/333e1dc4ca5242f09683eb4e05d1af39/dpdk/lib/librte_vhost/vhost_user.c:49:
/root/CENTOS82-64_K4.18.0_GCC8.3.1/x86_64-native-linuxapp-gcc/333e1dc4ca5242f09683eb4e05d1af39/dpdk/lib/librte_vhost/vhost_user.c: In function ‘vhost_user_set_status’:
/root/CENTOS82-64_K4.18.0_GCC8.3.1/x86_64-native-linuxapp-gcc/333e1dc4ca5242f09683eb4e05d1af39/dpdk/lib/librte_vhost/vhost_user.c:2542:20: error: ‘VIRTIO_CONFIG_STATUS_RESET’ undeclared (first use in this function); did you mean ‘VIRTIO_CONFIG_S_NEEDS_RESET’?
    (dev->status == VIRTIO_CONFIG_STATUS_RESET),
                    ^~~~~~~~~~~~~~~~~~~~~~~~~~
/root/CENTOS82-64_K4.18.0_GCC8.3.1/x86_64-native-linuxapp-gcc/333e1dc4ca5242f09683eb4e05d1af39/dpdk/lib/librte_vhost/vhost.h:541:27: note: in definition of macro ‘VHOST_LOG_CONFIG’
--
                           ^~~~
/root/CENTOS82-64_K4.18.0_GCC8.3.1/x86_64-native-linuxapp-gcc/333e1dc4ca5242f09683eb4e05d1af39/dpdk/lib/librte_vhost/vhost_user.c: At top level:
cc1: warning: unrecognized command line option ‘-Wno-address-of-packed-member’
make[5]: *** [/root/CENTOS82-64_K4.18.0_GCC8.3.1/x86_64-native-linuxapp-gcc/333e1dc4ca5242f09683eb4e05d1af39/dpdk/mk/internal/rte.compile-pre.mk:114: vhost_user.o] Error 1
make[5]: *** Waiting for unfinished jobs....
  CC rte_event_eth_tx_adapter.o
  AR librte_node.a
--
  CC rte_table_hash_lru.o
  CC rte_table_array.o
  CC rte_table_stub.o
make[4]: *** [/root/CENTOS82-64_K4.18.0_GCC8.3.1/x86_64-native-linuxapp-gcc/333e1dc4ca5242f09683eb4e05d1af39/dpdk/mk/rte.subdir.mk:37: librte_vhost] Error 2
make[4]: *** Waiting for unfinished jobs....
  AR librte_table.a
  INSTALL-LIB librte_table.a
make[3]: *** [/root/CENTOS82-64_K4.18.0_GCC8.3.1/x86_64-native-linuxapp-gcc/333e1dc4ca5242f09683eb4e05d1af39/dpdk/mk/rte.sdkbuild.mk:53: lib] Error 2
make[2]: *** [/root/CENTOS82-64_K4.18.0_GCC8.3.1/x86_64-native-linuxapp-gcc/333e1dc4ca5242f09683eb4e05d1af39/dpdk/mk/rte.sdkroot.mk:115: all] Error 2
make[1]: *** [/root/CENTOS82-64_K4.18.0_GCC8.3.1/x86_64-native-linuxapp-gcc/333e1dc4ca5242f09683eb4e05d1af39/dpdk/mk/rte.sdkinstall.mk:61: pre_install] Error 2
make: *** [/root/CENTOS82-64_K4.18.0_GCC8.3.1/x86_64-native-linuxapp-gcc/333e1dc4ca5242f09683eb4e05d1af39/dpdk/mk/rte.sdkroot.mk:92: install] Error 2


*Makefile Build Failed #3:
OS: CENTOS82-64
Target: x86_64-native-linuxapp-clang
  INSTALL-LIB librte_eventdev.a
  CC sa.o
== Build lib/librte_port
/root/CENTOS82-64_K4.18.0_Clang7.0.1/x86_64-native-linuxapp-clang/333e1dc4ca5242f09683eb4e05d1af39/dpdk/lib/librte_vhost/vhost_user.c:2542:20: error: use of undeclared identifier 'VIRTIO_CONFIG_STATUS_RESET'
                        (dev->status == VIRTIO_CONFIG_STATUS_RESET),
                                        ^
1 error generated.
make[5]: *** [/root/CENTOS82-64_K4.18.0_Clang7.0.1/x86_64-native-linuxapp-clang/333e1dc4ca5242f09683eb4e05d1af39/dpdk/mk/internal/rte.compile-pre.mk:114: vhost_user.o] Error 1
make[5]: *** Waiting for unfinished jobs....
  CC ses.o
  CC bpf_validate.o
--
  CC rte_table_hash_key32.o
  CC rte_table_hash_ext.o
  CC rte_table_hash_lru.o
make[4]: *** [/root/CENTOS82-64_K4.18.0_Clang7.0.1/x86_64-native-linuxapp-clang/333e1dc4ca5242f09683eb4e05d1af39/dpdk/mk/rte.subdir.mk:37: librte_vhost] Error 2
make[4]: *** Waiting for unfinished jobs....
  CC rte_table_array.o
  CC rte_table_stub.o
  AR librte_table.a
  INSTALL-LIB librte_table.a
make[3]: *** [/root/CENTOS82-64_K4.18.0_Clang7.0.1/x86_64-native-linuxapp-clang/333e1dc4ca5242f09683eb4e05d1af39/dpdk/mk/rte.sdkbuild.mk:53: lib] Error 2
make[2]: *** [/root/CENTOS82-64_K4.18.0_Clang7.0.1/x86_64-native-linuxapp-clang/333e1dc4ca5242f09683eb4e05d1af39/dpdk/mk/rte.sdkroot.mk:115: all] Error 2
make[1]: *** [/root/CENTOS82-64_K4.18.0_Clang7.0.1/x86_64-native-linuxapp-clang/333e1dc4ca5242f09683eb4e05d1af39/dpdk/mk/rte.sdkinstall.mk:61: pre_install] Error 2
make: *** [/root/CENTOS82-64_K4.18.0_Clang7.0.1/x86_64-native-linuxapp-clang/333e1dc4ca5242f09683eb4e05d1af39/dpdk/mk/rte.sdkroot.mk:92: install] Error 2


*Makefile Build Failed #4:
OS: CENTOS82-64
Target: x86_64-native-linuxapp-icc
  CC virtio_net.o
  CC vdpa.o
  CC vhost_crypto.o
/root/CENTOS82-64_K4.18.0_ICC19.1.1/x86_64-native-linuxapp-icc/333e1dc4ca5242f09683eb4e05d1af39/dpdk/lib/librte_vhost/vhost_user.c(2533): error: identifier "VIRTIO_CONFIG_STATUS_RESET" is undefined
  	VHOST_LOG_CONFIG(INFO, "New device status(0x%08x):\n"
  	^

  AR librte_node.a
compilation aborted for /root/CENTOS82-64_K4.18.0_ICC19.1.1/x86_64-native-linuxapp-icc/333e1dc4ca5242f09683eb4e05d1af39/dpdk/lib/librte_vhost/vhost_user.c (code 2)
make[5]: *** [/root/CENTOS82-64_K4.18.0_ICC19.1.1/x86_64-native-linuxapp-icc/333e1dc4ca5242f09683eb4e05d1af39/dpdk/mk/internal/rte.compile-pre.mk:116: vhost_user.o] Error 2
make[5]: *** Waiting for unfinished jobs....
  INSTALL-LIB librte_node.a
  AR librte_gso.a
--
  AR librte_port.a
  INSTALL-LIB librte_port.a
== Build lib/librte_table
make[4]: *** [/root/CENTOS82-64_K4.18.0_ICC19.1.1/x86_64-native-linuxapp-icc/333e1dc4ca5242f09683eb4e05d1af39/dpdk/mk/rte.subdir.mk:37: librte_vhost] Error 2
make[4]: *** Waiting for unfinished jobs....
  SYMLINK-FILE include/rte_table.h
  SYMLINK-FILE include/rte_table_acl.h
--
  CC rte_table_stub.o
  AR librte_table.a
  INSTALL-LIB librte_table.a
make[3]: *** [/root/CENTOS82-64_K4.18.0_ICC19.1.1/x86_64-native-linuxapp-icc/333e1dc4ca5242f09683eb4e05d1af39/dpdk/mk/rte.sdkbuild.mk:53: lib] Error 2
make[2]: *** [/root/CENTOS82-64_K4.18.0_ICC19.1.1/x86_64-native-linuxapp-icc/333e1dc4ca5242f09683eb4e05d1af39/dpdk/mk/rte.sdkroot.mk:115: all] Error 2
make[1]: *** [/root/CENTOS82-64_K4.18.0_ICC19.1.1/x86_64-native-linuxapp-icc/333e1dc4ca5242f09683eb4e05d1af39/dpdk/mk/rte.sdkinstall.mk:61: pre_install] Error 2
make: *** [/root/CENTOS82-64_K4.18.0_ICC19.1.1/x86_64-native-linuxapp-icc/333e1dc4ca5242f09683eb4e05d1af39/dpdk/mk/rte.sdkroot.mk:92: install] Error 2


*Makefile Build Failed #5:
OS: CENTOS82-64
Target: x86_64-native-linuxapp-gcc+shared
In file included from /root/CENTOS82-64_K4.18.0_GCC8.3.1/x86_64-native-linuxapp-gcc+shared/333e1dc4ca5242f09683eb4e05d1af39/dpdk/lib/librte_vhost/iotlb.h:10,
                 from /root/CENTOS82-64_K4.18.0_GCC8.3.1/x86_64-native-linuxapp-gcc+shared/333e1dc4ca5242f09683eb4e05d1af39/dpdk/lib/librte_vhost/vhost_user.c:49:
/root/CENTOS82-64_K4.18.0_GCC8.3.1/x86_64-native-linuxapp-gcc+shared/333e1dc4ca5242f09683eb4e05d1af39/dpdk/lib/librte_vhost/vhost_user.c: In function ‘vhost_user_set_status’:
/root/CENTOS82-64_K4.18.0_GCC8.3.1/x86_64-native-linuxapp-gcc+shared/333e1dc4ca5242f09683eb4e05d1af39/dpdk/lib/librte_vhost/vhost_user.c:2542:20: error: ‘VIRTIO_CONFIG_STATUS_RESET’ undeclared (first use in this function); did you mean ‘VIRTIO_CONFIG_S_NEEDS_RESET’?
    (dev->status == VIRTIO_CONFIG_STATUS_RESET),
                    ^~~~~~~~~~~~~~~~~~~~~~~~~~
/root/CENTOS82-64_K4.18.0_GCC8.3.1/x86_64-native-linuxapp-gcc+shared/333e1dc4ca5242f09683eb4e05d1af39/dpdk/lib/librte_vhost/vhost.h:541:27: note: in definition of macro ‘VHOST_LOG_CONFIG’
--
                           ^~~~
/root/CENTOS82-64_K4.18.0_GCC8.3.1/x86_64-native-linuxapp-gcc+shared/333e1dc4ca5242f09683eb4e05d1af39/dpdk/lib/librte_vhost/vhost_user.c: At top level:
cc1: warning: unrecognized command line option ‘-Wno-address-of-packed-member’
make[5]: *** [/root/CENTOS82-64_K4.18.0_GCC8.3.1/x86_64-native-linuxapp-gcc+shared/333e1dc4ca5242f09683eb4e05d1af39/dpdk/mk/internal/rte.compile-pre.mk:114: vhost_user.o] Error 1
make[5]: *** Waiting for unfinished jobs....
  LD librte_latencystats.so.20.0.3
  CC rte_event_crypto_adapter.o
--
  CC rte_port_source_sink.o
  CC rte_port_sym_crypto.o
  CC rte_port_eventdev.o
make[4]: *** [/root/CENTOS82-64_K4.18.0_GCC8.3.1/x86_64-native-linuxapp-gcc+shared/333e1dc4ca5242f09683eb4e05d1af39/dpdk/mk/rte.subdir.mk:37: librte_vhost] Error 2
make[4]: *** Waiting for unfinished jobs....
  LD librte_port.so.20.0.3
  INSTALL-LIB librte_port.so.20.0.3
make[3]: *** [/root/CENTOS82-64_K4.18.0_GCC8.3.1/x86_64-native-linuxapp-gcc+shared/333e1dc4ca5242f09683eb4e05d1af39/dpdk/mk/rte.sdkbuild.mk:53: lib] Error 2
make[2]: *** [/root/CENTOS82-64_K4.18.0_GCC8.3.1/x86_64-native-linuxapp-gcc+shared/333e1dc4ca5242f09683eb4e05d1af39/dpdk/mk/rte.sdkroot.mk:115: all] Error 2
make[1]: *** [/root/CENTOS82-64_K4.18.0_GCC8.3.1/x86_64-native-linuxapp-gcc+shared/333e1dc4ca5242f09683eb4e05d1af39/dpdk/mk/rte.sdkinstall.mk:61: pre_install] Error 2
make: *** [/root/CENTOS82-64_K4.18.0_GCC8.3.1/x86_64-native-linuxapp-gcc+shared/333e1dc4ca5242f09683eb4e05d1af39/dpdk/mk/rte.sdkroot.mk:92: install] Error 2


*Makefile Build Failed #6:
OS: CENTOS82-64
Target: x86_64-native-linuxapp-gcc+debug
In file included from /root/CENTOS82-64_K4.18.0_GCC8.3.1/x86_64-native-linuxapp-gcc+debug/333e1dc4ca5242f09683eb4e05d1af39/dpdk/lib/librte_vhost/iotlb.h:10,
                 from /root/CENTOS82-64_K4.18.0_GCC8.3.1/x86_64-native-linuxapp-gcc+debug/333e1dc4ca5242f09683eb4e05d1af39/dpdk/lib/librte_vhost/vhost_user.c:49:
/root/CENTOS82-64_K4.18.0_GCC8.3.1/x86_64-native-linuxapp-gcc+debug/333e1dc4ca5242f09683eb4e05d1af39/dpdk/lib/librte_vhost/vhost_user.c: In function ‘vhost_user_set_status’:
/root/CENTOS82-64_K4.18.0_GCC8.3.1/x86_64-native-linuxapp-gcc+debug/333e1dc4ca5242f09683eb4e05d1af39/dpdk/lib/librte_vhost/vhost_user.c:2542:20: error: ‘VIRTIO_CONFIG_STATUS_RESET’ undeclared (first use in this function); did you mean ‘VIRTIO_CONFIG_S_NEEDS_RESET’?
    (dev->status == VIRTIO_CONFIG_STATUS_RESET),
                    ^~~~~~~~~~~~~~~~~~~~~~~~~~
/root/CENTOS82-64_K4.18.0_GCC8.3.1/x86_64-native-linuxapp-gcc+debug/333e1dc4ca5242f09683eb4e05d1af39/dpdk/lib/librte_vhost/vhost.h:541:27: note: in definition of macro ‘VHOST_LOG_CONFIG’
--
                           ^~~~
/root/CENTOS82-64_K4.18.0_GCC8.3.1/x86_64-native-linuxapp-gcc+debug/333e1dc4ca5242f09683eb4e05d1af39/dpdk/lib/librte_vhost/vhost_user.c: At top level:
cc1: warning: unrecognized command line option ‘-Wno-address-of-packed-member’
make[5]: *** [/root/CENTOS82-64_K4.18.0_GCC8.3.1/x86_64-native-linuxapp-gcc+debug/333e1dc4ca5242f09683eb4e05d1af39/dpdk/mk/internal/rte.compile-pre.mk:114: vhost_user.o] Error 1
make[5]: *** Waiting for unfinished jobs....
  CC null.o
  SYMLINK-FILE include/rte_ipsec_sad.h
--
  AR librte_bitratestats.a
  INSTALL-LIB librte_bitratestats.a
  CC bpf_load.o
make[4]: *** [/root/CENTOS82-64_K4.18.0_GCC8.3.1/x86_64-native-linuxapp-gcc+debug/333e1dc4ca5242f09683eb4e05d1af39/dpdk/mk/rte.subdir.mk:35: librte_vhost] Error 2
make[4]: *** Waiting for unfinished jobs....
  CC bpf_pkt.o
  CC ethdev_rx.o
--
  INSTALL-LIB librte_node.a
  AR librte_ipsec.a
  INSTALL-LIB librte_ipsec.a
make[3]: *** [/root/CENTOS82-64_K4.18.0_GCC8.3.1/x86_64-native-linuxapp-gcc+debug/333e1dc4ca5242f09683eb4e05d1af39/dpdk/mk/rte.sdkbuild.mk:53: lib] Error 2
make[2]: *** [/root/CENTOS82-64_K4.18.0_GCC8.3.1/x86_64-native-linuxapp-gcc+debug/333e1dc4ca5242f09683eb4e05d1af39/dpdk/mk/rte.sdkroot.mk:115: all] Error 2
make[1]: *** [/root/CENTOS82-64_K4.18.0_GCC8.3.1/x86_64-native-linuxapp-gcc+debug/333e1dc4ca5242f09683eb4e05d1af39/dpdk/mk/rte.sdkinstall.mk:61: pre_install] Error 2
make: *** [/root/CENTOS82-64_K4.18.0_GCC8.3.1/x86_64-native-linuxapp-gcc+debug/333e1dc4ca5242f09683eb4e05d1af39/dpdk/mk/rte.sdkroot.mk:92: install] Error 2


*Makefile Build Failed #7:
OS: FC32-64
Target: x86_64-native-linuxapp-gcc
In file included from /root/FC32-64_K5.6.0_GCC10.0.1/x86_64-native-linuxapp-gcc/333e1dc4ca5242f09683eb4e05d1af39/dpdk/lib/librte_vhost/iotlb.h:10,
                 from /root/FC32-64_K5.6.0_GCC10.0.1/x86_64-native-linuxapp-gcc/333e1dc4ca5242f09683eb4e05d1af39/dpdk/lib/librte_vhost/vhost_user.c:49:
/root/FC32-64_K5.6.0_GCC10.0.1/x86_64-native-linuxapp-gcc/333e1dc4ca5242f09683eb4e05d1af39/dpdk/lib/librte_vhost/vhost_user.c: In function ‘vhost_user_set_status’:
/root/FC32-64_K5.6.0_GCC10.0.1/x86_64-native-linuxapp-gcc/333e1dc4ca5242f09683eb4e05d1af39/dpdk/lib/librte_vhost/vhost_user.c:2542:20: error: ‘VIRTIO_CONFIG_STATUS_RESET’ undeclared (first use in this function); did you mean ‘VIRTIO_CONFIG_S_NEEDS_RESET’?
 2542 |    (dev->status == VIRTIO_CONFIG_STATUS_RESET),
      |                    ^~~~~~~~~~~~~~~~~~~~~~~~~~
/root/FC32-64_K5.6.0_GCC10.0.1/x86_64-native-linuxapp-gcc/333e1dc4ca5242f09683eb4e05d1af39/dpdk/lib/librte_vhost/vhost.h:541:27: note: in definition of macro ‘VHOST_LOG_CONFIG’
--
/root/FC32-64_K5.6.0_GCC10.0.1/x86_64-native-linuxapp-gcc/333e1dc4ca5242f09683eb4e05d1af39/dpdk/lib/librte_vhost/vhost.h:541:27: note: in definition of macro ‘VHOST_LOG_CONFIG’
  541 |   "VHOST_CONFIG: " fmt, ##args)
      |                           ^~~~
make[5]: *** [/root/FC32-64_K5.6.0_GCC10.0.1/x86_64-native-linuxapp-gcc/333e1dc4ca5242f09683eb4e05d1af39/dpdk/mk/internal/rte.compile-pre.mk:116: vhost_user.o] Error 1
make[5]: *** Waiting for unfinished jobs....
  CC rte_event_crypto_adapter.o
  AR librte_ip_frag.a
  INSTALL-LIB librte_ip_frag.a
  CC pkt_cls.o
make[4]: *** [/root/FC32-64_K5.6.0_GCC10.0.1/x86_64-native-linuxapp-gcc/333e1dc4ca5242f09683eb4e05d1af39/dpdk/mk/rte.subdir.mk:35: librte_vhost] Error 2
make[4]: *** Waiting for unfinished jobs....
  CC pkt_drop.o
  CC bpf_validate.o
--
  INSTALL-LIB librte_eventdev.a
  AR librte_bpf.a
  INSTALL-LIB librte_bpf.a
make[3]: *** [/root/FC32-64_K5.6.0_GCC10.0.1/x86_64-native-linuxapp-gcc/333e1dc4ca5242f09683eb4e05d1af39/dpdk/mk/rte.sdkbuild.mk:53: lib] Error 2
make[2]: *** [/root/FC32-64_K5.6.0_GCC10.0.1/x86_64-native-linuxapp-gcc/333e1dc4ca5242f09683eb4e05d1af39/dpdk/mk/rte.sdkroot.mk:115: all] Error 2
make[1]: *** [/root/FC32-64_K5.6.0_GCC10.0.1/x86_64-native-linuxapp-gcc/333e1dc4ca5242f09683eb4e05d1af39/dpdk/mk/rte.sdkinstall.mk:61: pre_install] Error 2
make: *** [/root/FC32-64_K5.6.0_GCC10.0.1/x86_64-native-linuxapp-gcc/333e1dc4ca5242f09683eb4e05d1af39/dpdk/mk/rte.sdkroot.mk:92: install] Error 2


*Makefile Build Failed #8:
OS: FC32-64
Target: x86_64-native-linuxapp-clang
  AR librte_gso.a
  INSTALL-LIB librte_gso.a
  CC ses.o
/root/FC32-64_K5.6.0_Clang10.0.0/x86_64-native-linuxapp-clang/333e1dc4ca5242f09683eb4e05d1af39/dpdk/lib/librte_vhost/vhost_user.c:2542:20: error: use of undeclared identifier 'VIRTIO_CONFIG_STATUS_RESET'
                        (dev->status == VIRTIO_CONFIG_STATUS_RESET),
                                        ^
1 error generated.
make[5]: *** [/root/FC32-64_K5.6.0_Clang10.0.0/x86_64-native-linuxapp-clang/333e1dc4ca5242f09683eb4e05d1af39/dpdk/mk/internal/rte.compile-pre.mk:114: vhost_user.o] Error 1
make[5]: *** Waiting for unfinished jobs....
  CC bpf_jit_x86.o
  CC rte_event_timer_adapter.o
--
  CC rte_table_hash_lru.o
  CC rte_table_array.o
  CC rte_table_stub.o
make[4]: *** [/root/FC32-64_K5.6.0_Clang10.0.0/x86_64-native-linuxapp-clang/333e1dc4ca5242f09683eb4e05d1af39/dpdk/mk/rte.subdir.mk:37: librte_vhost] Error 2
make[4]: *** Waiting for unfinished jobs....
  AR librte_table.a
  INSTALL-LIB librte_table.a
make[3]: *** [/root/FC32-64_K5.6.0_Clang10.0.0/x86_64-native-linuxapp-clang/333e1dc4ca5242f09683eb4e05d1af39/dpdk/mk/rte.sdkbuild.mk:53: lib] Error 2
make[2]: *** [/root/FC32-64_K5.6.0_Clang10.0.0/x86_64-native-linuxapp-clang/333e1dc4ca5242f09683eb4e05d1af39/dpdk/mk/rte.sdkroot.mk:115: all] Error 2
make[1]: *** [/root/FC32-64_K5.6.0_Clang10.0.0/x86_64-native-linuxapp-clang/333e1dc4ca5242f09683eb4e05d1af39/dpdk/mk/rte.sdkinstall.mk:61: pre_install] Error 2
make: *** [/root/FC32-64_K5.6.0_Clang10.0.0/x86_64-native-linuxapp-clang/333e1dc4ca5242f09683eb4e05d1af39/dpdk/mk/rte.sdkroot.mk:92: install] Error 2


*Makefile Build Failed #9:
OS: RHEL82-64
Target: x86_64-native-linuxapp-gcc
In file included from /root/RHEL82-64_K4.18.0_GCC8.3.1/x86_64-native-linuxapp-gcc/333e1dc4ca5242f09683eb4e05d1af39/dpdk/lib/librte_vhost/iotlb.h:10,
                 from /root/RHEL82-64_K4.18.0_GCC8.3.1/x86_64-native-linuxapp-gcc/333e1dc4ca5242f09683eb4e05d1af39/dpdk/lib/librte_vhost/vhost_user.c:49:
/root/RHEL82-64_K4.18.0_GCC8.3.1/x86_64-native-linuxapp-gcc/333e1dc4ca5242f09683eb4e05d1af39/dpdk/lib/librte_vhost/vhost_user.c: In function ‘vhost_user_set_status’:
/root/RHEL82-64_K4.18.0_GCC8.3.1/x86_64-native-linuxapp-gcc/333e1dc4ca5242f09683eb4e05d1af39/dpdk/lib/librte_vhost/vhost_user.c:2542:20: error: ‘VIRTIO_CONFIG_STATUS_RESET’ undeclared (first use in this function); did you mean ‘VIRTIO_CONFIG_S_NEEDS_RESET’?
    (dev->status == VIRTIO_CONFIG_STATUS_RESET),
                    ^~~~~~~~~~~~~~~~~~~~~~~~~~
/root/RHEL82-64_K4.18.0_GCC8.3.1/x86_64-native-linuxapp-gcc/333e1dc4ca5242f09683eb4e05d1af39/dpdk/lib/librte_vhost/vhost.h:541:27: note: in definition of macro ‘VHOST_LOG_CONFIG’
--
                           ^~~~
/root/RHEL82-64_K4.18.0_GCC8.3.1/x86_64-native-linuxapp-gcc/333e1dc4ca5242f09683eb4e05d1af39/dpdk/lib/librte_vhost/vhost_user.c: At top level:
cc1: warning: unrecognized command line option ‘-Wno-address-of-packed-member’
make[5]: *** [/root/RHEL82-64_K4.18.0_GCC8.3.1/x86_64-native-linuxapp-gcc/333e1dc4ca5242f09683eb4e05d1af39/dpdk/mk/internal/rte.compile-pre.mk:114: vhost_user.o] Error 1
make[5]: *** Waiting for unfinished jobs....
  CC gso_udp4.o
  CC ethdev_tx.o
--
  INSTALL-LIB librte_gso.a
  CC rte_event_eth_tx_adapter.o
  CC sa.o
make[4]: *** [/root/RHEL82-64_K4.18.0_GCC8.3.1/x86_64-native-linuxapp-gcc/333e1dc4ca5242f09683eb4e05d1af39/dpdk/mk/rte.subdir.mk:35: librte_vhost] Error 2
make[4]: *** Waiting for unfinished jobs....
  CC ses.o
  CC ethdev_ctrl.o
--
  INSTALL-LIB librte_ipsec.a
  AR librte_node.a
  INSTALL-LIB librte_node.a
make[3]: *** [/root/RHEL82-64_K4.18.0_GCC8.3.1/x86_64-native-linuxapp-gcc/333e1dc4ca5242f09683eb4e05d1af39/dpdk/mk/rte.sdkbuild.mk:53: lib] Error 2
make[2]: *** [/root/RHEL82-64_K4.18.0_GCC8.3.1/x86_64-native-linuxapp-gcc/333e1dc4ca5242f09683eb4e05d1af39/dpdk/mk/rte.sdkroot.mk:115: all] Error 2
make[1]: *** [/root/RHEL82-64_K4.18.0_GCC8.3.1/x86_64-native-linuxapp-gcc/333e1dc4ca5242f09683eb4e05d1af39/dpdk/mk/rte.sdkinstall.mk:61: pre_install] Error 2
make: *** [/root/RHEL82-64_K4.18.0_GCC8.3.1/x86_64-native-linuxapp-gcc/333e1dc4ca5242f09683eb4e05d1af39/dpdk/mk/rte.sdkroot.mk:92: install] Error 2


*Makefile Build Failed #10:
OS: SUSE15-64
Target: x86_64-native-linuxapp-clang
  CC bpf.o
  CC gso_common.o
  CC bpf_exec.o
/root/SUSE15-64_K4.12.14_Clang5.0.1/x86_64-native-linuxapp-clang/333e1dc4ca5242f09683eb4e05d1af39/dpdk/lib/librte_vhost/vhost_user.c:2542:20: error: use of undeclared identifier 'VIRTIO_CONFIG_STATUS_RESET'
                        (dev->status == VIRTIO_CONFIG_STATUS_RESET),
                                        ^
1 error generated.
make[5]: *** [/root/SUSE15-64_K4.12.14_Clang5.0.1/x86_64-native-linuxapp-clang/333e1dc4ca5242f09683eb4e05d1af39/dpdk/mk/internal/rte.compile-pre.mk:114: vhost_user.o] Error 1
make[5]: *** Waiting for unfinished jobs....
  CC vdpa.o
  CC rte_event_timer_adapter.o
--
  INSTALL-LIB librte_node.a
  CC rte_port_sym_crypto.o
  CC rte_port_eventdev.o
make[4]: *** [/root/SUSE15-64_K4.12.14_Clang5.0.1/x86_64-native-linuxapp-clang/333e1dc4ca5242f09683eb4e05d1af39/dpdk/mk/rte.subdir.mk:35: librte_vhost] Error 2
make[4]: *** Waiting for unfinished jobs....
  AR librte_port.a
  INSTALL-LIB librte_port.a
make[3]: *** [/root/SUSE15-64_K4.12.14_Clang5.0.1/x86_64-native-linuxapp-clang/333e1dc4ca5242f09683eb4e05d1af39/dpdk/mk/rte.sdkbuild.mk:53: lib] Error 2
make[2]: *** [/root/SUSE15-64_K4.12.14_Clang5.0.1/x86_64-native-linuxapp-clang/333e1dc4ca5242f09683eb4e05d1af39/dpdk/mk/rte.sdkroot.mk:115: all] Error 2
make[1]: *** [/root/SUSE15-64_K4.12.14_Clang5.0.1/x86_64-native-linuxapp-clang/333e1dc4ca5242f09683eb4e05d1af39/dpdk/mk/rte.sdkinstall.mk:61: pre_install] Error 2
make: *** [/root/SUSE15-64_K4.12.14_Clang5.0.1/x86_64-native-linuxapp-clang/333e1dc4ca5242f09683eb4e05d1af39/dpdk/mk/rte.sdkroot.mk:92: install] Error 2


*Makefile Build Failed #11:
OS: SUSE15-64
Target: x86_64-native-linuxapp-gcc
In file included from /root/SUSE15-64_K4.12.14_GCC7.3.1/x86_64-native-linuxapp-gcc/333e1dc4ca5242f09683eb4e05d1af39/dpdk/lib/librte_vhost/iotlb.h:10:0,
                 from /root/SUSE15-64_K4.12.14_GCC7.3.1/x86_64-native-linuxapp-gcc/333e1dc4ca5242f09683eb4e05d1af39/dpdk/lib/librte_vhost/vhost_user.c:49:
/root/SUSE15-64_K4.12.14_GCC7.3.1/x86_64-native-linuxapp-gcc/333e1dc4ca5242f09683eb4e05d1af39/dpdk/lib/librte_vhost/vhost_user.c: In function ‘vhost_user_set_status’:
/root/SUSE15-64_K4.12.14_GCC7.3.1/x86_64-native-linuxapp-gcc/333e1dc4ca5242f09683eb4e05d1af39/dpdk/lib/librte_vhost/vhost_user.c:2542:20: error: ‘VIRTIO_CONFIG_STATUS_RESET’ undeclared (first use in this function); did you mean ‘VIRTIO_CONFIG_S_NEEDS_RESET’?
    (dev->status == VIRTIO_CONFIG_STATUS_RESET),
                    ^
/root/SUSE15-64_K4.12.14_GCC7.3.1/x86_64-native-linuxapp-gcc/333e1dc4ca5242f09683eb4e05d1af39/dpdk/lib/librte_vhost/vhost.h:541:27: note: in definition of macro ‘VHOST_LOG_CONFIG’
--
  CC vhost_crypto.o
/root/SUSE15-64_K4.12.14_GCC7.3.1/x86_64-native-linuxapp-gcc/333e1dc4ca5242f09683eb4e05d1af39/dpdk/lib/librte_vhost/vhost_user.c: At top level:
cc1: warning: unrecognized command line option ‘-Wno-address-of-packed-member’
make[5]: *** [/root/SUSE15-64_K4.12.14_GCC7.3.1/x86_64-native-linuxapp-gcc/333e1dc4ca5242f09683eb4e05d1af39/dpdk/mk/internal/rte.compile-pre.mk:116: vhost_user.o] Error 1
make[5]: *** Waiting for unfinished jobs....
  AR librte_ipsec.a
  INSTALL-LIB librte_ipsec.a
--
  CC rte_port_source_sink.o
  CC rte_port_sym_crypto.o
  CC rte_port_eventdev.o
make[4]: *** [/root/SUSE15-64_K4.12.14_GCC7.3.1/x86_64-native-linuxapp-gcc/333e1dc4ca5242f09683eb4e05d1af39/dpdk/mk/rte.subdir.mk:37: librte_vhost] Error 2
make[4]: *** Waiting for unfinished jobs....
  AR librte_port.a
  INSTALL-LIB librte_port.a
make[3]: *** [/root/SUSE15-64_K4.12.14_GCC7.3.1/x86_64-native-linuxapp-gcc/333e1dc4ca5242f09683eb4e05d1af39/dpdk/mk/rte.sdkbuild.mk:53: lib] Error 2
make[2]: *** [/root/SUSE15-64_K4.12.14_GCC7.3.1/x86_64-native-linuxapp-gcc/333e1dc4ca5242f09683eb4e05d1af39/dpdk/mk/rte.sdkroot.mk:115: all] Error 2
make[1]: *** [/root/SUSE15-64_K4.12.14_GCC7.3.1/x86_64-native-linuxapp-gcc/333e1dc4ca5242f09683eb4e05d1af39/dpdk/mk/rte.sdkinstall.mk:61: pre_install] Error 2
make: *** [/root/SUSE15-64_K4.12.14_GCC7.3.1/x86_64-native-linuxapp-gcc/333e1dc4ca5242f09683eb4e05d1af39/dpdk/mk/rte.sdkroot.mk:92: install] Error 2


*Makefile Build Failed #12:
OS: UB1804-64
Target: x86_64-native-linuxapp-gcc
In file included from /root/UB1804-64_K4.15.0_GCC7.3.0/x86_64-native-linuxapp-gcc/333e1dc4ca5242f09683eb4e05d1af39/dpdk/lib/librte_vhost/iotlb.h:10:0,
                 from /root/UB1804-64_K4.15.0_GCC7.3.0/x86_64-native-linuxapp-gcc/333e1dc4ca5242f09683eb4e05d1af39/dpdk/lib/librte_vhost/vhost_user.c:49:
/root/UB1804-64_K4.15.0_GCC7.3.0/x86_64-native-linuxapp-gcc/333e1dc4ca5242f09683eb4e05d1af39/dpdk/lib/librte_vhost/vhost_user.c: In function ‘vhost_user_set_status’:
/root/UB1804-64_K4.15.0_GCC7.3.0/x86_64-native-linuxapp-gcc/333e1dc4ca5242f09683eb4e05d1af39/dpdk/lib/librte_vhost/vhost_user.c:2542:20: error: ‘VIRTIO_CONFIG_STATUS_RESET’ undeclared (first use in this function); did you mean ‘VIRTIO_CONFIG_S_NEEDS_RESET’?
    (dev->status == VIRTIO_CONFIG_STATUS_RESET),
                    ^
/root/UB1804-64_K4.15.0_GCC7.3.0/x86_64-native-linuxapp-gcc/333e1dc4ca5242f09683eb4e05d1af39/dpdk/lib/librte_vhost/vhost.h:541:27: note: in definition of macro ‘VHOST_LOG_CONFIG’
--
  AR librte_ip_frag.a
/root/UB1804-64_K4.15.0_GCC7.3.0/x86_64-native-linuxapp-gcc/333e1dc4ca5242f09683eb4e05d1af39/dpdk/lib/librte_vhost/vhost_user.c: At top level:
cc1: warning: unrecognized command line option ‘-Wno-address-of-packed-member’
/root/UB1804-64_K4.15.0_GCC7.3.0/x86_64-native-linuxapp-gcc/333e1dc4ca5242f09683eb4e05d1af39/dpdk/mk/internal/rte.compile-pre.mk:114: recipe for target 'vhost_user.o' failed
make[5]: *** [vhost_user.o] Error 1
make[5]: *** Waiting for unfinished jobs....
  CC rte_bitrate.o
  CC bpf_validate.o
--
  AR librte_bitratestats.a
  INSTALL-LIB librte_bitratestats.a
  CC esp_outb.o
/root/UB1804-64_K4.15.0_GCC7.3.0/x86_64-native-linuxapp-gcc/333e1dc4ca5242f09683eb4e05d1af39/dpdk/mk/rte.subdir.mk:35: recipe for target 'librte_vhost' failed
make[4]: *** [librte_vhost] Error 2
make[4]: *** Waiting for unfinished jobs....
  CC sa.o
  CC ses.o
--
  INSTALL-LIB librte_node.a
  AR librte_eventdev.a
  INSTALL-LIB librte_eventdev.a
/root/UB1804-64_K4.15.0_GCC7.3.0/x86_64-native-linuxapp-gcc/333e1dc4ca5242f09683eb4e05d1af39/dpdk/mk/rte.sdkbuild.mk:51: recipe for target 'lib' failed
make[3]: *** [lib] Error 2
/root/UB1804-64_K4.15.0_GCC7.3.0/x86_64-native-linuxapp-gcc/333e1dc4ca5242f09683eb4e05d1af39/dpdk/mk/rte.sdkroot.mk:113: recipe for target 'all' failed
make[2]: *** [all] Error 2
/root/UB1804-64_K4.15.0_GCC7.3.0/x86_64-native-linuxapp-gcc/333e1dc4ca5242f09683eb4e05d1af39/dpdk/mk/rte.sdkinstall.mk:60: recipe for target 'pre_install' failed
make[1]: *** [pre_install] Error 2
/root/UB1804-64_K4.15.0_GCC7.3.0/x86_64-native-linuxapp-gcc/333e1dc4ca5242f09683eb4e05d1af39/dpdk/mk/rte.sdkroot.mk:92: recipe for target 'install' failed
make: *** [install] Error 2


*Makefile Build Failed #13:
OS: UB2004-32
Target: i686-native-linuxapp-gcc
In file included from /root/UB2004-32_K4.15.0_GCC9.3.0/i686-native-linuxapp-gcc/333e1dc4ca5242f09683eb4e05d1af39/dpdk/lib/librte_vhost/iotlb.h:10,
                 from /root/UB2004-32_K4.15.0_GCC9.3.0/i686-native-linuxapp-gcc/333e1dc4ca5242f09683eb4e05d1af39/dpdk/lib/librte_vhost/vhost_user.c:49:
/root/UB2004-32_K4.15.0_GCC9.3.0/i686-native-linuxapp-gcc/333e1dc4ca5242f09683eb4e05d1af39/dpdk/lib/librte_vhost/vhost_user.c: In function ‘vhost_user_set_status’:
/root/UB2004-32_K4.15.0_GCC9.3.0/i686-native-linuxapp-gcc/333e1dc4ca5242f09683eb4e05d1af39/dpdk/lib/librte_vhost/vhost_user.c:2542:20: error: ‘VIRTIO_CONFIG_STATUS_RESET’ undeclared (first use in this function); did you mean ‘VIRTIO_CONFIG_S_NEEDS_RESET’?
 2542 |    (dev->status == VIRTIO_CONFIG_STATUS_RESET),
      |                    ^~~~~~~~~~~~~~~~~~~~~~~~~~
/root/UB2004-32_K4.15.0_GCC9.3.0/i686-native-linuxapp-gcc/333e1dc4ca5242f09683eb4e05d1af39/dpdk/lib/librte_vhost/vhost.h:541:27: note: in definition of macro ‘VHOST_LOG_CONFIG’
--
/root/UB2004-32_K4.15.0_GCC9.3.0/i686-native-linuxapp-gcc/333e1dc4ca5242f09683eb4e05d1af39/dpdk/lib/librte_vhost/vhost.h:541:27: note: in definition of macro ‘VHOST_LOG_CONFIG’
  541 |   "VHOST_CONFIG: " fmt, ##args)
      |                           ^~~~
make[5]: *** [/root/UB2004-32_K4.15.0_GCC9.3.0/i686-native-linuxapp-gcc/333e1dc4ca5242f09683eb4e05d1af39/dpdk/mk/internal/rte.compile-pre.mk:114: vhost_user.o] Error 1
make[5]: *** Waiting for unfinished jobs....
  CC esp_outb.o
  AR librte_bpf.a
--
  INSTALL-LIB librte_node.a
  AR librte_ipsec.a
  INSTALL-LIB librte_ipsec.a
make[4]: *** [/root/UB2004-32_K4.15.0_GCC9.3.0/i686-native-linuxapp-gcc/333e1dc4ca5242f09683eb4e05d1af39/dpdk/mk/rte.subdir.mk:35: librte_vhost] Error 2
make[4]: *** Waiting for unfinished jobs....
  AR librte_eventdev.a
  INSTALL-LIB librte_eventdev.a
make[3]: *** [/root/UB2004-32_K4.15.0_GCC9.3.0/i686-native-linuxapp-gcc/333e1dc4ca5242f09683eb4e05d1af39/dpdk/mk/rte.sdkbuild.mk:53: lib] Error 2
make[2]: *** [/root/UB2004-32_K4.15.0_GCC9.3.0/i686-native-linuxapp-gcc/333e1dc4ca5242f09683eb4e05d1af39/dpdk/mk/rte.sdkroot.mk:115: all] Error 2
make[1]: *** [/root/UB2004-32_K4.15.0_GCC9.3.0/i686-native-linuxapp-gcc/333e1dc4ca5242f09683eb4e05d1af39/dpdk/mk/rte.sdkinstall.mk:61: pre_install] Error 2
make: *** [/root/UB2004-32_K4.15.0_GCC9.3.0/i686-native-linuxapp-gcc/333e1dc4ca5242f09683eb4e05d1af39/dpdk/mk/rte.sdkroot.mk:92: install] Error 2


*Makefile Build Failed #14:
OS: UB2004-64
Target: x86_64-native-linuxapp-clang
  AR librte_ipsec.a
  INSTALL-LIB librte_ipsec.a
  CC rte_event_eth_tx_adapter.o
/root/UB2004-64_K5.4.0_Clang10.0.0/x86_64-native-linuxapp-clang/333e1dc4ca5242f09683eb4e05d1af39/dpdk/lib/librte_vhost/vhost_user.c:2542:20: error: use of undeclared identifier 'VIRTIO_CONFIG_STATUS_RESET'
                        (dev->status == VIRTIO_CONFIG_STATUS_RESET),
                                        ^
1 error generated.
make[5]: *** [/root/UB2004-64_K5.4.0_Clang10.0.0/x86_64-native-linuxapp-clang/333e1dc4ca5242f09683eb4e05d1af39/dpdk/mk/internal/rte.compile-pre.mk:114: vhost_user.o] Error 1
make[5]: *** Waiting for unfinished jobs....
  AR librte_eventdev.a
  INSTALL-LIB librte_eventdev.a
--
  CC rte_table_action.o
  CC rte_flow_classify.o
  CC rte_flow_classify_parse.o
make[4]: *** [/root/UB2004-64_K5.4.0_Clang10.0.0/x86_64-native-linuxapp-clang/333e1dc4ca5242f09683eb4e05d1af39/dpdk/mk/rte.subdir.mk:37: librte_vhost] Error 2
make[4]: *** Waiting for unfinished jobs....
  AR librte_flow_classify.a
  INSTALL-LIB librte_flow_classify.a
  AR librte_pipeline.a
  INSTALL-LIB librte_pipeline.a
make[3]: *** [/root/UB2004-64_K5.4.0_Clang10.0.0/x86_64-native-linuxapp-clang/333e1dc4ca5242f09683eb4e05d1af39/dpdk/mk/rte.sdkbuild.mk:53: lib] Error 2
make[2]: *** [/root/UB2004-64_K5.4.0_Clang10.0.0/x86_64-native-linuxapp-clang/333e1dc4ca5242f09683eb4e05d1af39/dpdk/mk/rte.sdkroot.mk:115: all] Error 2
make[1]: *** [/root/UB2004-64_K5.4.0_Clang10.0.0/x86_64-native-linuxapp-clang/333e1dc4ca5242f09683eb4e05d1af39/dpdk/mk/rte.sdkinstall.mk:61: pre_install] Error 2
make: *** [/root/UB2004-64_K5.4.0_Clang10.0.0/x86_64-native-linuxapp-clang/333e1dc4ca5242f09683eb4e05d1af39/dpdk/mk/rte.sdkroot.mk:92: install] Error 2


*Makefile Build Failed #15:
OS: UB2004-64
Target: x86_64-native-linuxapp-gcc
In file included from /root/UB2004-64_K5.4.0_GCC9.3.0/x86_64-native-linuxapp-gcc/333e1dc4ca5242f09683eb4e05d1af39/dpdk/lib/librte_vhost/iotlb.h:10,
                 from /root/UB2004-64_K5.4.0_GCC9.3.0/x86_64-native-linuxapp-gcc/333e1dc4ca5242f09683eb4e05d1af39/dpdk/lib/librte_vhost/vhost_user.c:49:
/root/UB2004-64_K5.4.0_GCC9.3.0/x86_64-native-linuxapp-gcc/333e1dc4ca5242f09683eb4e05d1af39/dpdk/lib/librte_vhost/vhost_user.c: In function ‘vhost_user_set_status’:
/root/UB2004-64_K5.4.0_GCC9.3.0/x86_64-native-linuxapp-gcc/333e1dc4ca5242f09683eb4e05d1af39/dpdk/lib/librte_vhost/vhost_user.c:2542:20: error: ‘VIRTIO_CONFIG_STATUS_RESET’ undeclared (first use in this function); did you mean ‘VIRTIO_CONFIG_S_NEEDS_RESET’?
 2542 |    (dev->status == VIRTIO_CONFIG_STATUS_RESET),
      |                    ^~~~~~~~~~~~~~~~~~~~~~~~~~
/root/UB2004-64_K5.4.0_GCC9.3.0/x86_64-native-linuxapp-gcc/333e1dc4ca5242f09683eb4e05d1af39/dpdk/lib/librte_vhost/vhost.h:541:27: note: in definition of macro ‘VHOST_LOG_CONFIG’
--
  541 |   "VHOST_CONFIG: " fmt, ##args)
      |                           ^~~~
  AR librte_latencystats.a
make[5]: *** [/root/UB2004-64_K5.4.0_GCC9.3.0/x86_64-native-linuxapp-gcc/333e1dc4ca5242f09683eb4e05d1af39/dpdk/mk/internal/rte.compile-pre.mk:116: vhost_user.o] Error 1
make[5]: *** Waiting for unfinished jobs....
  INSTALL-LIB librte_latencystats.a
  CC rte_event_crypto_adapter.o
--
  CC pkt_cls.o
  CC ses.o
  CC bpf_validate.o
make[4]: *** [/root/UB2004-64_K5.4.0_GCC9.3.0/x86_64-native-linuxapp-gcc/333e1dc4ca5242f09683eb4e05d1af39/dpdk/mk/rte.subdir.mk:35: librte_vhost] Error 2
make[4]: *** Waiting for unfinished jobs....
  CC pkt_drop.o
  CC bpf_jit_x86.o
--
  INSTALL-LIB librte_ipsec.a
  AR librte_bpf.a
  INSTALL-LIB librte_bpf.a
make[3]: *** [/root/UB2004-64_K5.4.0_GCC9.3.0/x86_64-native-linuxapp-gcc/333e1dc4ca5242f09683eb4e05d1af39/dpdk/mk/rte.sdkbuild.mk:53: lib] Error 2
make[2]: *** [/root/UB2004-64_K5.4.0_GCC9.3.0/x86_64-native-linuxapp-gcc/333e1dc4ca5242f09683eb4e05d1af39/dpdk/mk/rte.sdkroot.mk:115: all] Error 2
make[1]: *** [/root/UB2004-64_K5.4.0_GCC9.3.0/x86_64-native-linuxapp-gcc/333e1dc4ca5242f09683eb4e05d1af39/dpdk/mk/rte.sdkinstall.mk:61: pre_install] Error 2
make: *** [/root/UB2004-64_K5.4.0_GCC9.3.0/x86_64-native-linuxapp-gcc/333e1dc4ca5242f09683eb4e05d1af39/dpdk/mk/rte.sdkroot.mk:92: install] Error 2


*Makefile Build Failed #16:
OS: UB2004-64
Target: x86_64-native-linuxapp-icc
  CC rte_ip_frag_common.o
  SYMLINK-FILE include/rte_bitrate.h
  CC rte_bitrate.o
/root/UB2004-64_K5.4.0_ICC19.1.0/x86_64-native-linuxapp-icc/333e1dc4ca5242f09683eb4e05d1af39/dpdk/lib/librte_vhost/vhost_user.c(2533): error: identifier "VIRTIO_CONFIG_STATUS_RESET" is undefined
  	VHOST_LOG_CONFIG(INFO, "New device status(0x%08x):\n"
  	^

  SYMLINK-FILE include/rte_node_ip4_api.h
compilation aborted for /root/UB2004-64_K5.4.0_ICC19.1.0/x86_64-native-linuxapp-icc/333e1dc4ca5242f09683eb4e05d1af39/dpdk/lib/librte_vhost/vhost_user.c (code 2)
make[5]: *** [/root/UB2004-64_K5.4.0_ICC19.1.0/x86_64-native-linuxapp-icc/333e1dc4ca5242f09683eb4e05d1af39/dpdk/mk/internal/rte.compile-pre.mk:116: vhost_user.o] Error 2
make[5]: *** Waiting for unfinished jobs....
  CC ip_frag_internal.o
  CC rte_event_eth_rx_adapter.o
--
  INSTALL-LIB librte_latencystats.a
  CC ethdev_rx.o
  CC ethdev_tx.o
make[4]: *** [/root/UB2004-64_K5.4.0_ICC19.1.0/x86_64-native-linuxapp-icc/333e1dc4ca5242f09683eb4e05d1af39/dpdk/mk/rte.subdir.mk:35: librte_vhost] Error 2
make[4]: *** Waiting for unfinished jobs....
  CC ethdev_ctrl.o
  AR librte_ip_frag.a
--
  INSTALL-LIB librte_ipsec.a
  AR librte_eventdev.a
  INSTALL-LIB librte_eventdev.a
make[3]: *** [/root/UB2004-64_K5.4.0_ICC19.1.0/x86_64-native-linuxapp-icc/333e1dc4ca5242f09683eb4e05d1af39/dpdk/mk/rte.sdkbuild.mk:53: lib] Error 2
make[2]: *** [/root/UB2004-64_K5.4.0_ICC19.1.0/x86_64-native-linuxapp-icc/333e1dc4ca5242f09683eb4e05d1af39/dpdk/mk/rte.sdkroot.mk:115: all] Error 2
make[1]: *** [/root/UB2004-64_K5.4.0_ICC19.1.0/x86_64-native-linuxapp-icc/333e1dc4ca5242f09683eb4e05d1af39/dpdk/mk/rte.sdkinstall.mk:61: pre_install] Error 2
make: *** [/root/UB2004-64_K5.4.0_ICC19.1.0/x86_64-native-linuxapp-icc/333e1dc4ca5242f09683eb4e05d1af39/dpdk/mk/rte.sdkroot.mk:92: install] Error 2
DPDK STV team


More information about the test-report mailing list