[dpdk-test-report] |FAILURE| pw(75453) [v1, 8/8] crypto/bcmfs: add crypto pmd into cryptodev test

sys_stv at intel.com sys_stv at intel.com
Wed Aug 12 10:08:25 CEST 2020


Test-Label: Intel-compilation
Test-Status: FAILURE
http://dpdk.org/patch/75453

_Compilation issues_

Submitter: Vikas Gupta <vikas.gupta at broadcom.com>
Date: 2020-08-12 06:31:27
Reply_mail: 20200812063127.8687-9-vikas.gupta at broadcom.com

DPDK git baseline: Repo:dpdk-next-crypto, CommitID: 12bc28905e9f5b8a952425d40e49717bf33e29a6


Meson build Summary: 8 Builds Done, 2 Successful, 6 Failures, 0 Blocked

Makefile build Summary: 20 Builds Done, 2 Successful, 18 Failures, 0 Blocked

                +==============================================+===========+==========+
                |                   Makefile                   |   Meson   | Document |
+----------------+------+-------+------+------------+-----------+-----------+----------+
| os             | gcc  | clang | icc  | gcc+shared | gcc+debug | gcc/clang | pdf/html |
+----------------+------+-------+------+------------+-----------+-----------+----------+
| CENTOS82-64    | FAIL | FAIL  | FAIL | pass       | FAIL      | FAIL      |          |
| RHEL82-64      | FAIL |       |      |            |           |           |          |
| UB1804-64      | FAIL |       |      |            |           |           |          |
| FC32-64        | FAIL | FAIL  |      |            |           | FAIL      |          |
| CENTOS77-64    | FAIL |       |      |            |           |           |          |
| UB2004-64      | FAIL | FAIL  | FAIL |            |           | FAIL      | pass     |
| WIN10-64       |      |       |      |            |           | pass      |          |
| UB2004-32      | FAIL |       |      |            |           |           |          |
| UB1804-32      |      |       |      |            |           | FAIL      |          |
| FreeBSD1201-64 | FAIL | FAIL  |      | pass       | FAIL      | FAIL      |          |
| SUSE15-64      | FAIL | FAIL  |      |            |           | FAIL      |          |
+----------------+------+-------+------+------------+-----------+-----------+----------+
Test environment and configuration as below:

** Makefile build **


OS: CENTOS82-64
	Kernel Version: 4.18.0-193.el8.x86_64
	CPU info: Intel(R) Xeon(R) Platinum 8280M CPU @ 2.70GHz
	GCC Version: gcc (GCC) 8.3.1 20191121 (Red Hat 8.3.1-5)
	Clang Version: 9.0.1 (Red Hat 9.0.1-2.module_el8.2.0+309+0c7b6b03)
	x86_64-native-linuxapp-gcc
	x86_64-native-linuxapp-clang
	x86_64-native-linuxapp-icc
	x86_64-native-linuxapp-gcc+shared
	x86_64-native-linuxapp-gcc+debug


OS: RHEL82-64
	Kernel Version: 4.18.0-193.el8.x86_64
	CPU info: Intel(R) Xeon(R) Platinum 8280M CPU @ 2.70GHz
	GCC Version: gcc (GCC) 8.3.1 20191121 (Red Hat 8.3.1-5)
	Clang Version: 8.0.1 (Red Hat 8.0.1-1.module_el8.1.0+215+a01033fb)
	x86_64-native-linuxapp-gcc


OS: UB1804-64
	Kernel Version: 4.15.0-29-generic
	CPU info: Intel(R) Xeon(R) Platinum 8180 CPU @ 2.50GHz
	GCC Version: gcc (Ubuntu 7.5.0-3ubuntu1~18.04) 7.5.0
	Clang Version: 6.0.0-1ubuntu2 (tags/RELEASE_600/final)
	x86_64-native-linuxapp-gcc


OS: FC32-64
	Kernel Version: 5.6.0-0.rc7.git0.2.fc32.x86_64
	CPU info: Intel(R) Xeon(R) Platinum 8280M CPU @ 2.70GHz
	GCC Version: gcc (GCC) 10.0.1 20200311 (Red Hat 10.0.1-0.9)
	Clang Version: 10.0.0 (Fedora 10.0.0-0.3.rc4.fc32)
	x86_64-native-linuxapp-gcc
	x86_64-native-linuxapp-clang


OS: CENTOS77-64
	Kernel Version: 3.10.0-1062.9.1.el7.x86_64
	CPU info: Intel(R) Xeon(R) Platinum 8280M CPU @ 2.70GHz
	GCC Version: gcc (GCC) 4.8.5 20150623 (Red Hat 4.8.5-39)
	Clang Version: 3.4.2 (tags/RELEASE_34/dot2-final)
	x86_64-native-linuxapp-gcc


OS: UB2004-64
	Kernel Version: 5.4.0-26-generic
	CPU info: Intel(R) Xeon(R) Platinum 8180 CPU @ 2.50GHz
	GCC Version: gcc (Ubuntu 10-20200416-0ubuntu1) 10.0.1 20200416 (experimental) [master revision 3c3f12e2a76:dcee354ce56:44b326839d864fc10c459916abcc97f35a9ac3de]
	Clang Version: 10.0.0-4ubuntu1
	x86_64-native-linuxapp-clang
	x86_64-native-linuxapp-gcc
	x86_64-native-linuxapp-icc


OS: UB2004-32
	Kernel Version: 5.4.0-26-generic
	CPU info: Intel(R) Xeon(R) Platinum 8180 CPU @ 2.50GHz
	GCC Version: gcc (Ubuntu 9.3.0-10ubuntu2) 9.3.0
	Clang Version: 10.0.0-4ubuntu1
	i686-native-linuxapp-gcc


OS: FreeBSD1201-64
	Kernel Version: 12.1-RELEASE
	CPU info: Intel(R) Xeon(R) CPU E5-2699 v3 @ 2.30GHz (2294.74-MHz K8-class CPU)
	GCC Version: gcc (FreeBSD Ports Collection) 9.2.0
	Clang Version: 8.0.1 (tags/RELEASE_801/final 366581) (based on LLVM 8.0.1)
	x86_64-native-bsdapp-gcc
	x86_64-native-bsdapp-clang
	x86_64-native-bsdapp-gcc+shared
	x86_64-native-bsdapp-gcc+debug


OS: SUSE15-64
	Kernel Version: 4.12.14-lp150.11-default
	CPU info: Intel(R) Xeon(R) CPU E5-2699 v4 @ 2.20GHz
	GCC Version: gcc (SUSE Linux) 7.3.1 20180323 [gcc-7-branch revision 258812]
	Clang Version: 5.0.1 (tags/RELEASE_501/final 312548)
	x86_64-native-linuxapp-clang
	x86_64-native-linuxapp-gcc

** Meson build **


OS: CENTOS82-64
	Kernel Version: 4.18.0-193.el8.x86_64
	CPU info: Intel(R) Xeon(R) CPU E5-2699 v4 @ 2.20GHz
	GCC Version: gcc (GCC) 8.3.1 20191121 (Red Hat 8.3.1-5)
	Clang Version: 9.0.1 (Red Hat 9.0.1-2.module_el8.2.0+309+0c7b6b03)
	./build-gcc-static
	./build-gcc-shared
	./build-clang-static
	./build-clang-shared
	./build-x86-default


OS: UB2004-64
	Kernel Version: 5.4.0-26-generic
	CPU info: Intel(R) Xeon(R) Platinum 8180 CPU @ 2.50GHz
	GCC Version: gcc (Ubuntu 9.3.0-10ubuntu2) 9.3.0
	Clang Version: 10.0.0-4ubuntu1
	x86_64-native-linuxapp-doc
	./build-gcc-static
	./build-gcc-shared
	./build-clang-static
	./build-clang-shared
	./build-x86-default


OS: FC32-64
	Kernel Version: 5.6.0-0.rc7.git0.2.fc32.x86_64
	CPU info: Intel(R) Xeon(R) CPU E5-2699 v4 @ 2.20GHz
	GCC Version: gcc (GCC) 10.0.1 20200311 (Red Hat 10.0.1-0.9)
	Clang Version: 10.0.0 (Fedora 10.0.0-0.3.rc4.fc32)
	./build-gcc-static
	./build-gcc-shared
	./build-clang-static
	./build-clang-shared
	./build-x86-default


OS: WIN10-64
	Kernel Version: N/A
	CPU info: N/A
	GCC Version: N/A
	Clang Version: Clang 8.0.0
	x86_64-windows-clang


OS: UB1804-32
	Kernel Version: 4.15.0-20-generic
	CPU info: Intel(R) Xeon(R) CPU E5-2699 v4 @ 2.20GHz
	GCC Version: gcc (Ubuntu 7.5.0-3ubuntu1~18.04) 7.5.0
	Clang Version: 6.0.0-1ubuntu2 (tags/RELEASE_600/final)
	./build-gcc-static
	./build-gcc-shared
	./build-clang-static
	./build-clang-shared
	./build-x86-default


OS: FreeBSD1201-64
	Kernel Version: 12.1-RELEASE
	CPU info: Intel(R) Xeon(R) CPU E5-2699 v4 @ 2.20GHz (2194.97-MHz K8-class CPU)
	GCC Version: gcc (FreeBSD Ports Collection) 9.2.0
	Clang Version: 8.0.1 (tags/RELEASE_801/final 366581) (based on LLVM 8.0.1)
	./build-gcc-static
	./build-gcc-shared
	./build-clang-static
	./build-clang-shared
	./build-x86-default


OS: SUSE15-64
	Kernel Version: 4.12.14-lp150.12.82-default
	CPU info: Intel(R) Xeon(R) CPU E5-2699 v4 @ 2.20GHz
	GCC Version: gcc (SUSE Linux) 7.4.1 20190905 [gcc-7-branch revision 275407]
	Clang Version: 5.0.1 (tags/RELEASE_501/final 312548)
	./build-gcc-static
	./build-gcc-shared
	./build-clang-static
	./build-clang-shared
	./build-x86-default



*Meson Build Failed #1:
OS: CENTOS82-64
Target:./build-gcc-static
FAILED: drivers/a715181@@tmp_rte_pmd_bcmfs at sta/crypto_bcmfs_bcmfs_sym_capabilities.c.o 
clang -Idrivers/a715181@@tmp_rte_pmd_bcmfs at sta -Idrivers -I../drivers -Idrivers/crypto/bcmfs -I../drivers/crypto/bcmfs -Ilib/librte_cryptodev -I../lib/librte_cryptodev -I. -I../ -Iconfig -I../config -Ilib/librte_eal/include -I../lib/librte_eal/include -Ilib/librte_eal/linux/include -I../lib/librte_eal/linux/include -Ilib/librte_eal/x86/include -I../lib/librte_eal/x86/include -Ilib/librte_eal/common -I../lib/librte_eal/common -Ilib/librte_eal -I../lib/librte_eal -Ilib/librte_kvargs -I../lib/librte_kvargs -Ilib/librte_telemetry/../librte_metrics -I../lib/librte_telemetry/../librte_metrics -Ilib/librte_telemetry -I../lib/librte_telemetry -Ilib/librte_mbuf -I../lib/librte_mbuf -Ilib/librte_mempool -I../lib/librte_mempool -Ilib/librte_ring -I../lib/librte_ring -Idrivers/bus/vdev -I../drivers/bus/vdev -Xclang -fcolor-diagnostics -pipe -D_FILE_OFFSET_BITS=64 -Wall -Winvalid-pch -Werror -O2 -g -include rte_config.h -Wextra -Wcast-qual -Wdeprecated -Wformat-nonliteral -Wformat-security -Wmissing-declarations -Wmissing-prototypes -Wnested-externs -Wold-style-definition -Wpointer-arith -Wsign-compare -Wstrict-prototypes -Wundef -Wwrite-strings -Wno-address-of-packed-member -Wno-missing-field-initializers -D_GNU_SOURCE -fPIC -march=native -mno-avx512f -DALLOW_EXPERIMENTAL_API -DALLOW_INTERNAL_API -MD -MQ 'drivers/a715181@@tmp_rte_pmd_bcmfs at sta/crypto_bcmfs_bcmfs_sym_capabilities.c.o' -MF 'drivers/a715181@@tmp_rte_pmd_bcmfs at sta/crypto_bcmfs_bcmfs_sym_capabilities.c.o.d' -o 'drivers/a715181@@tmp_rte_pmd_bcmfs at sta/crypto_bcmfs_bcmfs_sym_capabilities.c.o' -c ../drivers/crypto/bcmfs/bcmfs_sym_capabilities.c
../drivers/crypto/bcmfs/bcmfs_sym_capabilities.c:478:13: error: implicit conversion from enumeration type 'enum rte_crypto_auth_algorithm' to different enumeration type 'enum rte_crypto_aead_algorithm' [-Werror,-Wenum-conversion]
                                .algo = RTE_CRYPTO_AUTH_AES_GMAC,
                                        ^~~~~~~~~~~~~~~~~~~~~~~~
1 error generated.
[1938/2416] Generating rte_pmd_dpaa2_sec.sym_chk with a meson_exe.py custom command.
[1939/2416] Compiling C object 'drivers/a715181@@tmp_rte_pmd_bcmfs at sta/crypto_bcmfs_bcmfs_sym_session.c.o'.
FAILED: drivers/a715181@@tmp_rte_pmd_bcmfs at sta/crypto_bcmfs_bcmfs_sym_session.c.o 
clang -Idrivers/a715181@@tmp_rte_pmd_bcmfs at sta -Idrivers -I../drivers -Idrivers/crypto/bcmfs -I../drivers/crypto/bcmfs -Ilib/librte_cryptodev -I../lib/librte_cryptodev -I. -I../ -Iconfig -I../config -Ilib/librte_eal/include -I../lib/librte_eal/include -Ilib/librte_eal/linux/include -I../lib/librte_eal/linux/include -Ilib/librte_eal/x86/include -I../lib/librte_eal/x86/include -Ilib/librte_eal/common -I../lib/librte_eal/common -Ilib/librte_eal -I../lib/librte_eal -Ilib/librte_kvargs -I../lib/librte_kvargs -Ilib/librte_telemetry/../librte_metrics -I../lib/librte_telemetry/../librte_metrics -Ilib/librte_telemetry -I../lib/librte_telemetry -Ilib/librte_mbuf -I../lib/librte_mbuf -Ilib/librte_mempool -I../lib/librte_mempool -Ilib/librte_ring -I../lib/librte_ring -Idrivers/bus/vdev -I../drivers/bus/vdev -Xclang -fcolor-diagnostics -pipe -D_FILE_OFFSET_BITS=64 -Wall -Winvalid-pch -Werror -O2 -g -include rte_config.h -Wextra -Wcast-qual -Wdeprecated -Wformat-nonliteral -Wformat-security -Wmissing-declarations -Wmissing-prototypes -Wnested-externs -Wold-style-definition -Wpointer-arith -Wsign-compare -Wstrict-prototypes -Wundef -Wwrite-strings -Wno-address-of-packed-member -Wno-missing-field-initializers -D_GNU_SOURCE -fPIC -march=native -mno-avx512f -DALLOW_EXPERIMENTAL_API -DALLOW_INTERNAL_API -MD -MQ 'drivers/a715181@@tmp_rte_pmd_bcmfs at sta/crypto_bcmfs_bcmfs_sym_session.c.o' -MF 'drivers/a715181@@tmp_rte_pmd_bcmfs at sta/crypto_bcmfs_bcmfs_sym_session.c.o.d' -o 'drivers/a715181@@tmp_rte_pmd_bcmfs at sta/crypto_bcmfs_bcmfs_sym_session.c.o' -c ../drivers/crypto/bcmfs/bcmfs_sym_session.c
../drivers/crypto/bcmfs/bcmfs_sym_session.c:60:41: error: implicit conversion from enumeration type 'const enum rte_crypto_cipher_operation' to different enumeration type 'enum bcmfs_crypto_cipher_op' [-Werror,-Wenum-conversion]
        sess->cipher.direction = cipher_xform->op;
                               ~ ~~~~~~~~~~~~~~^~
../drivers/crypto/bcmfs/bcmfs_sym_session.c:90:23: error: implicit conversion from enumeration type 'enum rte_crypto_cipher_algorithm' to different enumeration type 'enum bcmfs_crypto_cipher_algorithm' [-Werror,-Wenum-conversion]
                sess->cipher.algo = RTE_CRYPTO_CIPHER_NULL;
                                  ~ ^~~~~~~~~~~~~~~~~~~~~~
../drivers/crypto/bcmfs/bcmfs_sym_session.c:215:39: error: implicit conversion from enumeration type 'const enum rte_crypto_aead_operation' to different enumeration type 'enum bcmfs_crypto_cipher_op' [-Werror,-Wenum-conversion]
        sess->cipher.direction = xform->aead.op;
                               ~ ~~~~~~~~~~~~^~
3 errors generated.
[1940/2416] Linking target drivers/librte_pmd_snow3g.so.20.0.3.
[1941/2416] Compiling C object 'drivers/a715181@@tmp_rte_pmd_zuc at sta/crypto_zuc_rte_zuc_pmd.c.o'.
[1942/2416] Compiling C object 'drivers/a715181@@tmp_rte_pmd_bcmfs at sta/crypto_bcmfs_bcmfs_sym.c.o'.
[1943/2416] Compiling C object 'drivers/a715181@@tmp_rte_pmd_bcmfs at sta/crypto_bcmfs_bcmfs_sym_engine.c.o'.
FAILED: drivers/a715181@@tmp_rte_pmd_bcmfs at sta/crypto_bcmfs_bcmfs_sym_engine.c.o 
clang -Idrivers/a715181@@tmp_rte_pmd_bcmfs at sta -Idrivers -I../drivers -Idrivers/crypto/bcmfs -I../drivers/crypto/bcmfs -Ilib/librte_cryptodev -I../lib/librte_cryptodev -I. -I../ -Iconfig -I../config -Ilib/librte_eal/include -I../lib/librte_eal/include -Ilib/librte_eal/linux/include -I../lib/librte_eal/linux/include -Ilib/librte_eal/x86/include -I../lib/librte_eal/x86/include -Ilib/librte_eal/common -I../lib/librte_eal/common -Ilib/librte_eal -I../lib/librte_eal -Ilib/librte_kvargs -I../lib/librte_kvargs -Ilib/librte_telemetry/../librte_metrics -I../lib/librte_telemetry/../librte_metrics -Ilib/librte_telemetry -I../lib/librte_telemetry -Ilib/librte_mbuf -I../lib/librte_mbuf -Ilib/librte_mempool -I../lib/librte_mempool -Ilib/librte_ring -I../lib/librte_ring -Idrivers/bus/vdev -I../drivers/bus/vdev -Xclang -fcolor-diagnostics -pipe -D_FILE_OFFSET_BITS=64 -Wall -Winvalid-pch -Werror -O2 -g -include rte_config.h -Wextra -Wcast-qual -Wdeprecated -Wformat-nonliteral -Wformat-security -Wmissing-declarations -Wmissing-prototypes -Wnested-externs -Wold-style-definition -Wpointer-arith -Wsign-compare -Wstrict-prototypes -Wundef -Wwrite-strings -Wno-address-of-packed-member -Wno-missing-field-initializers -D_GNU_SOURCE -fPIC -march=native -mno-avx512f -DALLOW_EXPERIMENTAL_API -DALLOW_INTERNAL_API -MD -MQ 'drivers/a715181@@tmp_rte_pmd_bcmfs at sta/crypto_bcmfs_bcmfs_sym_engine.c.o' -MF 'drivers/a715181@@tmp_rte_pmd_bcmfs at sta/crypto_bcmfs_bcmfs_sym_engine.c.o.d' -o 'drivers/a715181@@tmp_rte_pmd_bcmfs at sta/crypto_bcmfs_bcmfs_sym_engine.c.o' -c ../drivers/crypto/bcmfs/bcmfs_sym_engine.c
../drivers/crypto/bcmfs/bcmfs_sym_engine.c:607:24: error: implicit conversion from enumeration type 'enum spu2_proto_sel' to different enumeration type 'enum spu2_cipher_type' [-Werror,-Wenum-conversion]
                             SPU2_VAL_NONE, SPU2_PROTO_RESV,
                                            ^~~~~~~~~~~~~~~
../drivers/crypto/bcmfs/bcmfs_sym_engine.c:844:20: error: implicit conversion from enumeration type 'enum spu2_cipher_type' to different enumeration type 'enum spu2_hash_type' [-Werror,-Wenum-conversion]
                spu2_auth_type = spu2_ciph_type;
                               ~ ^~~~~~~~~~~~~~
../drivers/crypto/bcmfs/bcmfs_sym_engine.c:865:20: error: implicit conversion from enumeration type 'enum spu2_cipher_type' to different enumeration type 'enum spu2_hash_type' [-Werror,-Wenum-conversion]
                spu2_auth_type = spu2_ciph_type;
                               ~ ^~~~~~~~~~~~~~
3 errors generated.
[1944/2416] Compiling C object 'drivers/a715181@@tmp_rte_pmd_crypto_scheduler at sta/crypto_scheduler_scheduler_multicore.c.o'.
[1945/2416] Compiling C object 'drivers/a715181@@tmp_rte_pmd_octeontx2_crypto at sta/crypto_octeontx2_otx2_cryptodev_ops.c.o'.
[1946/2416] Compiling C object 'drivers/a715181@@tmp_rte_pmd_isal at sta/compress_isal_isal_compress_pmd_ops.c.o'.
[1947/2416] Compiling C object 'drivers/a715181@@tmp_rte_pmd_octeontx_crypto at sta/crypto_octeontx_otx_cryptodev_ops.c.o'.
[1948/2416] Compiling C object 'drivers/a715181@@tmp_rte_pmd_isal at sta/compress_isal_isal_compress_pmd.c.o'.
ninja: build stopped: subcommand failed




*Meson Build Failed #2:
OS: FC32-64
Target:./build-gcc-static
FAILED: drivers/a715181@@tmp_rte_pmd_bcmfs at sta/crypto_bcmfs_bcmfs_sym_capabilities.c.o 
gcc -Idrivers/a715181@@tmp_rte_pmd_bcmfs at sta -Idrivers -I../drivers -Idrivers/crypto/bcmfs -I../drivers/crypto/bcmfs -Ilib/librte_cryptodev -I../lib/librte_cryptodev -I. -I../ -Iconfig -I../config -Ilib/librte_eal/include -I../lib/librte_eal/include -Ilib/librte_eal/linux/include -I../lib/librte_eal/linux/include -Ilib/librte_eal/x86/include -I../lib/librte_eal/x86/include -Ilib/librte_eal/common -I../lib/librte_eal/common -Ilib/librte_eal -I../lib/librte_eal -Ilib/librte_kvargs -I../lib/librte_kvargs -Ilib/librte_telemetry/../librte_metrics -I../lib/librte_telemetry/../librte_metrics -Ilib/librte_telemetry -I../lib/librte_telemetry -Ilib/librte_mbuf -I../lib/librte_mbuf -Ilib/librte_mempool -I../lib/librte_mempool -Ilib/librte_ring -I../lib/librte_ring -Idrivers/bus/vdev -I../drivers/bus/vdev -fdiagnostics-color=always -pipe -D_FILE_OFFSET_BITS=64 -Wall -Winvalid-pch -Werror -O2 -g -include rte_config.h -Wextra -Wcast-qual -Wdeprecated -Wformat-nonliteral -Wformat-security -Wmissing-declarations -Wmissing-prototypes -Wnested-externs -Wold-style-definition -Wpointer-arith -Wsign-compare -Wstrict-prototypes -Wundef -Wwrite-strings -Wno-address-of-packed-member -Wno-packed-not-aligned -Wno-missing-field-initializers -Wno-zero-length-bounds -D_GNU_SOURCE -fPIC -march=native -DALLOW_EXPERIMENTAL_API -DALLOW_INTERNAL_API -Wno-format-truncation -MD -MQ 'drivers/a715181@@tmp_rte_pmd_bcmfs at sta/crypto_bcmfs_bcmfs_sym_capabilities.c.o' -MF 'drivers/a715181@@tmp_rte_pmd_bcmfs at sta/crypto_bcmfs_bcmfs_sym_capabilities.c.o.d' -o 'drivers/a715181@@tmp_rte_pmd_bcmfs at sta/crypto_bcmfs_bcmfs_sym_capabilities.c.o' -c ../drivers/crypto/bcmfs/bcmfs_sym_capabilities.c
../drivers/crypto/bcmfs/bcmfs_sym_capabilities.c:478:13: error: implicit conversion from ‘enum rte_crypto_auth_algorithm’ to ‘enum rte_crypto_aead_algorithm’ [-Werror=enum-conversion]
  478 |     .algo = RTE_CRYPTO_AUTH_AES_GMAC,
      |             ^~~~~~~~~~~~~~~~~~~~~~~~
cc1: all warnings being treated as errors
[1945/2417] Generating rte_pmd_dpaa2_sec.sym_chk with a meson_exe.py custom command.
[1946/2417] Compiling C object 'drivers/a715181@@tmp_rte_pmd_zuc at sta/crypto_zuc_rte_zuc_pmd.c.o'.
[1947/2417] Compiling C object 'drivers/a715181@@tmp_rte_pmd_bcmfs at sta/crypto_bcmfs_bcmfs_sym_pmd.c.o'.
[1948/2417] Generating symbol file 'drivers/a715181@@rte_pmd_dpaa_sec at sha/librte_pmd_dpaa_sec.so.20.0.3.symbols'.
[1949/2417] Generating rte_pmd_crypto_scheduler.sym_chk with a meson_exe.py custom command.
[1950/2417] Compiling C object 'drivers/a715181@@tmp_rte_pmd_bcmfs at sta/crypto_bcmfs_bcmfs_sym.c.o'.
[1951/2417] Compiling C object 'drivers/a715181@@tmp_rte_pmd_bcmfs at sta/crypto_bcmfs_bcmfs_sym_engine.c.o'.
FAILED: drivers/a715181@@tmp_rte_pmd_bcmfs at sta/crypto_bcmfs_bcmfs_sym_engine.c.o 
gcc -Idrivers/a715181@@tmp_rte_pmd_bcmfs at sta -Idrivers -I../drivers -Idrivers/crypto/bcmfs -I../drivers/crypto/bcmfs -Ilib/librte_cryptodev -I../lib/librte_cryptodev -I. -I../ -Iconfig -I../config -Ilib/librte_eal/include -I../lib/librte_eal/include -Ilib/librte_eal/linux/include -I../lib/librte_eal/linux/include -Ilib/librte_eal/x86/include -I../lib/librte_eal/x86/include -Ilib/librte_eal/common -I../lib/librte_eal/common -Ilib/librte_eal -I../lib/librte_eal -Ilib/librte_kvargs -I../lib/librte_kvargs -Ilib/librte_telemetry/../librte_metrics -I../lib/librte_telemetry/../librte_metrics -Ilib/librte_telemetry -I../lib/librte_telemetry -Ilib/librte_mbuf -I../lib/librte_mbuf -Ilib/librte_mempool -I../lib/librte_mempool -Ilib/librte_ring -I../lib/librte_ring -Idrivers/bus/vdev -I../drivers/bus/vdev -fdiagnostics-color=always -pipe -D_FILE_OFFSET_BITS=64 -Wall -Winvalid-pch -Werror -O2 -g -include rte_config.h -Wextra -Wcast-qual -Wdeprecated -Wformat-nonliteral -Wformat-security -Wmissing-declarations -Wmissing-prototypes -Wnested-externs -Wold-style-definition -Wpointer-arith -Wsign-compare -Wstrict-prototypes -Wundef -Wwrite-strings -Wno-address-of-packed-member -Wno-packed-not-aligned -Wno-missing-field-initializers -Wno-zero-length-bounds -D_GNU_SOURCE -fPIC -march=native -DALLOW_EXPERIMENTAL_API -DALLOW_INTERNAL_API -Wno-format-truncation -MD -MQ 'drivers/a715181@@tmp_rte_pmd_bcmfs at sta/crypto_bcmfs_bcmfs_sym_engine.c.o' -MF 'drivers/a715181@@tmp_rte_pmd_bcmfs at sta/crypto_bcmfs_bcmfs_sym_engine.c.o.d' -o 'drivers/a715181@@tmp_rte_pmd_bcmfs at sta/crypto_bcmfs_bcmfs_sym_engine.c.o' -c ../drivers/crypto/bcmfs/bcmfs_sym_engine.c
../drivers/crypto/bcmfs/bcmfs_sym_engine.c: In function ‘bcmfs_crypto_build_auth_req’:
../drivers/crypto/bcmfs/bcmfs_sym_engine.c:607:24: error: implicit conversion from ‘enum spu2_proto_sel’ to ‘enum spu2_cipher_type’ [-Werror=enum-conversion]
  607 |         SPU2_VAL_NONE, SPU2_PROTO_RESV,
      |                        ^~~~~~~~~~~~~~~
../drivers/crypto/bcmfs/bcmfs_sym_engine.c: In function ‘bcmfs_crypto_build_aead_request’:
../drivers/crypto/bcmfs/bcmfs_sym_engine.c:844:18: error: implicit conversion from ‘enum spu2_cipher_type’ to ‘enum spu2_hash_type’ [-Werror=enum-conversion]
  844 |   spu2_auth_type = spu2_ciph_type;
      |                  ^
../drivers/crypto/bcmfs/bcmfs_sym_engine.c:865:18: error: implicit conversion from ‘enum spu2_cipher_type’ to ‘enum spu2_hash_type’ [-Werror=enum-conversion]
  865 |   spu2_auth_type = spu2_ciph_type;
      |                  ^
cc1: all warnings being treated as errors
[1952/2417] Compiling C object 'drivers/a715181@@tmp_rte_pmd_bcmfs at sta/crypto_bcmfs_bcmfs_sym_session.c.o'.
FAILED: drivers/a715181@@tmp_rte_pmd_bcmfs at sta/crypto_bcmfs_bcmfs_sym_session.c.o 
gcc -Idrivers/a715181@@tmp_rte_pmd_bcmfs at sta -Idrivers -I../drivers -Idrivers/crypto/bcmfs -I../drivers/crypto/bcmfs -Ilib/librte_cryptodev -I../lib/librte_cryptodev -I. -I../ -Iconfig -I../config -Ilib/librte_eal/include -I../lib/librte_eal/include -Ilib/librte_eal/linux/include -I../lib/librte_eal/linux/include -Ilib/librte_eal/x86/include -I../lib/librte_eal/x86/include -Ilib/librte_eal/common -I../lib/librte_eal/common -Ilib/librte_eal -I../lib/librte_eal -Ilib/librte_kvargs -I../lib/librte_kvargs -Ilib/librte_telemetry/../librte_metrics -I../lib/librte_telemetry/../librte_metrics -Ilib/librte_telemetry -I../lib/librte_telemetry -Ilib/librte_mbuf -I../lib/librte_mbuf -Ilib/librte_mempool -I../lib/librte_mempool -Ilib/librte_ring -I../lib/librte_ring -Idrivers/bus/vdev -I../drivers/bus/vdev -fdiagnostics-color=always -pipe -D_FILE_OFFSET_BITS=64 -Wall -Winvalid-pch -Werror -O2 -g -include rte_config.h -Wextra -Wcast-qual -Wdeprecated -Wformat-nonliteral -Wformat-security -Wmissing-declarations -Wmissing-prototypes -Wnested-externs -Wold-style-definition -Wpointer-arith -Wsign-compare -Wstrict-prototypes -Wundef -Wwrite-strings -Wno-address-of-packed-member -Wno-packed-not-aligned -Wno-missing-field-initializers -Wno-zero-length-bounds -D_GNU_SOURCE -fPIC -march=native -DALLOW_EXPERIMENTAL_API -DALLOW_INTERNAL_API -Wno-format-truncation -MD -MQ 'drivers/a715181@@tmp_rte_pmd_bcmfs at sta/crypto_bcmfs_bcmfs_sym_session.c.o' -MF 'drivers/a715181@@tmp_rte_pmd_bcmfs at sta/crypto_bcmfs_bcmfs_sym_session.c.o.d' -o 'drivers/a715181@@tmp_rte_pmd_bcmfs at sta/crypto_bcmfs_bcmfs_sym_session.c.o' -c ../drivers/crypto/bcmfs/bcmfs_sym_session.c
../drivers/crypto/bcmfs/bcmfs_sym_session.c: In function ‘crypto_set_session_cipher_parameters’:
../drivers/crypto/bcmfs/bcmfs_sym_session.c:60:25: error: implicit conversion from ‘const enum rte_crypto_cipher_operation’ to ‘enum bcmfs_crypto_cipher_op’ [-Werror=enum-conversion]
   60 |  sess->cipher.direction = cipher_xform->op;
      |                         ^
../drivers/crypto/bcmfs/bcmfs_sym_session.c:90:21: error: implicit conversion from ‘enum rte_crypto_cipher_algorithm’ to ‘enum bcmfs_crypto_cipher_algorithm’ [-Werror=enum-conversion]
   90 |   sess->cipher.algo = RTE_CRYPTO_CIPHER_NULL;
      |                     ^
../drivers/crypto/bcmfs/bcmfs_sym_session.c: In function ‘crypto_set_session_aead_parameters’:
../drivers/crypto/bcmfs/bcmfs_sym_session.c:215:25: error: implicit conversion from ‘const enum rte_crypto_aead_operation’ to ‘enum bcmfs_crypto_cipher_op’ [-Werror=enum-conversion]
  215 |  sess->cipher.direction = xform->aead.op;
      |                         ^
cc1: all warnings being treated as errors
[1953/2417] Compiling C object 'drivers/a715181@@tmp_rte_pmd_octeontx_compress at sta/compress_octeontx_otx_zip_pmd.c.o'.
[1954/2417] Compiling C object 'drivers/a715181@@tmp_rte_pmd_octeontx2_crypto at sta/crypto_octeontx2_otx2_cryptodev_ops.c.o'.
[1955/2417] Compiling C object 'drivers/a715181@@tmp_rte_pmd_octeontx_crypto at sta/crypto_octeontx_otx_cryptodev_ops.c.o'.
ninja: build stopped: subcommand failed




*Meson Build Failed #3:
OS: FreeBSD1201-64
Target:./build-gcc-static
FAILED: drivers/a715181@@tmp_rte_pmd_bcmfs at sta/crypto_bcmfs_bcmfs_vfio.c.o 
gcc -Idrivers/a715181@@tmp_rte_pmd_bcmfs at sta -Idrivers -I../drivers -Idrivers/crypto/bcmfs -I../drivers/crypto/bcmfs -Ilib/librte_cryptodev -I../lib/librte_cryptodev -I. -I.. -Iconfig -I../config -Ilib/librte_eal/include -I../lib/librte_eal/include -Ilib/librte_eal/freebsd/include -I../lib/librte_eal/freebsd/include -Ilib/librte_eal/x86/include -I../lib/librte_eal/x86/include -Ilib/librte_eal/common -I../lib/librte_eal/common -Ilib/librte_eal -I../lib/librte_eal -Ilib/librte_kvargs -I../lib/librte_kvargs -Ilib/librte_metrics -I../lib/librte_metrics -Ilib/librte_telemetry -I../lib/librte_telemetry -Ilib/librte_mbuf -I../lib/librte_mbuf -Ilib/librte_mempool -I../lib/librte_mempool -Ilib/librte_ring -I../lib/librte_ring -Idrivers/bus/vdev -I../drivers/bus/vdev -fdiagnostics-color=always -pipe -D_FILE_OFFSET_BITS=64 -Wall -Winvalid-pch -Werror -O2 -g -include rte_config.h -Wextra -Wcast-qual -Wdeprecated -Wformat-nonliteral -Wformat-security -Wmissing-declarations -Wmissing-prototypes -Wnested-externs -Wold-style-definition -Wpointer-arith -Wsign-compare -Wstrict-prototypes -Wundef -Wwrite-strings -Wno-address-of-packed-member -Wno-packed-not-aligned -Wno-missing-field-initializers -D_GNU_SOURCE -D__BSD_VISIBLE -fPIC -march=native -mno-avx512f -DALLOW_EXPERIMENTAL_API -DALLOW_INTERNAL_API -Wno-format-truncation -MD -MQ 'drivers/a715181@@tmp_rte_pmd_bcmfs at sta/crypto_bcmfs_bcmfs_vfio.c.o' -MF 'drivers/a715181@@tmp_rte_pmd_bcmfs at sta/crypto_bcmfs_bcmfs_vfio.c.o.d' -o 'drivers/a715181@@tmp_rte_pmd_bcmfs at sta/crypto_bcmfs_bcmfs_vfio.c.o' -c ../drivers/crypto/bcmfs/bcmfs_vfio.c
../drivers/crypto/bcmfs/bcmfs_vfio.c: In function 'vfio_map_dev_obj':
../drivers/crypto/bcmfs/bcmfs_vfio.c:21:9: error: variable 'status' has initializer but incomplete type
   21 |  struct vfio_group_status status = { .argsz = sizeof(status) };
      |         ^~~~~~~~~~~~~~~~~
../drivers/crypto/bcmfs/bcmfs_vfio.c:21:39: error: 'struct vfio_group_status' has no member named 'argsz'
   21 |  struct vfio_group_status status = { .argsz = sizeof(status) };
      |                                       ^~~~~
../drivers/crypto/bcmfs/bcmfs_vfio.c:21:53: error: invalid application of 'sizeof' to incomplete type 'struct vfio_group_status'
   21 |  struct vfio_group_status status = { .argsz = sizeof(status) };
      |                                                     ^
../drivers/crypto/bcmfs/bcmfs_vfio.c:21:47: error: excess elements in struct initializer [-Werror]
   21 |  struct vfio_group_status status = { .argsz = sizeof(status) };
      |                                               ^~~~~~
../drivers/crypto/bcmfs/bcmfs_vfio.c:21:47: note: (near initialization for 'status')
../drivers/crypto/bcmfs/bcmfs_vfio.c:21:27: error: storage size of 'status' isn't known
   21 |  struct vfio_group_status status = { .argsz = sizeof(status) };
      |                           ^~~~~~
../drivers/crypto/bcmfs/bcmfs_vfio.c:23:9: error: variable 'd_info' has initializer but incomplete type
   23 |  struct vfio_device_info d_info = { .argsz = sizeof(d_info) };
      |         ^~~~~~~~~~~~~~~~
../drivers/crypto/bcmfs/bcmfs_vfio.c:23:38: error: 'struct vfio_device_info' has no member named 'argsz'
   23 |  struct vfio_device_info d_info = { .argsz = sizeof(d_info) };
      |                                      ^~~~~
../drivers/crypto/bcmfs/bcmfs_vfio.c:23:52: error: invalid application of 'sizeof' to incomplete type 'struct vfio_device_info'
   23 |  struct vfio_device_info d_info = { .argsz = sizeof(d_info) };
      |                                                    ^
../drivers/crypto/bcmfs/bcmfs_vfio.c:23:46: error: excess elements in struct initializer [-Werror]
   23 |  struct vfio_device_info d_info = { .argsz = sizeof(d_info) };
      |                                              ^~~~~~
../drivers/crypto/bcmfs/bcmfs_vfio.c:23:46: note: (near initialization for 'd_info')
../drivers/crypto/bcmfs/bcmfs_vfio.c:23:26: error: storage size of 'd_info' isn't known
   23 |  struct vfio_device_info d_info = { .argsz = sizeof(d_info) };
      |                          ^~~~~~
../drivers/crypto/bcmfs/bcmfs_vfio.c:24:9: error: variable 'reg_info' has initializer but incomplete type
   24 |  struct vfio_region_info reg_info = { .argsz = sizeof(reg_info) };
      |         ^~~~~~~~~~~~~~~~
../drivers/crypto/bcmfs/bcmfs_vfio.c:24:40: error: 'struct vfio_region_info' has no member named 'argsz'
   24 |  struct vfio_region_info reg_info = { .argsz = sizeof(reg_info) };
      |                                        ^~~~~
../drivers/crypto/bcmfs/bcmfs_vfio.c:24:54: error: invalid application of 'sizeof' to incomplete type 'struct vfio_region_info'
   24 |  struct vfio_region_info reg_info = { .argsz = sizeof(reg_info) };
      |                                                      ^
../drivers/crypto/bcmfs/bcmfs_vfio.c:24:48: error: excess elements in struct initializer [-Werror]
   24 |  struct vfio_region_info reg_info = { .argsz = sizeof(reg_info) };
      |                                                ^~~~~~
../drivers/crypto/bcmfs/bcmfs_vfio.c:24:48: note: (near initialization for 'reg_info')
../drivers/crypto/bcmfs/bcmfs_vfio.c:24:26: error: storage size of 'reg_info' isn't known
   24 |  struct vfio_region_info reg_info = { .argsz = sizeof(reg_info) };
      |                          ^~~~~~~~
../drivers/crypto/bcmfs/bcmfs_vfio.c:33:23: error: 'VFIO_DEVICE_GET_REGION_INFO' undeclared (first use in this function)
   33 |  ret = ioctl(*dev_fd, VFIO_DEVICE_GET_REGION_INFO, &reg_info);
      |                       ^~~~~~~~~~~~~~~~~~~~~~~~~~~
../drivers/crypto/bcmfs/bcmfs_vfio.c:33:23: note: each undeclared identifier is reported only once for each function it appears in
cc1: all warnings being treated as errors
[1362/1802] Compiling C object 'drivers/a715181@@tmp_rte_pmd_crypto_scheduler at sta/crypto_scheduler_scheduler_roundrobin.c.o'
[1363/1802] Compiling C object 'drivers/a715181@@tmp_rte_pmd_bcmfs at sta/crypto_bcmfs_bcmfs_qp.c.o'
[1364/1802] Compiling C object 'drivers/a715181@@tmp_rte_pmd_virtio_crypto at sta/crypto_virtio_virtqueue.c.o'
[1365/1802] Compiling C object 'drivers/a715181@@tmp_rte_pmd_virtio_crypto at sta/crypto_virtio_virtio_rxtx.c.o'
[1366/1802] Compiling C object 'drivers/a715181@@tmp_rte_pmd_virtio_crypto at sta/crypto_virtio_virtio_pci.c.o'
[1367/1802] Generating rte_pmd_null_crypto.sym_chk with a meson_exe.py custom command
[1368/1802] Compiling C object 'drivers/a715181@@tmp_rte_pmd_virtio_crypto at sta/crypto_virtio_virtio_cryptodev.c.o'
[1369/1802] Compiling C object 'drivers/a715181@@tmp_rte_pmd_bcmfs at sta/crypto_bcmfs_bcmfs_device.c.o'
[1370/1802] Compiling C object 'drivers/a715181@@tmp_rte_pmd_crypto_scheduler at sta/crypto_scheduler_scheduler_multicore.c.o'
ninja: build stopped: subcommand failed




*Meson Build Failed #4:
OS: SUSE15-64
Target:./build-gcc-static
FAILED: drivers/a715181@@tmp_rte_pmd_bcmfs at sta/crypto_bcmfs_bcmfs_sym_capabilities.c.o 
clang -Idrivers/a715181@@tmp_rte_pmd_bcmfs at sta -Idrivers -I../drivers -Idrivers/crypto/bcmfs -I../drivers/crypto/bcmfs -Ilib/librte_cryptodev -I../lib/librte_cryptodev -I. -I../ -Iconfig -I../config -Ilib/librte_eal/include -I../lib/librte_eal/include -Ilib/librte_eal/linux/include -I../lib/librte_eal/linux/include -Ilib/librte_eal/x86/include -I../lib/librte_eal/x86/include -Ilib/librte_eal/common -I../lib/librte_eal/common -Ilib/librte_eal -I../lib/librte_eal -Ilib/librte_kvargs -I../lib/librte_kvargs -Ilib/librte_telemetry/../librte_metrics -I../lib/librte_telemetry/../librte_metrics -Ilib/librte_telemetry -I../lib/librte_telemetry -Ilib/librte_mbuf -I../lib/librte_mbuf -Ilib/librte_mempool -I../lib/librte_mempool -Ilib/librte_ring -I../lib/librte_ring -Idrivers/bus/vdev -I../drivers/bus/vdev -Xclang -fcolor-diagnostics -pipe -D_FILE_OFFSET_BITS=64 -Wall -Winvalid-pch -Werror -O2 -g -include rte_config.h -Wextra -Wcast-qual -Wdeprecated -Wformat-nonliteral -Wformat-security -Wmissing-declarations -Wmissing-prototypes -Wnested-externs -Wold-style-definition -Wpointer-arith -Wsign-compare -Wstrict-prototypes -Wundef -Wwrite-strings -Wno-address-of-packed-member -Wno-missing-field-initializers -D_GNU_SOURCE -fPIC -march=native -DALLOW_EXPERIMENTAL_API -DALLOW_INTERNAL_API -MD -MQ 'drivers/a715181@@tmp_rte_pmd_bcmfs at sta/crypto_bcmfs_bcmfs_sym_capabilities.c.o' -MF 'drivers/a715181@@tmp_rte_pmd_bcmfs at sta/crypto_bcmfs_bcmfs_sym_capabilities.c.o.d' -o 'drivers/a715181@@tmp_rte_pmd_bcmfs at sta/crypto_bcmfs_bcmfs_sym_capabilities.c.o' -c ../drivers/crypto/bcmfs/bcmfs_sym_capabilities.c
../drivers/crypto/bcmfs/bcmfs_sym_capabilities.c:478:13: error: implicit conversion from enumeration type 'enum rte_crypto_auth_algorithm' to different enumeration type 'enum rte_crypto_aead_algorithm' [-Werror,-Wenum-conversion]
                                .algo = RTE_CRYPTO_AUTH_AES_GMAC,
                                        ^~~~~~~~~~~~~~~~~~~~~~~~
1 error generated.
[1861/2311] Compiling C object 'drivers/a715181@@tmp_rte_pmd_bcmfs at sta/crypto_bcmfs_bcmfs_sym_pmd.c.o'.
[1862/2311] Generating rte_pmd_dpaa2_sec.sym_chk with a meson_exe.py custom command.
[1863/2311] Generating rte_pmd_virtio_crypto.sym_chk with a meson_exe.py custom command.
[1864/2311] Compiling C object 'drivers/a715181@@tmp_rte_pmd_bcmfs at sta/crypto_bcmfs_bcmfs_sym_session.c.o'.
FAILED: drivers/a715181@@tmp_rte_pmd_bcmfs at sta/crypto_bcmfs_bcmfs_sym_session.c.o 
clang -Idrivers/a715181@@tmp_rte_pmd_bcmfs at sta -Idrivers -I../drivers -Idrivers/crypto/bcmfs -I../drivers/crypto/bcmfs -Ilib/librte_cryptodev -I../lib/librte_cryptodev -I. -I../ -Iconfig -I../config -Ilib/librte_eal/include -I../lib/librte_eal/include -Ilib/librte_eal/linux/include -I../lib/librte_eal/linux/include -Ilib/librte_eal/x86/include -I../lib/librte_eal/x86/include -Ilib/librte_eal/common -I../lib/librte_eal/common -Ilib/librte_eal -I../lib/librte_eal -Ilib/librte_kvargs -I../lib/librte_kvargs -Ilib/librte_telemetry/../librte_metrics -I../lib/librte_telemetry/../librte_metrics -Ilib/librte_telemetry -I../lib/librte_telemetry -Ilib/librte_mbuf -I../lib/librte_mbuf -Ilib/librte_mempool -I../lib/librte_mempool -Ilib/librte_ring -I../lib/librte_ring -Idrivers/bus/vdev -I../drivers/bus/vdev -Xclang -fcolor-diagnostics -pipe -D_FILE_OFFSET_BITS=64 -Wall -Winvalid-pch -Werror -O2 -g -include rte_config.h -Wextra -Wcast-qual -Wdeprecated -Wformat-nonliteral -Wformat-security -Wmissing-declarations -Wmissing-prototypes -Wnested-externs -Wold-style-definition -Wpointer-arith -Wsign-compare -Wstrict-prototypes -Wundef -Wwrite-strings -Wno-address-of-packed-member -Wno-missing-field-initializers -D_GNU_SOURCE -fPIC -march=native -DALLOW_EXPERIMENTAL_API -DALLOW_INTERNAL_API -MD -MQ 'drivers/a715181@@tmp_rte_pmd_bcmfs at sta/crypto_bcmfs_bcmfs_sym_session.c.o' -MF 'drivers/a715181@@tmp_rte_pmd_bcmfs at sta/crypto_bcmfs_bcmfs_sym_session.c.o.d' -o 'drivers/a715181@@tmp_rte_pmd_bcmfs at sta/crypto_bcmfs_bcmfs_sym_session.c.o' -c ../drivers/crypto/bcmfs/bcmfs_sym_session.c
../drivers/crypto/bcmfs/bcmfs_sym_session.c:60:41: error: implicit conversion from enumeration type 'const enum rte_crypto_cipher_operation' to different enumeration type 'enum bcmfs_crypto_cipher_op' [-Werror,-Wenum-conversion]
        sess->cipher.direction = cipher_xform->op;
                               ~ ~~~~~~~~~~~~~~^~
../drivers/crypto/bcmfs/bcmfs_sym_session.c:90:23: error: implicit conversion from enumeration type 'enum rte_crypto_cipher_algorithm' to different enumeration type 'enum bcmfs_crypto_cipher_algorithm' [-Werror,-Wenum-conversion]
                sess->cipher.algo = RTE_CRYPTO_CIPHER_NULL;
                                  ~ ^~~~~~~~~~~~~~~~~~~~~~
../drivers/crypto/bcmfs/bcmfs_sym_session.c:215:39: error: implicit conversion from enumeration type 'const enum rte_crypto_aead_operation' to different enumeration type 'enum bcmfs_crypto_cipher_op' [-Werror,-Wenum-conversion]
        sess->cipher.direction = xform->aead.op;
                               ~ ~~~~~~~~~~~~^~
3 errors generated.
[1865/2311] Compiling C object 'drivers/a715181@@tmp_rte_pmd_octeontx_crypto at sta/crypto_octeontx_otx_cryptodev_ops.c.o'.
[1866/2311] Generating symbol file 'drivers/a715181@@rte_pmd_dpaa_sec at sha/librte_pmd_dpaa_sec.so.20.0.3.symbols'.
[1867/2311] Compiling C object 'drivers/a715181@@tmp_rte_pmd_bcmfs at sta/crypto_bcmfs_bcmfs_sym.c.o'.
[1868/2311] Compiling C object 'drivers/a715181@@tmp_rte_pmd_octeontx2_crypto at sta/crypto_octeontx2_otx2_cryptodev_ops.c.o'.
[1869/2311] Compiling C object 'drivers/a715181@@tmp_rte_pmd_bcmfs at sta/crypto_bcmfs_bcmfs_sym_engine.c.o'.
FAILED: drivers/a715181@@tmp_rte_pmd_bcmfs at sta/crypto_bcmfs_bcmfs_sym_engine.c.o 
clang -Idrivers/a715181@@tmp_rte_pmd_bcmfs at sta -Idrivers -I../drivers -Idrivers/crypto/bcmfs -I../drivers/crypto/bcmfs -Ilib/librte_cryptodev -I../lib/librte_cryptodev -I. -I../ -Iconfig -I../config -Ilib/librte_eal/include -I../lib/librte_eal/include -Ilib/librte_eal/linux/include -I../lib/librte_eal/linux/include -Ilib/librte_eal/x86/include -I../lib/librte_eal/x86/include -Ilib/librte_eal/common -I../lib/librte_eal/common -Ilib/librte_eal -I../lib/librte_eal -Ilib/librte_kvargs -I../lib/librte_kvargs -Ilib/librte_telemetry/../librte_metrics -I../lib/librte_telemetry/../librte_metrics -Ilib/librte_telemetry -I../lib/librte_telemetry -Ilib/librte_mbuf -I../lib/librte_mbuf -Ilib/librte_mempool -I../lib/librte_mempool -Ilib/librte_ring -I../lib/librte_ring -Idrivers/bus/vdev -I../drivers/bus/vdev -Xclang -fcolor-diagnostics -pipe -D_FILE_OFFSET_BITS=64 -Wall -Winvalid-pch -Werror -O2 -g -include rte_config.h -Wextra -Wcast-qual -Wdeprecated -Wformat-nonliteral -Wformat-security -Wmissing-declarations -Wmissing-prototypes -Wnested-externs -Wold-style-definition -Wpointer-arith -Wsign-compare -Wstrict-prototypes -Wundef -Wwrite-strings -Wno-address-of-packed-member -Wno-missing-field-initializers -D_GNU_SOURCE -fPIC -march=native -DALLOW_EXPERIMENTAL_API -DALLOW_INTERNAL_API -MD -MQ 'drivers/a715181@@tmp_rte_pmd_bcmfs at sta/crypto_bcmfs_bcmfs_sym_engine.c.o' -MF 'drivers/a715181@@tmp_rte_pmd_bcmfs at sta/crypto_bcmfs_bcmfs_sym_engine.c.o.d' -o 'drivers/a715181@@tmp_rte_pmd_bcmfs at sta/crypto_bcmfs_bcmfs_sym_engine.c.o' -c ../drivers/crypto/bcmfs/bcmfs_sym_engine.c
../drivers/crypto/bcmfs/bcmfs_sym_engine.c:607:24: error: implicit conversion from enumeration type 'enum spu2_proto_sel' to different enumeration type 'enum spu2_cipher_type' [-Werror,-Wenum-conversion]
                             SPU2_VAL_NONE, SPU2_PROTO_RESV,
                                            ^~~~~~~~~~~~~~~
../drivers/crypto/bcmfs/bcmfs_sym_engine.c:844:20: error: implicit conversion from enumeration type 'enum spu2_cipher_type' to different enumeration type 'enum spu2_hash_type' [-Werror,-Wenum-conversion]
                spu2_auth_type = spu2_ciph_type;
                               ~ ^~~~~~~~~~~~~~
../drivers/crypto/bcmfs/bcmfs_sym_engine.c:865:20: error: implicit conversion from enumeration type 'enum spu2_cipher_type' to different enumeration type 'enum spu2_hash_type' [-Werror,-Wenum-conversion]
                spu2_auth_type = spu2_ciph_type;
                               ~ ^~~~~~~~~~~~~~
3 errors generated.
ninja: build stopped: subcommand failed




*Meson Build Failed #5:
OS: UB1804-32
Target:./build-gcc-static
FAILED: drivers/a715181@@tmp_rte_pmd_bcmfs at sta/crypto_bcmfs_bcmfs_sym_capabilities.c.o 
clang -Idrivers/a715181@@tmp_rte_pmd_bcmfs at sta -Idrivers -I../drivers -Idrivers/crypto/bcmfs -I../drivers/crypto/bcmfs -Ilib/librte_cryptodev -I../lib/librte_cryptodev -I. -I../ -Iconfig -I../config -Ilib/librte_eal/include -I../lib/librte_eal/include -Ilib/librte_eal/linux/include -I../lib/librte_eal/linux/include -Ilib/librte_eal/x86/include -I../lib/librte_eal/x86/include -Ilib/librte_eal/common -I../lib/librte_eal/common -Ilib/librte_eal -I../lib/librte_eal -Ilib/librte_kvargs -I../lib/librte_kvargs -Ilib/librte_telemetry/../librte_metrics -I../lib/librte_telemetry/../librte_metrics -Ilib/librte_telemetry -I../lib/librte_telemetry -Ilib/librte_mbuf -I../lib/librte_mbuf -Ilib/librte_mempool -I../lib/librte_mempool -Ilib/librte_ring -I../lib/librte_ring -Idrivers/bus/vdev -I../drivers/bus/vdev -Xclang -fcolor-diagnostics -pipe -D_FILE_OFFSET_BITS=64 -Wall -Winvalid-pch -Werror -O2 -g -include rte_config.h -Wextra -Wcast-qual -Wdeprecated -Wformat-nonliteral -Wformat-security -Wmissing-declarations -Wmissing-prototypes -Wnested-externs -Wold-style-definition -Wpointer-arith -Wsign-compare -Wstrict-prototypes -Wundef -Wwrite-strings -Wno-address-of-packed-member -Wno-missing-field-initializers -Wno-pointer-to-int-cast -D_GNU_SOURCE -m32 -fPIC -march=native -DALLOW_EXPERIMENTAL_API -DALLOW_INTERNAL_API -MD -MQ 'drivers/a715181@@tmp_rte_pmd_bcmfs at sta/crypto_bcmfs_bcmfs_sym_capabilities.c.o' -MF 'drivers/a715181@@tmp_rte_pmd_bcmfs at sta/crypto_bcmfs_bcmfs_sym_capabilities.c.o.d' -o 'drivers/a715181@@tmp_rte_pmd_bcmfs at sta/crypto_bcmfs_bcmfs_sym_capabilities.c.o' -c ../drivers/crypto/bcmfs/bcmfs_sym_capabilities.c
../drivers/crypto/bcmfs/bcmfs_sym_capabilities.c:478:13: error: implicit conversion from enumeration type 'enum rte_crypto_auth_algorithm' to different enumeration type 'enum rte_crypto_aead_algorithm' [-Werror,-Wenum-conversion]
                                .algo = RTE_CRYPTO_AUTH_AES_GMAC,
                                        ^~~~~~~~~~~~~~~~~~~~~~~~
1 error generated.
[1693/2157] Generating rte_pmd_bcmfs_def with a custom command.
[1694/2157] Compiling C object 'drivers/a715181@@tmp_rte_pmd_bcmfs at sta/crypto_bcmfs_bcmfs_sym_session.c.o'.
FAILED: drivers/a715181@@tmp_rte_pmd_bcmfs at sta/crypto_bcmfs_bcmfs_sym_session.c.o 
clang -Idrivers/a715181@@tmp_rte_pmd_bcmfs at sta -Idrivers -I../drivers -Idrivers/crypto/bcmfs -I../drivers/crypto/bcmfs -Ilib/librte_cryptodev -I../lib/librte_cryptodev -I. -I../ -Iconfig -I../config -Ilib/librte_eal/include -I../lib/librte_eal/include -Ilib/librte_eal/linux/include -I../lib/librte_eal/linux/include -Ilib/librte_eal/x86/include -I../lib/librte_eal/x86/include -Ilib/librte_eal/common -I../lib/librte_eal/common -Ilib/librte_eal -I../lib/librte_eal -Ilib/librte_kvargs -I../lib/librte_kvargs -Ilib/librte_telemetry/../librte_metrics -I../lib/librte_telemetry/../librte_metrics -Ilib/librte_telemetry -I../lib/librte_telemetry -Ilib/librte_mbuf -I../lib/librte_mbuf -Ilib/librte_mempool -I../lib/librte_mempool -Ilib/librte_ring -I../lib/librte_ring -Idrivers/bus/vdev -I../drivers/bus/vdev -Xclang -fcolor-diagnostics -pipe -D_FILE_OFFSET_BITS=64 -Wall -Winvalid-pch -Werror -O2 -g -include rte_config.h -Wextra -Wcast-qual -Wdeprecated -Wformat-nonliteral -Wformat-security -Wmissing-declarations -Wmissing-prototypes -Wnested-externs -Wold-style-definition -Wpointer-arith -Wsign-compare -Wstrict-prototypes -Wundef -Wwrite-strings -Wno-address-of-packed-member -Wno-missing-field-initializers -Wno-pointer-to-int-cast -D_GNU_SOURCE -m32 -fPIC -march=native -DALLOW_EXPERIMENTAL_API -DALLOW_INTERNAL_API -MD -MQ 'drivers/a715181@@tmp_rte_pmd_bcmfs at sta/crypto_bcmfs_bcmfs_sym_session.c.o' -MF 'drivers/a715181@@tmp_rte_pmd_bcmfs at sta/crypto_bcmfs_bcmfs_sym_session.c.o.d' -o 'drivers/a715181@@tmp_rte_pmd_bcmfs at sta/crypto_bcmfs_bcmfs_sym_session.c.o' -c ../drivers/crypto/bcmfs/bcmfs_sym_session.c
../drivers/crypto/bcmfs/bcmfs_sym_session.c:60:41: error: implicit conversion from enumeration type 'const enum rte_crypto_cipher_operation' to different enumeration type 'enum bcmfs_crypto_cipher_op' [-Werror,-Wenum-conversion]
        sess->cipher.direction = cipher_xform->op;
                               ~ ~~~~~~~~~~~~~~^~
../drivers/crypto/bcmfs/bcmfs_sym_session.c:90:23: error: implicit conversion from enumeration type 'enum rte_crypto_cipher_algorithm' to different enumeration type 'enum bcmfs_crypto_cipher_algorithm' [-Werror,-Wenum-conversion]
                sess->cipher.algo = RTE_CRYPTO_CIPHER_NULL;
                                  ~ ^~~~~~~~~~~~~~~~~~~~~~
../drivers/crypto/bcmfs/bcmfs_sym_session.c:215:39: error: implicit conversion from enumeration type 'const enum rte_crypto_aead_operation' to different enumeration type 'enum bcmfs_crypto_cipher_op' [-Werror,-Wenum-conversion]
        sess->cipher.direction = xform->aead.op;
                               ~ ~~~~~~~~~~~~^~
3 errors generated.
[1695/2157] Compiling C object 'drivers/a715181@@tmp_rte_pmd_bcmfs at sta/crypto_bcmfs_bcmfs_sym_pmd.c.o'.
[1696/2157] Compiling C object 'drivers/a715181@@tmp_rte_pmd_bcmfs at sta/crypto_bcmfs_bcmfs_sym.c.o'.
[1697/2157] Compiling C object 'drivers/a715181@@tmp_rte_pmd_bcmfs at sta/crypto_bcmfs_bcmfs_sym_engine.c.o'.
FAILED: drivers/a715181@@tmp_rte_pmd_bcmfs at sta/crypto_bcmfs_bcmfs_sym_engine.c.o 
clang -Idrivers/a715181@@tmp_rte_pmd_bcmfs at sta -Idrivers -I../drivers -Idrivers/crypto/bcmfs -I../drivers/crypto/bcmfs -Ilib/librte_cryptodev -I../lib/librte_cryptodev -I. -I../ -Iconfig -I../config -Ilib/librte_eal/include -I../lib/librte_eal/include -Ilib/librte_eal/linux/include -I../lib/librte_eal/linux/include -Ilib/librte_eal/x86/include -I../lib/librte_eal/x86/include -Ilib/librte_eal/common -I../lib/librte_eal/common -Ilib/librte_eal -I../lib/librte_eal -Ilib/librte_kvargs -I../lib/librte_kvargs -Ilib/librte_telemetry/../librte_metrics -I../lib/librte_telemetry/../librte_metrics -Ilib/librte_telemetry -I../lib/librte_telemetry -Ilib/librte_mbuf -I../lib/librte_mbuf -Ilib/librte_mempool -I../lib/librte_mempool -Ilib/librte_ring -I../lib/librte_ring -Idrivers/bus/vdev -I../drivers/bus/vdev -Xclang -fcolor-diagnostics -pipe -D_FILE_OFFSET_BITS=64 -Wall -Winvalid-pch -Werror -O2 -g -include rte_config.h -Wextra -Wcast-qual -Wdeprecated -Wformat-nonliteral -Wformat-security -Wmissing-declarations -Wmissing-prototypes -Wnested-externs -Wold-style-definition -Wpointer-arith -Wsign-compare -Wstrict-prototypes -Wundef -Wwrite-strings -Wno-address-of-packed-member -Wno-missing-field-initializers -Wno-pointer-to-int-cast -D_GNU_SOURCE -m32 -fPIC -march=native -DALLOW_EXPERIMENTAL_API -DALLOW_INTERNAL_API -MD -MQ 'drivers/a715181@@tmp_rte_pmd_bcmfs at sta/crypto_bcmfs_bcmfs_sym_engine.c.o' -MF 'drivers/a715181@@tmp_rte_pmd_bcmfs at sta/crypto_bcmfs_bcmfs_sym_engine.c.o.d' -o 'drivers/a715181@@tmp_rte_pmd_bcmfs at sta/crypto_bcmfs_bcmfs_sym_engine.c.o' -c ../drivers/crypto/bcmfs/bcmfs_sym_engine.c
../drivers/crypto/bcmfs/bcmfs_sym_engine.c:607:24: error: implicit conversion from enumeration type 'enum spu2_proto_sel' to different enumeration type 'enum spu2_cipher_type' [-Werror,-Wenum-conversion]
                             SPU2_VAL_NONE, SPU2_PROTO_RESV,
                                            ^~~~~~~~~~~~~~~
../drivers/crypto/bcmfs/bcmfs_sym_engine.c:844:20: error: implicit conversion from enumeration type 'enum spu2_cipher_type' to different enumeration type 'enum spu2_hash_type' [-Werror,-Wenum-conversion]
                spu2_auth_type = spu2_ciph_type;
                               ~ ^~~~~~~~~~~~~~
../drivers/crypto/bcmfs/bcmfs_sym_engine.c:865:20: error: implicit conversion from enumeration type 'enum spu2_cipher_type' to different enumeration type 'enum spu2_hash_type' [-Werror,-Wenum-conversion]
                spu2_auth_type = spu2_ciph_type;
                               ~ ^~~~~~~~~~~~~~
3 errors generated.
[1698/2157] Generating rte_pmd_virtio_crypto.sym_chk with a meson_exe.py custom command.
[1699/2157] Compiling C object 'drivers/a715181@@tmp_rte_pmd_crypto_scheduler at sta/crypto_scheduler_scheduler_multicore.c.o'.
[1700/2157] Compiling C object 'drivers/a715181@@tmp_rte_pmd_dpaa_sec at sta/crypto_dpaa_sec_dpaa_sec.c.o'.
[1701/2157] Compiling C object 'drivers/a715181@@tmp_rte_pmd_octeontx2_crypto at sta/crypto_octeontx2_otx2_cryptodev_ops.c.o'.
[1702/2157] Compiling C object 'drivers/a715181@@tmp_rte_pmd_octeontx_crypto at sta/crypto_octeontx_otx_cryptodev_ops.c.o'.
[1703/2157] Compiling C object 'drivers/a715181@@tmp_rte_pmd_dpaa2_sec at sta/crypto_dpaa2_sec_dpaa2_sec_dpseci.c.o'.
ninja: build stopped: subcommand failed




*Meson Build Failed #6:
OS: UB2004-64
Target:./build-gcc-static
FAILED: drivers/a715181@@tmp_rte_pmd_bcmfs at sta/crypto_bcmfs_bcmfs_sym_session.c.o 
clang -Idrivers/a715181@@tmp_rte_pmd_bcmfs at sta -Idrivers -I../drivers -Idrivers/crypto/bcmfs -I../drivers/crypto/bcmfs -Ilib/librte_cryptodev -I../lib/librte_cryptodev -I. -I../ -Iconfig -I../config -Ilib/librte_eal/include -I../lib/librte_eal/include -Ilib/librte_eal/linux/include -I../lib/librte_eal/linux/include -Ilib/librte_eal/x86/include -I../lib/librte_eal/x86/include -Ilib/librte_eal/common -I../lib/librte_eal/common -Ilib/librte_eal -I../lib/librte_eal -Ilib/librte_kvargs -I../lib/librte_kvargs -Ilib/librte_telemetry/../librte_metrics -I../lib/librte_telemetry/../librte_metrics -Ilib/librte_telemetry -I../lib/librte_telemetry -Ilib/librte_mbuf -I../lib/librte_mbuf -Ilib/librte_mempool -I../lib/librte_mempool -Ilib/librte_ring -I../lib/librte_ring -Idrivers/bus/vdev -I../drivers/bus/vdev -Xclang -fcolor-diagnostics -pipe -D_FILE_OFFSET_BITS=64 -Wall -Winvalid-pch -Werror -O2 -g -include rte_config.h -Wextra -Wcast-qual -Wdeprecated -Wformat-nonliteral -Wformat-security -Wmissing-declarations -Wmissing-prototypes -Wnested-externs -Wold-style-definition -Wpointer-arith -Wsign-compare -Wstrict-prototypes -Wundef -Wwrite-strings -Wno-address-of-packed-member -Wno-missing-field-initializers -D_GNU_SOURCE -fPIC -march=native -DALLOW_EXPERIMENTAL_API -DALLOW_INTERNAL_API -MD -MQ 'drivers/a715181@@tmp_rte_pmd_bcmfs at sta/crypto_bcmfs_bcmfs_sym_session.c.o' -MF 'drivers/a715181@@tmp_rte_pmd_bcmfs at sta/crypto_bcmfs_bcmfs_sym_session.c.o.d' -o 'drivers/a715181@@tmp_rte_pmd_bcmfs at sta/crypto_bcmfs_bcmfs_sym_session.c.o' -c ../drivers/crypto/bcmfs/bcmfs_sym_session.c
../drivers/crypto/bcmfs/bcmfs_sym_session.c:60:41: error: implicit conversion from enumeration type 'const enum rte_crypto_cipher_operation' to different enumeration type 'enum bcmfs_crypto_cipher_op' [-Werror,-Wenum-conversion]
        sess->cipher.direction = cipher_xform->op;
                               ~ ~~~~~~~~~~~~~~^~
../drivers/crypto/bcmfs/bcmfs_sym_session.c:90:23: error: implicit conversion from enumeration type 'enum rte_crypto_cipher_algorithm' to different enumeration type 'enum bcmfs_crypto_cipher_algorithm' [-Werror,-Wenum-conversion]
                sess->cipher.algo = RTE_CRYPTO_CIPHER_NULL;
                                  ~ ^~~~~~~~~~~~~~~~~~~~~~
../drivers/crypto/bcmfs/bcmfs_sym_session.c:215:39: error: implicit conversion from enumeration type 'const enum rte_crypto_aead_operation' to different enumeration type 'enum bcmfs_crypto_cipher_op' [-Werror,-Wenum-conversion]
        sess->cipher.direction = xform->aead.op;
                               ~ ~~~~~~~~~~~~^~
3 errors generated.
[1920/2407] Compiling C object 'drivers/a715181@@rte_pmd_dpaa2_sec at sta/meson-generated_.._rte_pmd_dpaa2_sec.pmd.c.o'.
[1921/2407] Generating rte_pmd_virtio_crypto.sym_chk with a meson_exe.py custom command.
[1922/2407] Generating rte_pmd_dpaa_sec.sym_chk with a meson_exe.py custom command.
[1923/2407] Compiling C object 'drivers/a715181@@tmp_rte_pmd_bcmfs at sta/crypto_bcmfs_bcmfs_sym_capabilities.c.o'.
FAILED: drivers/a715181@@tmp_rte_pmd_bcmfs at sta/crypto_bcmfs_bcmfs_sym_capabilities.c.o 
clang -Idrivers/a715181@@tmp_rte_pmd_bcmfs at sta -Idrivers -I../drivers -Idrivers/crypto/bcmfs -I../drivers/crypto/bcmfs -Ilib/librte_cryptodev -I../lib/librte_cryptodev -I. -I../ -Iconfig -I../config -Ilib/librte_eal/include -I../lib/librte_eal/include -Ilib/librte_eal/linux/include -I../lib/librte_eal/linux/include -Ilib/librte_eal/x86/include -I../lib/librte_eal/x86/include -Ilib/librte_eal/common -I../lib/librte_eal/common -Ilib/librte_eal -I../lib/librte_eal -Ilib/librte_kvargs -I../lib/librte_kvargs -Ilib/librte_telemetry/../librte_metrics -I../lib/librte_telemetry/../librte_metrics -Ilib/librte_telemetry -I../lib/librte_telemetry -Ilib/librte_mbuf -I../lib/librte_mbuf -Ilib/librte_mempool -I../lib/librte_mempool -Ilib/librte_ring -I../lib/librte_ring -Idrivers/bus/vdev -I../drivers/bus/vdev -Xclang -fcolor-diagnostics -pipe -D_FILE_OFFSET_BITS=64 -Wall -Winvalid-pch -Werror -O2 -g -include rte_config.h -Wextra -Wcast-qual -Wdeprecated -Wformat-nonliteral -Wformat-security -Wmissing-declarations -Wmissing-prototypes -Wnested-externs -Wold-style-definition -Wpointer-arith -Wsign-compare -Wstrict-prototypes -Wundef -Wwrite-strings -Wno-address-of-packed-member -Wno-missing-field-initializers -D_GNU_SOURCE -fPIC -march=native -DALLOW_EXPERIMENTAL_API -DALLOW_INTERNAL_API -MD -MQ 'drivers/a715181@@tmp_rte_pmd_bcmfs at sta/crypto_bcmfs_bcmfs_sym_capabilities.c.o' -MF 'drivers/a715181@@tmp_rte_pmd_bcmfs at sta/crypto_bcmfs_bcmfs_sym_capabilities.c.o.d' -o 'drivers/a715181@@tmp_rte_pmd_bcmfs at sta/crypto_bcmfs_bcmfs_sym_capabilities.c.o' -c ../drivers/crypto/bcmfs/bcmfs_sym_capabilities.c
../drivers/crypto/bcmfs/bcmfs_sym_capabilities.c:478:13: error: implicit conversion from enumeration type 'enum rte_crypto_auth_algorithm' to different enumeration type 'enum rte_crypto_aead_algorithm' [-Werror,-Wenum-conversion]
                                .algo = RTE_CRYPTO_AUTH_AES_GMAC,
                                        ^~~~~~~~~~~~~~~~~~~~~~~~
1 error generated.
[1924/2407] Compiling C object 'drivers/a715181@@tmp_rte_pmd_bcmfs at sta/crypto_bcmfs_bcmfs_sym.c.o'.
[1925/2407] Compiling C object 'drivers/a715181@@tmp_rte_pmd_snow3g at sta/crypto_snow3g_rte_snow3g_pmd.c.o'.
[1926/2407] Compiling C object 'drivers/a715181@@tmp_rte_pmd_bcmfs at sta/crypto_bcmfs_bcmfs_sym_pmd.c.o'.
[1927/2407] Compiling C object 'drivers/a715181@@tmp_rte_pmd_crypto_scheduler at sta/crypto_scheduler_scheduler_multicore.c.o'.
[1928/2407] Compiling C object 'drivers/a715181@@tmp_rte_pmd_zuc at sta/crypto_zuc_rte_zuc_pmd.c.o'.
[1929/2407] Compiling C object 'drivers/a715181@@tmp_rte_pmd_octeontx2_crypto at sta/crypto_octeontx2_otx2_cryptodev_ops.c.o'.
[1930/2407] Compiling C object 'drivers/a715181@@tmp_rte_pmd_octeontx_crypto at sta/crypto_octeontx_otx_cryptodev_ops.c.o'.
ninja: build stopped: subcommand failed



*Makefile Build Failed #1:
OS: CENTOS77-64
Target: x86_64-native-linuxapp-gcc
  LD dpdk-pdump
  CC init.o
/usr/bin/ld: cannot find -lrte_pmd_bcmfs
collect2: error: ld returned 1 exit status
make[5]: *** [testacl] Error 1
make[4]: *** [test-acl] Error 2
make[4]: *** Waiting for unfinished jobs....
/usr/bin/ld: cannot find -lrte_pmd_bcmfs
collect2: error: ld returned 1 exit status
make[5]: *** [testsad] Error 1
make[4]: *** [test-sad] Error 2
/usr/bin/ld: cannot find -lrte_pmd_bcmfs
collect2: error: ld returned 1 exit status
make[5]: *** [cmdline_test] Error 1
make[4]: *** [test-cmdline] Error 2
  CC parameters.o
  CC test.o
  CC runtime.o
/usr/bin/ld: cannot find -lrte_pmd_bcmfs
collect2: error: ld returned 1 exit status
make[5]: *** [dpdk-pdump] Error 1
  CC items_gen.o
make[4]: *** [pdump] Error 2
  CC pipeline_stub.o
  LD dpdk-procinfo
  CC pipeline_hash.o
--
  CC pipeline_lpm.o
  CC test_resource.o
/usr/bin/ld: cannot find -lrte_pmd_bcmfs
collect2: error: ld returned 1 exit status
make[5]: *** [dpdk-procinfo] Error 1
make[4]: *** [proc-info] Error 2
  CC test_prefetch.o
  CC main.o
  CC test_byteorder.o
--
  CC test_barrier.o
  CC test_malloc.o
/usr/bin/ld: cannot find -lrte_pmd_bcmfs
collect2: error: ld returned 1 exit status
make[5]: *** [testfib] Error 1
make[4]: *** [test-fib] Error 2
  CC test_cycles.o
  LD testpipeline
  CC cmdline_flow.o
--
  CC test_spinlock.o
  CC test_ticketlock.o
/usr/bin/ld: cannot find -lrte_pmd_bcmfs
collect2: error: ld returned 1 exit status
make[5]: *** [testpipeline] Error 1
make[4]: *** [test-pipeline] Error 2
  CC test_memory.o
  CC test_memzone.o
  CC test_bitmap.o
--
  CC test_ring_hts_stress.o
  CC test_ring_perf.o
/usr/bin/ld: cannot find -lrte_pmd_bcmfs
collect2: error: ld returned 1 exit status
make[5]: *** [dpdk-test-flow-perf] Error 1
make[4]: *** [test-flow-perf] Error 2
  CC test_ring_mt_peek_stress.o
  CC iofwd.o
  CC test_ring_rts_stress.o
--
  LD testpmd
  CC test_member.o
/usr/bin/ld: cannot find -lrte_pmd_bcmfs
collect2: error: ld returned 1 exit status
make[5]: *** [testpmd] Error 1
make[4]: *** [test-pmd] Error 2
  CC test_member_perf.o
  CC test_efd.o
  CC test_efd_perf.o
--
  MKRES test_resource_c.res.o
  LD test
/usr/bin/ld: cannot find -lrte_pmd_bcmfs
collect2: error: ld returned 1 exit status
make[5]: *** [test] Error 1
make[4]: *** [test] Error 2
make[3]: *** [app] Error 2
make[2]: *** [all] Error 2
make[1]: *** [pre_install] Error 2
make: *** [install] Error 2


*Makefile Build Failed #2:
OS: CENTOS82-64
Target: x86_64-native-linuxapp-gcc
  LD dpdk-procinfo
  CC config.o
/usr/bin/ld: cannot find -lrte_pmd_bcmfs
collect2: error: ld returned 1 exit status
make[5]: *** [/root/CENTOS82-64_K4.18.0_GCC8.3.1/x86_64-native-linuxapp-gcc/353b3d4a62504426b49cf7e25db93dc5/dpdk/mk/rte.app.mk:457: testacl] Error 1
make[4]: *** [/root/CENTOS82-64_K4.18.0_GCC8.3.1/x86_64-native-linuxapp-gcc/353b3d4a62504426b49cf7e25db93dc5/dpdk/mk/rte.subdir.mk:37: test-acl] Error 2
make[4]: *** Waiting for unfinished jobs....
/usr/bin/ld: cannot find -lrte_pmd_bcmfs
collect2: error: ld returned 1 exit status
  CC flow_gen.o
make[5]: *** [/root/CENTOS82-64_K4.18.0_GCC8.3.1/x86_64-native-linuxapp-gcc/353b3d4a62504426b49cf7e25db93dc5/dpdk/mk/rte.app.mk:457: testsad] Error 1
make[4]: *** [/root/CENTOS82-64_K4.18.0_GCC8.3.1/x86_64-native-linuxapp-gcc/353b3d4a62504426b49cf7e25db93dc5/dpdk/mk/rte.subdir.mk:37: test-sad] Error 2
/usr/bin/ld: cannot find -lrte_pmd_bcmfs
collect2: error: ld returned 1 exit status
make[5]: *** [/root/CENTOS82-64_K4.18.0_GCC8.3.1/x86_64-native-linuxapp-gcc/353b3d4a62504426b49cf7e25db93dc5/dpdk/mk/rte.app.mk:457: cmdline_test] Error 1
make[4]: *** [/root/CENTOS82-64_K4.18.0_GCC8.3.1/x86_64-native-linuxapp-gcc/353b3d4a62504426b49cf7e25db93dc5/dpdk/mk/rte.subdir.mk:37: test-cmdline] Error 2
  CC items_gen.o
  CC test.o
  CC main.o
/usr/bin/ld: cannot find -lrte_pmd_bcmfs
collect2: error: ld returned 1 exit status
make[5]: *** [/root/CENTOS82-64_K4.18.0_GCC8.3.1/x86_64-native-linuxapp-gcc/353b3d4a62504426b49cf7e25db93dc5/dpdk/mk/rte.app.mk:457: dpdk-procinfo] Error 1
make[4]: *** [/root/CENTOS82-64_K4.18.0_GCC8.3.1/x86_64-native-linuxapp-gcc/353b3d4a62504426b49cf7e25db93dc5/dpdk/mk/rte.subdir.mk:37: proc-info] Error 2
  CC resource.o
/usr/bin/ld: cannot find -lrte_pmd_bcmfs
collect2: error: ld returned 1 exit status
make[5]: *** [/root/CENTOS82-64_K4.18.0_GCC8.3.1/x86_64-native-linuxapp-gcc/353b3d4a62504426b49cf7e25db93dc5/dpdk/mk/rte.app.mk:457: dpdk-pdump] Error 1
make[4]: *** [/root/CENTOS82-64_K4.18.0_GCC8.3.1/x86_64-native-linuxapp-gcc/353b3d4a62504426b49cf7e25db93dc5/dpdk/mk/rte.subdir.mk:37: pdump] Error 2
  CC test_resource.o
  CC init.o
  CC test_prefetch.o
--
  CC pipeline_stub.o
  CC test_cycles.o
/usr/bin/ld: cannot find -lrte_pmd_bcmfs
collect2: error: ld returned 1 exit status
make[5]: *** [/root/CENTOS82-64_K4.18.0_GCC8.3.1/x86_64-native-linuxapp-gcc/353b3d4a62504426b49cf7e25db93dc5/dpdk/mk/rte.app.mk:457: testfib] Error 1
make[4]: *** [/root/CENTOS82-64_K4.18.0_GCC8.3.1/x86_64-native-linuxapp-gcc/353b3d4a62504426b49cf7e25db93dc5/dpdk/mk/rte.subdir.mk:37: test-fib] Error 2
  CC test_mcslock.o
  CC test_spinlock.o
  CC pipeline_hash.o
--
  CC test_reciprocal_division.o
  CC test_reciprocal_division_perf.o
/usr/bin/ld: cannot find -lrte_pmd_bcmfs
collect2: error: ld returned 1 exit status
make[5]: *** [/root/CENTOS82-64_K4.18.0_GCC8.3.1/x86_64-native-linuxapp-gcc/353b3d4a62504426b49cf7e25db93dc5/dpdk/mk/rte.app.mk:457: dpdk-test-flow-perf] Error 1
make[4]: *** [/root/CENTOS82-64_K4.18.0_GCC8.3.1/x86_64-native-linuxapp-gcc/353b3d4a62504426b49cf7e25db93dc5/dpdk/mk/rte.subdir.mk:37: test-flow-perf] Error 2
  CC parameters.o
  CC test_fbarray.o
  CC test_external_mem.o
--
  CC test_ring_st_peek_stress.o
  CC test_ring_stress.o
/usr/bin/ld: cannot find -lrte_pmd_bcmfs
collect2: error: ld returned 1 exit status
make[5]: *** [/root/CENTOS82-64_K4.18.0_GCC8.3.1/x86_64-native-linuxapp-gcc/353b3d4a62504426b49cf7e25db93dc5/dpdk/mk/rte.app.mk:457: testpipeline] Error 1
make[4]: *** [/root/CENTOS82-64_K4.18.0_GCC8.3.1/x86_64-native-linuxapp-gcc/353b3d4a62504426b49cf7e25db93dc5/dpdk/mk/rte.subdir.mk:37: test-pipeline] Error 2
  CC cmdline_mtr.o
  CC test_pmd_perf.o
  CC cmdline_tm.o
--
  CC test_hash_perf.o
  CC test_hash_functions.o
/usr/bin/ld: cannot find -lrte_pmd_bcmfs
collect2: error: ld returned 1 exit status
make[5]: *** [/root/CENTOS82-64_K4.18.0_GCC8.3.1/x86_64-native-linuxapp-gcc/353b3d4a62504426b49cf7e25db93dc5/dpdk/mk/rte.app.mk:457: testpmd] Error 1
make[4]: *** [/root/CENTOS82-64_K4.18.0_GCC8.3.1/x86_64-native-linuxapp-gcc/353b3d4a62504426b49cf7e25db93dc5/dpdk/mk/rte.subdir.mk:37: test-pmd] Error 2
  CC test_hash_multiwriter.o
  CC test_hash_readwrite.o
  CC test_hash_readwrite_lf_perf.o
--
  MKRES test_resource_c.res.o
  LD test
/usr/bin/ld: cannot find -lrte_pmd_bcmfs
collect2: error: ld returned 1 exit status
make[5]: *** [/root/CENTOS82-64_K4.18.0_GCC8.3.1/x86_64-native-linuxapp-gcc/353b3d4a62504426b49cf7e25db93dc5/dpdk/mk/rte.app.mk:457: test] Error 1
make[4]: *** [/root/CENTOS82-64_K4.18.0_GCC8.3.1/x86_64-native-linuxapp-gcc/353b3d4a62504426b49cf7e25db93dc5/dpdk/mk/rte.subdir.mk:37: test] Error 2
make[3]: *** [/root/CENTOS82-64_K4.18.0_GCC8.3.1/x86_64-native-linuxapp-gcc/353b3d4a62504426b49cf7e25db93dc5/dpdk/mk/rte.sdkbuild.mk:53: app] Error 2
make[2]: *** [/root/CENTOS82-64_K4.18.0_GCC8.3.1/x86_64-native-linuxapp-gcc/353b3d4a62504426b49cf7e25db93dc5/dpdk/mk/rte.sdkroot.mk:115: all] Error 2
make[1]: *** [/root/CENTOS82-64_K4.18.0_GCC8.3.1/x86_64-native-linuxapp-gcc/353b3d4a62504426b49cf7e25db93dc5/dpdk/mk/rte.sdkinstall.mk:61: pre_install] Error 2
make: *** [/root/CENTOS82-64_K4.18.0_GCC8.3.1/x86_64-native-linuxapp-gcc/353b3d4a62504426b49cf7e25db93dc5/dpdk/mk/rte.sdkroot.mk:92: install] Error 2


*Makefile Build Failed #3:
OS: CENTOS82-64
Target: x86_64-native-linuxapp-clang
  CC commands.o
  LD cmdline_test
/usr/bin/ld: cannot find -lrte_pmd_bcmfs
clang-9: error: linker command failed with exit code 1 (use -v to see invocation)
make[5]: *** [/root/CENTOS82-64_K4.18.0_Clang7.0.1/x86_64-native-linuxapp-clang/353b3d4a62504426b49cf7e25db93dc5/dpdk/mk/rte.app.mk:457: cmdline_test] Error 1
make[4]: *** [/root/CENTOS82-64_K4.18.0_Clang7.0.1/x86_64-native-linuxapp-clang/353b3d4a62504426b49cf7e25db93dc5/dpdk/mk/rte.subdir.mk:35: test-cmdline] Error 2
make[4]: *** Waiting for unfinished jobs....
  CC test.o
  LD dpdk-procinfo
--
  LD testacl
/usr/bin/ld: cannot find -lrte_pmd_bcmfs
  CC flow_gen.o
clang-9: error: linker command failed with exit code 1 (use -v to see invocation)
make[5]: *** [/root/CENTOS82-64_K4.18.0_Clang7.0.1/x86_64-native-linuxapp-clang/353b3d4a62504426b49cf7e25db93dc5/dpdk/mk/rte.app.mk:457: testsad] Error 1
/usr/bin/ld: cannot find -lrte_pmd_bcmfs
make[4]: *** [/root/CENTOS82-64_K4.18.0_Clang7.0.1/x86_64-native-linuxapp-clang/353b3d4a62504426b49cf7e25db93dc5/dpdk/mk/rte.subdir.mk:35: test-sad] Error 2
/usr/bin/ld: cannot find -lrte_pmd_bcmfs
  CC resource.o
  CC config.o
/usr/bin/ld: cannot find -lrte_pmd_bcmfs
clang-9: error: linker command failed with exit code 1 (use -v to see invocation)
  CC items_gen.o
make[5]: *** [/root/CENTOS82-64_K4.18.0_Clang7.0.1/x86_64-native-linuxapp-clang/353b3d4a62504426b49cf7e25db93dc5/dpdk/mk/rte.app.mk:457: dpdk-procinfo] Error 1
make[4]: *** [/root/CENTOS82-64_K4.18.0_Clang7.0.1/x86_64-native-linuxapp-clang/353b3d4a62504426b49cf7e25db93dc5/dpdk/mk/rte.subdir.mk:35: proc-info] Error 2
clang-9: error: linker command failed with exit code 1 (use -v to see invocation)
  CC main.o
make[5]: *** [/root/CENTOS82-64_K4.18.0_Clang7.0.1/x86_64-native-linuxapp-clang/353b3d4a62504426b49cf7e25db93dc5/dpdk/mk/rte.app.mk:457: testacl] Error 1
make[4]: *** [/root/CENTOS82-64_K4.18.0_Clang7.0.1/x86_64-native-linuxapp-clang/353b3d4a62504426b49cf7e25db93dc5/dpdk/mk/rte.subdir.mk:35: test-acl] Error 2
  CC init.o
clang-9: error: linker command failed with exit code 1 (use -v to see invocation)
make[5]: *** [/root/CENTOS82-64_K4.18.0_Clang7.0.1/x86_64-native-linuxapp-clang/353b3d4a62504426b49cf7e25db93dc5/dpdk/mk/rte.app.mk:457: dpdk-pdump] Error 1
make[4]: *** [/root/CENTOS82-64_K4.18.0_Clang7.0.1/x86_64-native-linuxapp-clang/353b3d4a62504426b49cf7e25db93dc5/dpdk/mk/rte.subdir.mk:35: pdump] Error 2
  CC runtime.o
  CC test_resource.o
  CC test_prefetch.o
  CC test_byteorder.o
  LD testfib
/usr/bin/ld: cannot find -lrte_pmd_bcmfs
clang-9: error: linker command failed with exit code 1 (use -v to see invocation)
make[5]: *** [/root/CENTOS82-64_K4.18.0_Clang7.0.1/x86_64-native-linuxapp-clang/353b3d4a62504426b49cf7e25db93dc5/dpdk/mk/rte.app.mk:457: testfib] Error 1
make[4]: *** [/root/CENTOS82-64_K4.18.0_Clang7.0.1/x86_64-native-linuxapp-clang/353b3d4a62504426b49cf7e25db93dc5/dpdk/mk/rte.subdir.mk:35: test-fib] Error 2
  CC test_per_lcore.o
  CC test_atomic.o
  CC test_barrier.o
--
  LD dpdk-test-flow-perf
  CC test_ticketlock.o
/usr/bin/ld: cannot find -lrte_pmd_bcmfs
clang-9: error: linker command failed with exit code 1 (use -v to see invocation)
make[5]: *** [/root/CENTOS82-64_K4.18.0_Clang7.0.1/x86_64-native-linuxapp-clang/353b3d4a62504426b49cf7e25db93dc5/dpdk/mk/rte.app.mk:457: dpdk-test-flow-perf] Error 1
make[4]: *** [/root/CENTOS82-64_K4.18.0_Clang7.0.1/x86_64-native-linuxapp-clang/353b3d4a62504426b49cf7e25db93dc5/dpdk/mk/rte.subdir.mk:35: test-flow-perf] Error 2
  CC test_memory.o
  CC pipeline_acl.o
  CC test_memzone.o
--
  LD testpipeline
  CC test_ring_rts_stress.o
/usr/bin/ld: cannot find -lrte_pmd_bcmfs
clang-9: error: linker command failed with exit code 1 (use -v to see invocation)
make[5]: *** [/root/CENTOS82-64_K4.18.0_Clang7.0.1/x86_64-native-linuxapp-clang/353b3d4a62504426b49cf7e25db93dc5/dpdk/mk/rte.app.mk:457: testpipeline] Error 1
make[4]: *** [/root/CENTOS82-64_K4.18.0_Clang7.0.1/x86_64-native-linuxapp-clang/353b3d4a62504426b49cf7e25db93dc5/dpdk/mk/rte.subdir.mk:35: test-pipeline] Error 2
  CC cmdline_tm.o
  CC test_ring_st_peek_stress.o
  CC test_ring_stress.o
--
  LD testpmd
/usr/bin/ld: cannot find -lrte_pmd_bcmfs
  CC test_member_perf.o
clang-9: error: linker command failed with exit code 1 (use -v to see invocation)
make[5]: *** [/root/CENTOS82-64_K4.18.0_Clang7.0.1/x86_64-native-linuxapp-clang/353b3d4a62504426b49cf7e25db93dc5/dpdk/mk/rte.app.mk:457: testpmd] Error 1
make[4]: *** [/root/CENTOS82-64_K4.18.0_Clang7.0.1/x86_64-native-linuxapp-clang/353b3d4a62504426b49cf7e25db93dc5/dpdk/mk/rte.subdir.mk:35: test-pmd] Error 2
  CC test_efd.o
  CC test_efd_perf.o
  CC test_hash.o
--
  MKRES test_resource_c.res.o
  LD test
/usr/bin/ld: cannot find -lrte_pmd_bcmfs
clang-9: error: linker command failed with exit code 1 (use -v to see invocation)
make[5]: *** [/root/CENTOS82-64_K4.18.0_Clang7.0.1/x86_64-native-linuxapp-clang/353b3d4a62504426b49cf7e25db93dc5/dpdk/mk/rte.app.mk:457: test] Error 1
make[4]: *** [/root/CENTOS82-64_K4.18.0_Clang7.0.1/x86_64-native-linuxapp-clang/353b3d4a62504426b49cf7e25db93dc5/dpdk/mk/rte.subdir.mk:35: test] Error 2
make[3]: *** [/root/CENTOS82-64_K4.18.0_Clang7.0.1/x86_64-native-linuxapp-clang/353b3d4a62504426b49cf7e25db93dc5/dpdk/mk/rte.sdkbuild.mk:53: app] Error 2
make[2]: *** [/root/CENTOS82-64_K4.18.0_Clang7.0.1/x86_64-native-linuxapp-clang/353b3d4a62504426b49cf7e25db93dc5/dpdk/mk/rte.sdkroot.mk:115: all] Error 2
make[1]: *** [/root/CENTOS82-64_K4.18.0_Clang7.0.1/x86_64-native-linuxapp-clang/353b3d4a62504426b49cf7e25db93dc5/dpdk/mk/rte.sdkinstall.mk:61: pre_install] Error 2
make: *** [/root/CENTOS82-64_K4.18.0_Clang7.0.1/x86_64-native-linuxapp-clang/353b3d4a62504426b49cf7e25db93dc5/dpdk/mk/rte.sdkroot.mk:92: install] Error 2


*Makefile Build Failed #4:
OS: CENTOS82-64
Target: x86_64-native-linuxapp-icc
  CC main.o
ld: cannot find -lrte_pmd_bcmfs
  LD testfib
make[5]: *** [/root/CENTOS82-64_K4.18.0_ICC19.1.1/x86_64-native-linuxapp-icc/353b3d4a62504426b49cf7e25db93dc5/dpdk/mk/rte.app.mk:457: dpdk-procinfo] Error 1
make[4]: *** [/root/CENTOS82-64_K4.18.0_ICC19.1.1/x86_64-native-linuxapp-icc/353b3d4a62504426b49cf7e25db93dc5/dpdk/mk/rte.subdir.mk:37: proc-info] Error 2
make[4]: *** Waiting for unfinished jobs....
  CC test_resource.o
ld: cannot find -lrte_pmd_bcmfs
ld: cannot find -lrte_pmd_bcmfs
make[5]: *** [/root/CENTOS82-64_K4.18.0_ICC19.1.1/x86_64-native-linuxapp-icc/353b3d4a62504426b49cf7e25db93dc5/dpdk/mk/rte.app.mk:457: testsad] Error 1
make[4]: *** [/root/CENTOS82-64_K4.18.0_ICC19.1.1/x86_64-native-linuxapp-icc/353b3d4a62504426b49cf7e25db93dc5/dpdk/mk/rte.subdir.mk:37: test-sad] Error 2
make[5]: *** [/root/CENTOS82-64_K4.18.0_ICC19.1.1/x86_64-native-linuxapp-icc/353b3d4a62504426b49cf7e25db93dc5/dpdk/mk/rte.app.mk:457: cmdline_test] Error 1
make[4]: *** [/root/CENTOS82-64_K4.18.0_ICC19.1.1/x86_64-native-linuxapp-icc/353b3d4a62504426b49cf7e25db93dc5/dpdk/mk/rte.subdir.mk:37: test-cmdline] Error 2
  CC test_prefetch.o
  CC pipeline_stub.o
ld: cannot find -lrte_pmd_bcmfs
  CC test_byteorder.o
make[5]: *** [/root/CENTOS82-64_K4.18.0_ICC19.1.1/x86_64-native-linuxapp-icc/353b3d4a62504426b49cf7e25db93dc5/dpdk/mk/rte.app.mk:457: testacl] Error 1
make[4]: *** [/root/CENTOS82-64_K4.18.0_ICC19.1.1/x86_64-native-linuxapp-icc/353b3d4a62504426b49cf7e25db93dc5/dpdk/mk/rte.subdir.mk:37: test-acl] Error 2
  CC test_per_lcore.o
  CC test_atomic.o
  CC test_barrier.o
--
  CC test_cycles.o
  CC pipeline_hash.o
ld: cannot find -lrte_pmd_bcmfs
make[5]: *** [/root/CENTOS82-64_K4.18.0_ICC19.1.1/x86_64-native-linuxapp-icc/353b3d4a62504426b49cf7e25db93dc5/dpdk/mk/rte.app.mk:457: testfib] Error 1
make[4]: *** [/root/CENTOS82-64_K4.18.0_ICC19.1.1/x86_64-native-linuxapp-icc/353b3d4a62504426b49cf7e25db93dc5/dpdk/mk/rte.subdir.mk:37: test-fib] Error 2
  CC pipeline_lpm.o
  CC pipeline_lpm_ipv6.o
  CC test_mcslock.o
--
  CC test_reciprocal_division.o
  CC test_reciprocal_division_perf.o
ld: cannot find -lrte_pmd_bcmfs
make[5]: *** [/root/CENTOS82-64_K4.18.0_ICC19.1.1/x86_64-native-linuxapp-icc/353b3d4a62504426b49cf7e25db93dc5/dpdk/mk/rte.app.mk:457: dpdk-test-flow-perf] Error 1
make[4]: *** [/root/CENTOS82-64_K4.18.0_ICC19.1.1/x86_64-native-linuxapp-icc/353b3d4a62504426b49cf7e25db93dc5/dpdk/mk/rte.subdir.mk:37: test-flow-perf] Error 2
  CC parameters.o
  CC test_fbarray.o
  CC test_external_mem.o
--
  CC test_ring_perf.o
  CC test_ring_mt_peek_stress.o
ld: cannot find -lrte_pmd_bcmfs
make[5]: *** [/root/CENTOS82-64_K4.18.0_ICC19.1.1/x86_64-native-linuxapp-icc/353b3d4a62504426b49cf7e25db93dc5/dpdk/mk/rte.app.mk:457: testpipeline] Error 1
make[4]: *** [/root/CENTOS82-64_K4.18.0_ICC19.1.1/x86_64-native-linuxapp-icc/353b3d4a62504426b49cf7e25db93dc5/dpdk/mk/rte.subdir.mk:37: test-pipeline] Error 2
  CC test_ring_rts_stress.o
  CC test_ring_st_peek_stress.o
ld: cannot find -lrte_pmd_bcmfs
  CC test_ring_stress.o
make[5]: *** [/root/CENTOS82-64_K4.18.0_ICC19.1.1/x86_64-native-linuxapp-icc/353b3d4a62504426b49cf7e25db93dc5/dpdk/mk/rte.app.mk:457: dpdk-pdump] Error 1
make[4]: *** [/root/CENTOS82-64_K4.18.0_ICC19.1.1/x86_64-native-linuxapp-icc/353b3d4a62504426b49cf7e25db93dc5/dpdk/mk/rte.subdir.mk:37: pdump] Error 2
  CC test_pmd_perf.o
  CC test_table.o
  CC cmdline_flow.o
--
  CC test_hash_multiwriter.o
  CC test_hash_readwrite.o
ld: cannot find -lrte_pmd_bcmfs
make[5]: *** [/root/CENTOS82-64_K4.18.0_ICC19.1.1/x86_64-native-linuxapp-icc/353b3d4a62504426b49cf7e25db93dc5/dpdk/mk/rte.app.mk:457: testpmd] Error 1
make[4]: *** [/root/CENTOS82-64_K4.18.0_ICC19.1.1/x86_64-native-linuxapp-icc/353b3d4a62504426b49cf7e25db93dc5/dpdk/mk/rte.subdir.mk:37: test-pmd] Error 2
  CC test_hash_readwrite_lf_perf.o
  CC test_rib.o
  CC test_rib6.o
--
  MKRES test_resource_c.res.o
  LD test
ld: cannot find -lrte_pmd_bcmfs
make[5]: *** [/root/CENTOS82-64_K4.18.0_ICC19.1.1/x86_64-native-linuxapp-icc/353b3d4a62504426b49cf7e25db93dc5/dpdk/mk/rte.app.mk:457: test] Error 1
make[4]: *** [/root/CENTOS82-64_K4.18.0_ICC19.1.1/x86_64-native-linuxapp-icc/353b3d4a62504426b49cf7e25db93dc5/dpdk/mk/rte.subdir.mk:37: test] Error 2
make[3]: *** [/root/CENTOS82-64_K4.18.0_ICC19.1.1/x86_64-native-linuxapp-icc/353b3d4a62504426b49cf7e25db93dc5/dpdk/mk/rte.sdkbuild.mk:53: app] Error 2
make[2]: *** [/root/CENTOS82-64_K4.18.0_ICC19.1.1/x86_64-native-linuxapp-icc/353b3d4a62504426b49cf7e25db93dc5/dpdk/mk/rte.sdkroot.mk:115: all] Error 2
make[1]: *** [/root/CENTOS82-64_K4.18.0_ICC19.1.1/x86_64-native-linuxapp-icc/353b3d4a62504426b49cf7e25db93dc5/dpdk/mk/rte.sdkinstall.mk:61: pre_install] Error 2
make: *** [/root/CENTOS82-64_K4.18.0_ICC19.1.1/x86_64-native-linuxapp-icc/353b3d4a62504426b49cf7e25db93dc5/dpdk/mk/rte.sdkroot.mk:92: install] Error 2


*Makefile Build Failed #5:
OS: CENTOS82-64
Target: x86_64-native-linuxapp-gcc+debug
  CC config.o
  LD dpdk-procinfo
/usr/bin/ld: cannot find -lrte_pmd_bcmfs
collect2: error: ld returned 1 exit status
make[5]: *** [/root/CENTOS82-64_K4.18.0_GCC8.3.1/x86_64-native-linuxapp-gcc+debug/353b3d4a62504426b49cf7e25db93dc5/dpdk/mk/rte.app.mk:457: testacl] Error 1
make[4]: *** [/root/CENTOS82-64_K4.18.0_GCC8.3.1/x86_64-native-linuxapp-gcc+debug/353b3d4a62504426b49cf7e25db93dc5/dpdk/mk/rte.subdir.mk:37: test-acl] Error 2
make[4]: *** Waiting for unfinished jobs....
  LD cmdline_test
  CC flow_gen.o
  CC test.o
  LD testsad
/usr/bin/ld: cannot find -lrte_pmd_bcmfs
collect2: error: ld returned 1 exit status
  CC init.o
make[5]: *** [/root/CENTOS82-64_K4.18.0_GCC8.3.1/x86_64-native-linuxapp-gcc+debug/353b3d4a62504426b49cf7e25db93dc5/dpdk/mk/rte.app.mk:457: dpdk-procinfo] Error 1
make[4]: *** [/root/CENTOS82-64_K4.18.0_GCC8.3.1/x86_64-native-linuxapp-gcc+debug/353b3d4a62504426b49cf7e25db93dc5/dpdk/mk/rte.subdir.mk:37: proc-info] Error 2
  CC resource.o
  LD dpdk-pdump
/usr/bin/ld: cannot find -lrte_pmd_bcmfs
collect2: error: ld returned 1 exit status
make[5]: *** [/root/CENTOS82-64_K4.18.0_GCC8.3.1/x86_64-native-linuxapp-gcc+debug/353b3d4a62504426b49cf7e25db93dc5/dpdk/mk/rte.app.mk:457: cmdline_test] Error 1
make[4]: *** [/root/CENTOS82-64_K4.18.0_GCC8.3.1/x86_64-native-linuxapp-gcc+debug/353b3d4a62504426b49cf7e25db93dc5/dpdk/mk/rte.subdir.mk:37: test-cmdline] Error 2
  CC runtime.o
  CC test_resource.o
/usr/bin/ld: cannot find -lrte_pmd_bcmfs
collect2: error: ld returned 1 exit status
make[5]: *** [/root/CENTOS82-64_K4.18.0_GCC8.3.1/x86_64-native-linuxapp-gcc+debug/353b3d4a62504426b49cf7e25db93dc5/dpdk/mk/rte.app.mk:457: dpdk-pdump] Error 1
/usr/bin/ld: cannot find -lrte_pmd_bcmfs
collect2: error: ld returned 1 exit status
make[5]: *** [/root/CENTOS82-64_K4.18.0_GCC8.3.1/x86_64-native-linuxapp-gcc+debug/353b3d4a62504426b49cf7e25db93dc5/dpdk/mk/rte.app.mk:457: testsad] Error 1
make[4]: *** [/root/CENTOS82-64_K4.18.0_GCC8.3.1/x86_64-native-linuxapp-gcc+debug/353b3d4a62504426b49cf7e25db93dc5/dpdk/mk/rte.subdir.mk:37: pdump] Error 2
make[4]: *** [/root/CENTOS82-64_K4.18.0_GCC8.3.1/x86_64-native-linuxapp-gcc+debug/353b3d4a62504426b49cf7e25db93dc5/dpdk/mk/rte.subdir.mk:37: test-sad] Error 2
  CC pipeline_stub.o
  CC items_gen.o
  LD testfib
--
  CC test_byteorder.o
  CC pipeline_hash.o
/usr/bin/ld: cannot find -lrte_pmd_bcmfs
collect2: error: ld returned 1 exit status
make[5]: *** [/root/CENTOS82-64_K4.18.0_GCC8.3.1/x86_64-native-linuxapp-gcc+debug/353b3d4a62504426b49cf7e25db93dc5/dpdk/mk/rte.app.mk:457: testfib] Error 1
make[4]: *** [/root/CENTOS82-64_K4.18.0_GCC8.3.1/x86_64-native-linuxapp-gcc+debug/353b3d4a62504426b49cf7e25db93dc5/dpdk/mk/rte.subdir.mk:37: test-fib] Error 2
  CC pipeline_lpm.o
  CC test_per_lcore.o
  CC test_atomic.o
--
  CC test_ticketlock.o
  CC cmdline_tm.o
/usr/bin/ld: cannot find -lrte_pmd_bcmfs
collect2: error: ld returned 1 exit status
make[5]: *** [/root/CENTOS82-64_K4.18.0_GCC8.3.1/x86_64-native-linuxapp-gcc+debug/353b3d4a62504426b49cf7e25db93dc5/dpdk/mk/rte.app.mk:457: dpdk-test-flow-perf] Error 1
make[4]: *** [/root/CENTOS82-64_K4.18.0_GCC8.3.1/x86_64-native-linuxapp-gcc+debug/353b3d4a62504426b49cf7e25db93dc5/dpdk/mk/rte.subdir.mk:37: test-flow-perf] Error 2
  CC test_memory.o
  CC config.o
  CC test_memzone.o
--
  CC macfwd.o
  CC test_bitops.o
/usr/bin/ld: cannot find -lrte_pmd_bcmfs
collect2: error: ld returned 1 exit status
make[5]: *** [/root/CENTOS82-64_K4.18.0_GCC8.3.1/x86_64-native-linuxapp-gcc+debug/353b3d4a62504426b49cf7e25db93dc5/dpdk/mk/rte.app.mk:457: testpipeline] Error 1
make[4]: *** [/root/CENTOS82-64_K4.18.0_GCC8.3.1/x86_64-native-linuxapp-gcc+debug/353b3d4a62504426b49cf7e25db93dc5/dpdk/mk/rte.subdir.mk:37: test-pipeline] Error 2
  CC test_reciprocal_division.o
  CC test_reciprocal_division_perf.o
  CC test_fbarray.o
--
  CC test_mempool.o
  CC test_mempool_perf.o
/usr/bin/ld: cannot find -lrte_pmd_bcmfs
collect2: error: ld returned 1 exit status
make[5]: *** [/root/CENTOS82-64_K4.18.0_GCC8.3.1/x86_64-native-linuxapp-gcc+debug/353b3d4a62504426b49cf7e25db93dc5/dpdk/mk/rte.app.mk:457: testpmd] Error 1
make[4]: *** [/root/CENTOS82-64_K4.18.0_GCC8.3.1/x86_64-native-linuxapp-gcc+debug/353b3d4a62504426b49cf7e25db93dc5/dpdk/mk/rte.subdir.mk:37: test-pmd] Error 2
  CC test_mbuf.o
  CC test_logs.o
  CC test_memcpy.o
--
  MKRES test_resource_c.res.o
  LD test
/usr/bin/ld: cannot find -lrte_pmd_bcmfs
collect2: error: ld returned 1 exit status
make[5]: *** [/root/CENTOS82-64_K4.18.0_GCC8.3.1/x86_64-native-linuxapp-gcc+debug/353b3d4a62504426b49cf7e25db93dc5/dpdk/mk/rte.app.mk:457: test] Error 1
make[4]: *** [/root/CENTOS82-64_K4.18.0_GCC8.3.1/x86_64-native-linuxapp-gcc+debug/353b3d4a62504426b49cf7e25db93dc5/dpdk/mk/rte.subdir.mk:37: test] Error 2
make[3]: *** [/root/CENTOS82-64_K4.18.0_GCC8.3.1/x86_64-native-linuxapp-gcc+debug/353b3d4a62504426b49cf7e25db93dc5/dpdk/mk/rte.sdkbuild.mk:53: app] Error 2
make[2]: *** [/root/CENTOS82-64_K4.18.0_GCC8.3.1/x86_64-native-linuxapp-gcc+debug/353b3d4a62504426b49cf7e25db93dc5/dpdk/mk/rte.sdkroot.mk:115: all] Error 2
make[1]: *** [/root/CENTOS82-64_K4.18.0_GCC8.3.1/x86_64-native-linuxapp-gcc+debug/353b3d4a62504426b49cf7e25db93dc5/dpdk/mk/rte.sdkinstall.mk:61: pre_install] Error 2
make: *** [/root/CENTOS82-64_K4.18.0_GCC8.3.1/x86_64-native-linuxapp-gcc+debug/353b3d4a62504426b49cf7e25db93dc5/dpdk/mk/rte.sdkroot.mk:92: install] Error 2


*Makefile Build Failed #6:
OS: FC32-64
Target: x86_64-native-linuxapp-gcc
  CC config.o
/usr/bin/ld: cannot find -lrte_pmd_bcmfs
  CC flow_gen.o
collect2: error: ld returned 1 exit status
make[5]: *** [/root/FC32-64_K5.6.0_GCC10.0.1/x86_64-native-linuxapp-gcc/353b3d4a62504426b49cf7e25db93dc5/dpdk/mk/rte.app.mk:457: cmdline_test] Error 1
make[4]: *** [/root/FC32-64_K5.6.0_GCC10.0.1/x86_64-native-linuxapp-gcc/353b3d4a62504426b49cf7e25db93dc5/dpdk/mk/rte.subdir.mk:37: test-cmdline] Error 2
make[4]: *** Waiting for unfinished jobs....
  CC parameters.o
/usr/bin/ld: cannot find -lrte_pmd_bcmfs
  CC test.o
collect2: error: ld returned 1 exit status
make[5]: *** [/root/FC32-64_K5.6.0_GCC10.0.1/x86_64-native-linuxapp-gcc/353b3d4a62504426b49cf7e25db93dc5/dpdk/mk/rte.app.mk:457: testacl] Error 1
make[4]: *** [/root/FC32-64_K5.6.0_GCC10.0.1/x86_64-native-linuxapp-gcc/353b3d4a62504426b49cf7e25db93dc5/dpdk/mk/rte.subdir.mk:37: test-acl] Error 2
  CC resource.o
/usr/bin/ld: cannot find -lrte_pmd_bcmfs
  CC test_resource.o
collect2: error: ld returned 1 exit status
make[5]: *** [/root/FC32-64_K5.6.0_GCC10.0.1/x86_64-native-linuxapp-gcc/353b3d4a62504426b49cf7e25db93dc5/dpdk/mk/rte.app.mk:457: testsad] Error 1
make[4]: *** [/root/FC32-64_K5.6.0_GCC10.0.1/x86_64-native-linuxapp-gcc/353b3d4a62504426b49cf7e25db93dc5/dpdk/mk/rte.subdir.mk:37: test-sad] Error 2
  CC test_prefetch.o
  LD dpdk-procinfo
  CC cmdline.o
--
  CC items_gen.o
  CC test_atomic.o
/usr/bin/ld: cannot find -lrte_pmd_bcmfs
collect2: error: ld returned 1 exit status
make[5]: *** [/root/FC32-64_K5.6.0_GCC10.0.1/x86_64-native-linuxapp-gcc/353b3d4a62504426b49cf7e25db93dc5/dpdk/mk/rte.app.mk:457: dpdk-procinfo] Error 1
make[4]: *** [/root/FC32-64_K5.6.0_GCC10.0.1/x86_64-native-linuxapp-gcc/353b3d4a62504426b49cf7e25db93dc5/dpdk/mk/rte.subdir.mk:37: proc-info] Error 2
  CC init.o
  CC test_barrier.o
/usr/bin/ld: cannot find -lrte_pmd_bcmfs
  CC runtime.o
collect2: error: ld returned 1 exit status
make[5]: *** [/root/FC32-64_K5.6.0_GCC10.0.1/x86_64-native-linuxapp-gcc/353b3d4a62504426b49cf7e25db93dc5/dpdk/mk/rte.app.mk:457: dpdk-pdump] Error 1
make[4]: *** [/root/FC32-64_K5.6.0_GCC10.0.1/x86_64-native-linuxapp-gcc/353b3d4a62504426b49cf7e25db93dc5/dpdk/mk/rte.subdir.mk:37: pdump] Error 2
  CC pipeline_stub.o
  CC pipeline_hash.o
  CC main.o
--
  CC pipeline_lpm.o
  CC pipeline_lpm_ipv6.o
/usr/bin/ld: cannot find -lrte_pmd_bcmfs
collect2: error: ld returned 1 exit status
make[5]: *** [/root/FC32-64_K5.6.0_GCC10.0.1/x86_64-native-linuxapp-gcc/353b3d4a62504426b49cf7e25db93dc5/dpdk/mk/rte.app.mk:457: testfib] Error 1
make[4]: *** [/root/FC32-64_K5.6.0_GCC10.0.1/x86_64-native-linuxapp-gcc/353b3d4a62504426b49cf7e25db93dc5/dpdk/mk/rte.subdir.mk:37: test-fib] Error 2
  CC pipeline_acl.o
  CC cmdline_flow.o
  CC test_malloc.o
--
  LD dpdk-test-flow-perf
  CC test_memory.o
/usr/bin/ld: cannot find -lrte_pmd_bcmfs
collect2: error: ld returned 1 exit status
make[5]: *** [/root/FC32-64_K5.6.0_GCC10.0.1/x86_64-native-linuxapp-gcc/353b3d4a62504426b49cf7e25db93dc5/dpdk/mk/rte.app.mk:457: testpipeline] Error 1
make[4]: *** [/root/FC32-64_K5.6.0_GCC10.0.1/x86_64-native-linuxapp-gcc/353b3d4a62504426b49cf7e25db93dc5/dpdk/mk/rte.subdir.mk:37: test-pipeline] Error 2
  CC test_memzone.o
  CC iofwd.o
  CC test_bitmap.o
--
  CC macswap.o
/usr/bin/ld: cannot find -lrte_pmd_bcmfs
  CC test_fbarray.o
collect2: error: ld returned 1 exit status
make[5]: *** [/root/FC32-64_K5.6.0_GCC10.0.1/x86_64-native-linuxapp-gcc/353b3d4a62504426b49cf7e25db93dc5/dpdk/mk/rte.app.mk:457: dpdk-test-flow-perf] Error 1
make[4]: *** [/root/FC32-64_K5.6.0_GCC10.0.1/x86_64-native-linuxapp-gcc/353b3d4a62504426b49cf7e25db93dc5/dpdk/mk/rte.subdir.mk:37: test-flow-perf] Error 2
  CC flowgen.o
  CC test_external_mem.o
  CC test_rand_perf.o
--
  CC test_mbuf.o
  CC test_logs.o
/usr/bin/ld: cannot find -lrte_pmd_bcmfs
collect2: error: ld returned 1 exit status
make[5]: *** [/root/FC32-64_K5.6.0_GCC10.0.1/x86_64-native-linuxapp-gcc/353b3d4a62504426b49cf7e25db93dc5/dpdk/mk/rte.app.mk:457: testpmd] Error 1
make[4]: *** [/root/FC32-64_K5.6.0_GCC10.0.1/x86_64-native-linuxapp-gcc/353b3d4a62504426b49cf7e25db93dc5/dpdk/mk/rte.subdir.mk:37: test-pmd] Error 2
  CC test_memcpy.o
  CC test_memcpy_perf.o
  CC test_member.o
--
  MKRES test_resource_c.res.o
  LD test
/usr/bin/ld: cannot find -lrte_pmd_bcmfs
collect2: error: ld returned 1 exit status
make[5]: *** [/root/FC32-64_K5.6.0_GCC10.0.1/x86_64-native-linuxapp-gcc/353b3d4a62504426b49cf7e25db93dc5/dpdk/mk/rte.app.mk:457: test] Error 1
make[4]: *** [/root/FC32-64_K5.6.0_GCC10.0.1/x86_64-native-linuxapp-gcc/353b3d4a62504426b49cf7e25db93dc5/dpdk/mk/rte.subdir.mk:37: test] Error 2
make[3]: *** [/root/FC32-64_K5.6.0_GCC10.0.1/x86_64-native-linuxapp-gcc/353b3d4a62504426b49cf7e25db93dc5/dpdk/mk/rte.sdkbuild.mk:53: app] Error 2
make[2]: *** [/root/FC32-64_K5.6.0_GCC10.0.1/x86_64-native-linuxapp-gcc/353b3d4a62504426b49cf7e25db93dc5/dpdk/mk/rte.sdkroot.mk:115: all] Error 2
make[1]: *** [/root/FC32-64_K5.6.0_GCC10.0.1/x86_64-native-linuxapp-gcc/353b3d4a62504426b49cf7e25db93dc5/dpdk/mk/rte.sdkinstall.mk:61: pre_install] Error 2
make: *** [/root/FC32-64_K5.6.0_GCC10.0.1/x86_64-native-linuxapp-gcc/353b3d4a62504426b49cf7e25db93dc5/dpdk/mk/rte.sdkroot.mk:92: install] Error 2


*Makefile Build Failed #7:
OS: FC32-64
Target: x86_64-native-linuxapp-clang
  CC commands.o
  LD cmdline_test
/usr/bin/ld: cannot find -lrte_pmd_bcmfs
clang-10: error: linker command failed with exit code 1 (use -v to see invocation)
make[5]: *** [/root/FC32-64_K5.6.0_Clang10.0.0/x86_64-native-linuxapp-clang/353b3d4a62504426b49cf7e25db93dc5/dpdk/mk/rte.app.mk:457: cmdline_test] Error 1
make[4]: *** [/root/FC32-64_K5.6.0_Clang10.0.0/x86_64-native-linuxapp-clang/353b3d4a62504426b49cf7e25db93dc5/dpdk/mk/rte.subdir.mk:37: test-cmdline] Error 2
make[4]: *** Waiting for unfinished jobs....
  CC config.o
  CC flow_gen.o
--
/usr/bin/ld: cannot find -lrte_pmd_bcmfs
/usr/bin/ld: cannot find -lrte_pmd_bcmfs
  CC init.o
clang-10: error: linker command failed with exit code 1 (use -v to see invocation)
  LD testacl
clang-10: error: linker command failed with exit code 1 (use -v to see invocation)
make[5]: *** [/root/FC32-64_K5.6.0_Clang10.0.0/x86_64-native-linuxapp-clang/353b3d4a62504426b49cf7e25db93dc5/dpdk/mk/rte.app.mk:457: dpdk-pdump] Error 1
make[5]: *** [/root/FC32-64_K5.6.0_Clang10.0.0/x86_64-native-linuxapp-clang/353b3d4a62504426b49cf7e25db93dc5/dpdk/mk/rte.app.mk:457: testsad] Error 1
make[4]: *** [/root/FC32-64_K5.6.0_Clang10.0.0/x86_64-native-linuxapp-clang/353b3d4a62504426b49cf7e25db93dc5/dpdk/mk/rte.subdir.mk:37: pdump] Error 2
make[4]: *** [/root/FC32-64_K5.6.0_Clang10.0.0/x86_64-native-linuxapp-clang/353b3d4a62504426b49cf7e25db93dc5/dpdk/mk/rte.subdir.mk:37: test-sad] Error 2
  CC runtime.o
  CC parameters.o
clang-10: error: linker command failed with exit code 1 (use -v to see invocation)
make[5]: *** [/root/FC32-64_K5.6.0_Clang10.0.0/x86_64-native-linuxapp-clang/353b3d4a62504426b49cf7e25db93dc5/dpdk/mk/rte.app.mk:457: dpdk-procinfo] Error 1
make[4]: *** [/root/FC32-64_K5.6.0_Clang10.0.0/x86_64-native-linuxapp-clang/353b3d4a62504426b49cf7e25db93dc5/dpdk/mk/rte.subdir.mk:37: proc-info] Error 2
  CC cmdline.o
/usr/bin/ld: cannot find -lrte_pmd_bcmfs
  CC test.o
clang-10: error: linker command failed with exit code 1 (use -v to see invocation)
make[5]: *** [/root/FC32-64_K5.6.0_Clang10.0.0/x86_64-native-linuxapp-clang/353b3d4a62504426b49cf7e25db93dc5/dpdk/mk/rte.app.mk:457: testacl] Error 1
make[4]: *** [/root/FC32-64_K5.6.0_Clang10.0.0/x86_64-native-linuxapp-clang/353b3d4a62504426b49cf7e25db93dc5/dpdk/mk/rte.subdir.mk:37: test-acl] Error 2
  CC cmdline_flow.o
  CC resource.o
  CC test_resource.o
  CC items_gen.o
  LD testfib
/usr/bin/ld: cannot find -lrte_pmd_bcmfs
clang-10: error: linker command failed with exit code 1 (use -v to see invocation)
make[5]: *** [/root/FC32-64_K5.6.0_Clang10.0.0/x86_64-native-linuxapp-clang/353b3d4a62504426b49cf7e25db93dc5/dpdk/mk/rte.app.mk:457: testfib] Error 1
make[4]: *** [/root/FC32-64_K5.6.0_Clang10.0.0/x86_64-native-linuxapp-clang/353b3d4a62504426b49cf7e25db93dc5/dpdk/mk/rte.subdir.mk:37: test-fib] Error 2
  CC pipeline_stub.o
  CC pipeline_hash.o
  CC test_prefetch.o
--
  CC test_spinlock.o
  CC iofwd.o
/usr/bin/ld: cannot find -lrte_pmd_bcmfs
clang-10: error: linker command failed with exit code 1 (use -v to see invocation)
make[5]: *** [/root/FC32-64_K5.6.0_Clang10.0.0/x86_64-native-linuxapp-clang/353b3d4a62504426b49cf7e25db93dc5/dpdk/mk/rte.app.mk:457: dpdk-test-flow-perf] Error 1
make[4]: *** [/root/FC32-64_K5.6.0_Clang10.0.0/x86_64-native-linuxapp-clang/353b3d4a62504426b49cf7e25db93dc5/dpdk/mk/rte.subdir.mk:37: test-flow-perf] Error 2
  CC test_ticketlock.o
  CC macfwd.o
  CC test_memory.o
--
  CC test_bitops.o
/usr/bin/ld: cannot find -lrte_pmd_bcmfs
  CC test_reciprocal_division.o
clang-10: error: linker command failed with exit code 1 (use -v to see invocation)
make[5]: *** [/root/FC32-64_K5.6.0_Clang10.0.0/x86_64-native-linuxapp-clang/353b3d4a62504426b49cf7e25db93dc5/dpdk/mk/rte.app.mk:457: testpipeline] Error 1
make[4]: *** [/root/FC32-64_K5.6.0_Clang10.0.0/x86_64-native-linuxapp-clang/353b3d4a62504426b49cf7e25db93dc5/dpdk/mk/rte.subdir.mk:37: test-pipeline] Error 2
  CC macswap.o
  CC flowgen.o
  CC test_reciprocal_division_perf.o
--
  CC test_timer_secondary.o
  CC test_mempool.o
/usr/bin/ld: cannot find -lrte_pmd_bcmfs
clang-10: error: linker command failed with exit code 1 (use -v to see invocation)
make[5]: *** [/root/FC32-64_K5.6.0_Clang10.0.0/x86_64-native-linuxapp-clang/353b3d4a62504426b49cf7e25db93dc5/dpdk/mk/rte.app.mk:457: testpmd] Error 1
make[4]: *** [/root/FC32-64_K5.6.0_Clang10.0.0/x86_64-native-linuxapp-clang/353b3d4a62504426b49cf7e25db93dc5/dpdk/mk/rte.subdir.mk:37: test-pmd] Error 2
  CC test_mempool_perf.o
  CC test_mbuf.o
  CC test_logs.o
--
  MKRES test_resource_c.res.o
  LD test
/usr/bin/ld: cannot find -lrte_pmd_bcmfs
clang-10: error: linker command failed with exit code 1 (use -v to see invocation)
make[5]: *** [/root/FC32-64_K5.6.0_Clang10.0.0/x86_64-native-linuxapp-clang/353b3d4a62504426b49cf7e25db93dc5/dpdk/mk/rte.app.mk:457: test] Error 1
make[4]: *** [/root/FC32-64_K5.6.0_Clang10.0.0/x86_64-native-linuxapp-clang/353b3d4a62504426b49cf7e25db93dc5/dpdk/mk/rte.subdir.mk:37: test] Error 2
make[3]: *** [/root/FC32-64_K5.6.0_Clang10.0.0/x86_64-native-linuxapp-clang/353b3d4a62504426b49cf7e25db93dc5/dpdk/mk/rte.sdkbuild.mk:53: app] Error 2
make[2]: *** [/root/FC32-64_K5.6.0_Clang10.0.0/x86_64-native-linuxapp-clang/353b3d4a62504426b49cf7e25db93dc5/dpdk/mk/rte.sdkroot.mk:115: all] Error 2
make[1]: *** [/root/FC32-64_K5.6.0_Clang10.0.0/x86_64-native-linuxapp-clang/353b3d4a62504426b49cf7e25db93dc5/dpdk/mk/rte.sdkinstall.mk:61: pre_install] Error 2
make: *** [/root/FC32-64_K5.6.0_Clang10.0.0/x86_64-native-linuxapp-clang/353b3d4a62504426b49cf7e25db93dc5/dpdk/mk/rte.sdkroot.mk:92: install] Error 2


*Makefile Build Failed #8:
OS: FreeBSD1201-64
Target: x86_64-native-bsdapp-gcc
awk -f /usr/src/sys/tools/makeobjops.awk /usr/src/sys/kern/bus_if.m -h
awk -f /usr/src/sys/tools/makeobjops.awk /usr/src/sys/dev/pci/pci_if.m -h
Warning: Object directory not changed from original /root/FreeBSD1201-64_K12.1_GCC9.2.0/x86_64-native-bsdapp-gcc/353b3d4a62504426b49cf7e25db93dc5/dpdk/x86_64-native-bsdapp-gcc/build/kernel/freebsd/contigmem
cc  -Winline -Wall -Werror -include /root/FreeBSD1201-64_K12.1_GCC9.2.0/x86_64-native-bsdapp-gcc/353b3d4a62504426b49cf7e25db93dc5/dpdk/x86_64-native-bsdapp-gcc/include/rte_config.h  -Werror -D_KERNEL -DKLD_MODULE -nostdinc  -I/root/FreeBSD1201-64_K12.1_GCC9.2.0/x86_64-native-bsdapp-gcc/353b3d4a62504426b49cf7e25db93dc5/dpdk/kernel/freebsd/contigmem -I/root/FreeBSD1201-64_K12.1_GCC9.2.0/x86_64-native-bsdapp-gcc/353b3d4a62504426b49cf7e25db93dc5/dpdk/x86_64-native-bsdapp-gcc/include -I. -I/usr/src/sys -I/usr/src/sys/contrib/ck/include -fno-common  -fno-omit-frame-pointer -mno-omit-leaf-frame-pointer -fdebug-prefix-map=./machine=/usr/src/sys/amd64/include -fdebug-prefix-map=./x86=/usr/src/sys/x86/include   -MD  -MF.depend.contigmem.o -MTcontigmem.o -mcmodel=kernel -mno-red-zone -mno-mmx -mno-sse -msoft-float  -fno-asynchronous-unwind-tables -ffreestanding -fwrapv -fstack-protector -Wall -Wredundant-decls -Wnested-externs -Wstrict-prototypes -Wmissing-prototypes -Wpointer-arith -Wcast-qual -Wundef -Wno-pointer-sign -D__printf__=__freebsd_kprintf__ -Wmissing-include-dirs -fdiagnostics-show-option -Wno-unknown-pragmas -Wno-error-tautological-compare -Wno-error-empty-body -Wno-error-parentheses-equality -Wno-error-unused-function -Wno-error-pointer-sign -Wno-error-shift-negative-value -Wno-address-of-packed-member  -mno-aes -mno-avx  -std=iso9899:1999 -c contigmem.c -o contigmem.o
Warning: Object directory not changed from original /root/FreeBSD1201-64_K12.1_GCC9.2.0/x86_64-native-bsdapp-gcc/353b3d4a62504426b49cf7e25db93dc5/dpdk/x86_64-native-bsdapp-gcc/build/kernel/freebsd/nic_uio
cc  -Winline -Wall -Werror -include /root/FreeBSD1201-64_K12.1_GCC9.2.0/x86_64-native-bsdapp-gcc/353b3d4a62504426b49cf7e25db93dc5/dpdk/x86_64-native-bsdapp-gcc/include/rte_config.h  -Werror -D_KERNEL -DKLD_MODULE -nostdinc  -I/root/FreeBSD1201-64_K12.1_GCC9.2.0/x86_64-native-bsdapp-gcc/353b3d4a62504426b49cf7e25db93dc5/dpdk/kernel/freebsd/nic_uio -I/root/FreeBSD1201-64_K12.1_GCC9.2.0/x86_64-native-bsdapp-gcc/353b3d4a62504426b49cf7e25db93dc5/dpdk/x86_64-native-bsdapp-gcc/include -I. -I/usr/src/sys -I/usr/src/sys/contrib/ck/include -fno-common  -fno-omit-frame-pointer -mno-omit-leaf-frame-pointer -fdebug-prefix-map=./machine=/usr/src/sys/amd64/include -fdebug-prefix-map=./x86=/usr/src/sys/x86/include   -MD  -MF.depend.nic_uio.o -MTnic_uio.o -mcmodel=kernel -mno-red-zone -mno-mmx -mno-sse -msoft-float  -fno-asynchronous-unwind-tables -ffreestanding -fwrapv -fstack-protector -Wall -Wredundant-decls -Wnested-externs -Wstrict-prototypes -Wmissing-prototypes -Wpointer-arith -Wcast-qual -Wundef -Wno-pointer-sign -D__printf__=__freebsd_kprintf__ -Wmissing-include-dirs -fdiagnostics-show-option -Wno-unknown-pragmas -Wno-error-tautological-compare -Wno-error-empty-body -Wno-error-parentheses-equality -Wno-error-unused-function -Wno-error-pointer-sign -Wno-error-shift-negative-value -Wno-address-of-packed-member  -mno-aes -mno-avx  -std=iso9899:1999 -c nic_uio.c -o nic_uio.o
ld -m elf_x86_64_fbsd -L/root/FreeBSD1201-64_K12.1_GCC9.2.0/x86_64-native-bsdapp-gcc/353b3d4a62504426b49cf7e25db93dc5/dpdk/x86_64-native-bsdapp-gcc/lib -d -warn-common --build-id=sha1 -r -d -o contigmem.ko contigmem.o
:> export_syms
awk -f /usr/src/sys/conf/kmod_syms.awk contigmem.ko  export_syms | xargs -J% objcopy % contigmem.ko
--
/  LD cmdline_test
  CC config.o
usr/local/bin/ld: cannot find -lrte_pmd_bcmfs
collect2: error: ld returned 1 exit status
gmake[5]: *** [/root/FreeBSD1201-64_K12.1_GCC9.2.0/x86_64-native-bsdapp-gcc/353b3d4a62504426b49cf7e25db93dc5/dpdk/mk/rte.app.mk:457: testacl] Error 1
gmake[4]: *** [/root/FreeBSD1201-64_K12.1_GCC9.2.0/x86_64-native-bsdapp-gcc/353b3d4a62504426b49cf7e25db93dc5/dpdk/mk/rte.subdir.mk:37: test-acl] Error 2
gmake[4]: *** Waiting for unfinished jobs....
/usr/local/bin/ld: cannot find -lrte_pmd_bcmfs
collect2: error: ld returned 1 exit status
gmake[5]: *** [/root/FreeBSD1201-64_K12.1_GCC9.2.0/x86_64-native-bsdapp-gcc/353b3d4a62504426b49cf7e25db93dc5/dpdk/mk/rte.app.mk:457: dpdk-test-regex] Error 1
gmake[4]: *** [/root/FreeBSD1201-64_K12.1_GCC9.2.0/x86_64-native-bsdapp-gcc/353b3d4a62504426b49cf7e25db93dc5/dpdk/mk/rte.subdir.mk:37: test-regex] Error 2
  LD testfib
  CC items_gen.o
  LD testsad
--
  CC init.o
  CC parameters.o
/usr/usr/local/bin/ld: cannot find -lrte_pmd_bcmfs
collect2: error: ld returned 1 exit status
gmake[5]: *** [/root/FreeBSD1201-64_K12.1_GCC9.2.0/x86_64-native-bsdapp-gcc/353b3d4a62504426b49cf7e25db93dc5/dpdk/mk/rte.app.mk:457: testfib] Error 1
/  LD dpdk-pdump
gmake[4]: *** [/root/FreeBSD1201-64_K12.1_GCC9.2.0/x86_64-native-bsdapp-gcc/353b3d4a62504426b49cf7e25db93dc5/dpdk/mk/rte.subdir.mk:37: test-fib] Error 2
/local/bin/ld: cannot find -lrte_pmd_bcmfs
collect2: error: ld returned 1 exit status
gmake[5]: *** [/root/FreeBSD1201-64_K12.1_GCC9.2.0/x86_64-native-bsdapp-gcc/353b3d4a62504426b49cf7e25db93dc5/dpdk/mk/rte.app.mk:457: cmdline_test] Error 1
usr/gmake[4]: *** [/root/FreeBSD1201-64_K12.1_GCC9.2.0/x86_64-native-bsdapp-gcc/353b3d4a62504426b49cf7e25db93dc5/dpdk/mk/rte.subdir.mk:37: test-cmdline] Error 2
local/bin/ld: cannot find -lrte_pmd_bcmfs
collect2: error: ld returned 1 exit status
  CC main.o
gmake[5]: *** [/root/FreeBSD1201-64_K12.1_GCC9.2.0/x86_64-native-bsdapp-gcc/353b3d4a62504426b49cf7e25db93dc5/dpdk/mk/rte.app.mk:457: testsad] Error 1
gmake[4]: *** [/root/FreeBSD1201-64_K12.1_GCC9.2.0/x86_64-native-bsdapp-gcc/353b3d4a62504426b49cf7e25db93dc5/dpdk/mk/rte.subdir.mk:37: test-sad] Error 2
  CC cmdline.o
  CC test_resource.o
  CC resource.o
  CC cmdline_flow.o
/usr/local/bin/ld: cannot find -lrte_pmd_bcmfs
collect2: error: ld returned 1 exit status
gmake[5]: *** [/root/FreeBSD1201-64_K12.1_GCC9.2.0/x86_64-native-bsdapp-gcc/353b3d4a62504426b49cf7e25db93dc5/dpdk/mk/rte.app.mk:457: dpdk-pdump] Error 1
gmake[4]: *** [/root/FreeBSD1201-64_K12.1_GCC9.2.0/x86_64-native-bsdapp-gcc/353b3d4a62504426b49cf7e25db93dc5/dpdk/mk/rte.subdir.mk:37: pdump] Error 2
  CC runtime.o
  CC cmdline_mtr.o
  CC pipeline_stub.o
--
  CC pipeline_lpm_ipv6.o
  CC test_barrier.o
/usr/local/bin/ld: cannot find -lrte_pmd_bcmfs
collect2: error: ld returned 1 exit status
gmake[5]: *** [/root/FreeBSD1201-64_K12.1_GCC9.2.0/x86_64-native-bsdapp-gcc/353b3d4a62504426b49cf7e25db93dc5/dpdk/mk/rte.app.mk:457: dpdk-test-flow-perf] Error 1
gmake[4]: *** [/root/FreeBSD1201-64_K12.1_GCC9.2.0/x86_64-native-bsdapp-gcc/353b3d4a62504426b49cf7e25db93dc5/dpdk/mk/rte.subdir.mk:37: test-flow-perf] Error 2
  CC macfwd.o
  CC macswap.o
  LD testpipeline
--
  CC test_cycles.o
  CC test_mcslock.o
/usr/local/bin/ld: cannot find -lrte_pmd_bcmfs
collect2: error: ld returned 1 exit status
gmake[5]: *** [/root/FreeBSD1201-64_K12.1_GCC9.2.0/x86_64-native-bsdapp-gcc/353b3d4a62504426b49cf7e25db93dc5/dpdk/mk/rte.app.mk:457: testpipeline] Error 1
gmake[4]: *** [/root/FreeBSD1201-64_K12.1_GCC9.2.0/x86_64-native-bsdapp-gcc/353b3d4a62504426b49cf7e25db93dc5/dpdk/mk/rte.subdir.mk:37: test-pipeline] Error 2
  CC rxonly.o
  CC txonly.o
  CC test_spinlock.o
--
  CC test_table_tables.o
  CC test_table_ports.o
/usr/local/bin/ld: cannot find -lrte_pmd_bcmfs
collect2: error: ld returned 1 exit status
gmake[5]: *** [/root/FreeBSD1201-64_K12.1_GCC9.2.0/x86_64-native-bsdapp-gcc/353b3d4a62504426b49cf7e25db93dc5/dpdk/mk/rte.app.mk:457: testpmd] Error 1
gmake[4]: *** [/root/FreeBSD1201-64_K12.1_GCC9.2.0/x86_64-native-bsdapp-gcc/353b3d4a62504426b49cf7e25db93dc5/dpdk/mk/rte.subdir.mk:37: test-pmd] Error 2
  CC test_table_combined.o
  CC test_table_acl.o
  CC test_flow_classify.o
--
  MKRES test_resource_c.res.o
  LD test
/usr/local/bin/ld: cannot find -lrte_pmd_bcmfs
collect2: error: ld returned 1 exit status
gmake[5]: *** [/root/FreeBSD1201-64_K12.1_GCC9.2.0/x86_64-native-bsdapp-gcc/353b3d4a62504426b49cf7e25db93dc5/dpdk/mk/rte.app.mk:457: test] Error 1
gmake[4]: *** [/root/FreeBSD1201-64_K12.1_GCC9.2.0/x86_64-native-bsdapp-gcc/353b3d4a62504426b49cf7e25db93dc5/dpdk/mk/rte.subdir.mk:37: test] Error 2
gmake[3]: *** [/root/FreeBSD1201-64_K12.1_GCC9.2.0/x86_64-native-bsdapp-gcc/353b3d4a62504426b49cf7e25db93dc5/dpdk/mk/rte.sdkbuild.mk:53: app] Error 2
gmake[2]: *** [/root/FreeBSD1201-64_K12.1_GCC9.2.0/x86_64-native-bsdapp-gcc/353b3d4a62504426b49cf7e25db93dc5/dpdk/mk/rte.sdkroot.mk:115: all] Error 2
gmake[1]: *** [/root/FreeBSD1201-64_K12.1_GCC9.2.0/x86_64-native-bsdapp-gcc/353b3d4a62504426b49cf7e25db93dc5/dpdk/mk/rte.sdkinstall.mk:61: pre_install] Error 2
gmake: *** [/root/FreeBSD1201-64_K12.1_GCC9.2.0/x86_64-native-bsdapp-gcc/353b3d4a62504426b49cf7e25db93dc5/dpdk/mk/rte.sdkroot.mk:92: install] Error 2


*Makefile Build Failed #9:
OS: FreeBSD1201-64
Target: x86_64-native-bsdapp-clang
awk -f /usr/src/sys/tools/makeobjops.awk /usr/src/sys/kern/bus_if.m -h
Warning: Object directory not changed from original /root/FreeBSD1201-64_K12.1_Clang8.0.1/x86_64-native-bsdapp-clang/353b3d4a62504426b49cf7e25db93dc5/dpdk/x86_64-native-bsdapp-clang/build/kernel/freebsd/contigmem
awk -f /usr/src/sys/tools/makeobjops.awk /usr/src/sys/dev/pci/pci_if.m -h
cc  -Winline -Wall -Werror -include /root/FreeBSD1201-64_K12.1_Clang8.0.1/x86_64-native-bsdapp-clang/353b3d4a62504426b49cf7e25db93dc5/dpdk/x86_64-native-bsdapp-clang/include/rte_config.h  -Werror -D_KERNEL -DKLD_MODULE -nostdinc  -I/root/FreeBSD1201-64_K12.1_Clang8.0.1/x86_64-native-bsdapp-clang/353b3d4a62504426b49cf7e25db93dc5/dpdk/kernel/freebsd/contigmem -I/root/FreeBSD1201-64_K12.1_Clang8.0.1/x86_64-native-bsdapp-clang/353b3d4a62504426b49cf7e25db93dc5/dpdk/x86_64-native-bsdapp-clang/include -I. -I/usr/src/sys -I/usr/src/sys/contrib/ck/include -fno-common  -fno-omit-frame-pointer -mno-omit-leaf-frame-pointer -fdebug-prefix-map=./machine=/usr/src/sys/amd64/include -fdebug-prefix-map=./x86=/usr/src/sys/x86/include   -MD  -MF.depend.contigmem.o -MTcontigmem.o -mcmodel=kernel -mno-red-zone -mno-mmx -mno-sse -msoft-float  -fno-asynchronous-unwind-tables -ffreestanding -fwrapv -fstack-protector -Wall -Wredundant-decls -Wnested-externs -Wstrict-prototypes -Wmissing-prototypes -Wpointer-arith -Wcast-qual -Wundef -Wno-pointer-sign -D__printf__=__freebsd_kprintf__ -Wmissing-include-dirs -fdiagnostics-show-option -Wno-unknown-pragmas -Wno-error-tautological-compare -Wno-error-empty-body -Wno-error-parentheses-equality -Wno-error-unused-function -Wno-error-pointer-sign -Wno-error-shift-negative-value -Wno-address-of-packed-member  -mno-aes -mno-avx  -std=iso9899:1999 -c contigmem.c -o contigmem.o
Warning: Object directory not changed from original /root/FreeBSD1201-64_K12.1_Clang8.0.1/x86_64-native-bsdapp-clang/353b3d4a62504426b49cf7e25db93dc5/dpdk/x86_64-native-bsdapp-clang/build/kernel/freebsd/nic_uio
cc  -Winline -Wall -Werror -include /root/FreeBSD1201-64_K12.1_Clang8.0.1/x86_64-native-bsdapp-clang/353b3d4a62504426b49cf7e25db93dc5/dpdk/x86_64-native-bsdapp-clang/include/rte_config.h  -Werror -D_KERNEL -DKLD_MODULE -nostdinc  -I/root/FreeBSD1201-64_K12.1_Clang8.0.1/x86_64-native-bsdapp-clang/353b3d4a62504426b49cf7e25db93dc5/dpdk/kernel/freebsd/nic_uio -I/root/FreeBSD1201-64_K12.1_Clang8.0.1/x86_64-native-bsdapp-clang/353b3d4a62504426b49cf7e25db93dc5/dpdk/x86_64-native-bsdapp-clang/include -I. -I/usr/src/sys -I/usr/src/sys/contrib/ck/include -fno-common  -fno-omit-frame-pointer -mno-omit-leaf-frame-pointer -fdebug-prefix-map=./machine=/usr/src/sys/amd64/include -fdebug-prefix-map=./x86=/usr/src/sys/x86/include   -MD  -MF.depend.nic_uio.o -MTnic_uio.o -mcmodel=kernel -mno-red-zone -mno-mmx -mno-sse -msoft-float  -fno-asynchronous-unwind-tables -ffreestanding -fwrapv -fstack-protector -Wall -Wredundant-decls -Wnested-externs -Wstrict-prototypes -Wmissing-prototypes -Wpointer-arith -Wcast-qual -Wundef -Wno-pointer-sign -D__printf__=__freebsd_kprintf__ -Wmissing-include-dirs -fdiagnostics-show-option -Wno-unknown-pragmas -Wno-error-tautological-compare -Wno-error-empty-body -Wno-error-parentheses-equality -Wno-error-unused-function -Wno-error-pointer-sign -Wno-error-shift-negative-value -Wno-address-of-packed-member  -mno-aes -mno-avx  -std=iso9899:1999 -c nic_uio.c -o nic_uio.o
== Build drivers/common
== Build drivers/common/octeontx
== Build drivers/common/iavf
--
  CC config.o
  CC flow_gen.o
  LD cmdline_test
ld: error: unable to find library -lrte_pmd_bcmfs
clang: error: linker command failed with exit code 1 (use -v to see invocation)
gmake[5]: *** [/root/FreeBSD1201-64_K12.1_Clang8.0.1/x86_64-native-bsdapp-clang/353b3d4a62504426b49cf7e25db93dc5/dpdk/mk/rte.app.mk:457: cmdline_test] Error 1
gmake[4]: *** [/root/FreeBSD1201-64_K12.1_Clang8.0.1/x86_64-native-bsdapp-clang/353b3d4a62504426b49cf7e25db93dc5/dpdk/mk/rte.subdir.mk:37: test-cmdline] Error 2
gmake[4]: *** Waiting for unfinished jobs....
  LD testacl
  LD testsad
ld: error: unable to find library -lrte_pmd_bcmfs
clang: error: linker command failed with exit code 1 (use -v to see invocation)
gmake[5]: *** [/root/FreeBSD1201-64_K12.1_Clang8.0.1/x86_64-native-bsdapp-clang/353b3d4a62504426b49cf7e25db93dc5/dpdk/mk/rte.app.mk:457: testacl] Error 1
ld: error: unable to find library -lrte_pmd_bcmfs
gmake[4]: *** [/root/FreeBSD1201-64_K12.1_Clang8.0.1/x86_64-native-bsdapp-clang/353b3d4a62504426b49cf7e25db93dc5/dpdk/mk/rte.subdir.mk:37: test-acl] Error 2
clang: error  LD dpdk-test-regex
: linker command failed with exit code 1 (use -v to see invocation)
gmake[5]: *** [/root/FreeBSD1201-64_K12.1_Clang8.0.1/x86_64-native-bsdapp-clang/353b3d4a62504426b49cf7e25db93dc5/dpdk/mk/rte.app.mk:457: testsad] Error 1
gmake[4]: *** [/root/FreeBSD1201-64_K12.1_Clang8.0.1/x86_64-native-bsdapp-clang/353b3d4a62504426b49cf7e25db93dc5/dpdk/mk/rte.subdir.mk:37: test-sad] Error 2
  CC parameters.o
  CC items_gen.o
  LD dpdk-pdump
ld: error: unable to find library -lrte_pmd_bcmfs
clang: error: linker command failed with exit code 1 (use -v to see invocation)
gmake[5]: *** [/root/FreeBSD1201-64_K12.1_Clang8.0.1/x86_64-native-bsdapp-clang/353b3d4a62504426b49cf7e25db93dc5/dpdk/mk/rte.app.mk:457: dpdk-test-regex] Error 1
gmake[4]: *** [/root/FreeBSD1201-64_K12.1_Clang8.0.1/x86_64-native-bsdapp-clang/353b3d4a62504426b49cf7e25db93dc5/dpdk/mk/rte.subdir.mk:37: test-regex] Error 2
  CC init.o
ld: error:   CC main.o
unable to find library -lrte_pmd_bcmfs
  CC cmdline.o
clang: error: linker command failed with exit code 1 (use -v to see invocation)
gmake[5]: *** [/root/FreeBSD1201-64_K12.1_Clang8.0.1/x86_64-native-bsdapp-clang/353b3d4a62504426b49cf7e25db93dc5/dpdk/mk/rte.app.mk:457: dpdk-pdump] Error 1
gmake[4]: *** [/root/FreeBSD1201-64_K12.1_Clang8.0.1/x86_64-native-bsdapp-clang/353b3d4a62504426b49cf7e25db93dc5/dpdk/mk/rte.subdir.mk:37: pdump] Error 2
  LD testfib
  CC test.o
ld: error: unable to find library -lrte_pmd_bcmfs
  CC cmdline_flow.o
clang: error: linker command failed with exit code 1 (use -v to see invocation)
gmake[5]: *** [/root/FreeBSD1201-64_K12.1_Clang8.0.1/x86_64-native-bsdapp-clang/353b3d4a62504426b49cf7e25db93dc5/dpdk/mk/rte.app.mk:457: testfib] Error 1
gmake[4]: *** [/root/FreeBSD1201-64_K12.1_Clang8.0.1/x86_64-native-bsdapp-clang/353b3d4a62504426b49cf7e25db93dc5/dpdk/mk/rte.subdir.mk:37: test-fib] Error 2
  CC cmdline_mtr.o
  CC cmdline_tm.o
  CC pipeline_stub.o
  CC runtime.o
  LD dpdk-test-flow-perf
  CC resource.o
ld: error: unable to find library -lrte_pmd_bcmfs
  CC config.o
clang: error: linker command failed with exit code 1 (use -v to see invocation)
gmake[5]: *** [/root/FreeBSD1201-64_K12.1_Clang8.0.1/x86_64-native-bsdapp-clang/353b3d4a62504426b49cf7e25db93dc5/dpdk/mk/rte.app.mk:457: dpdk-test-flow-perf] Error 1
gmake[4]: *** [/root/FreeBSD1201-64_K12.1_Clang8.0.1/x86_64-native-bsdapp-clang/353b3d4a62504426b49cf7e25db93dc5/dpdk/mk/rte.subdir.mk:37: test-flow-perf] Error 2
  CC pipeline_hash.o
  CC iofwd.o
  CC test_resource.o
--
  CC txonly.o
  CC csumonly.o
  CC icmpecho.o
ld: error: unable to find library -lrte_pmd_bcmfs
clang: error: linker command failed with exit code 1 (use -v to see invocation)
gmake[5]: *** [/root/FreeBSD1201-64_K12.1_Clang8.0.1/x86_64-native-bsdapp-clang/353b3d4a62504426b49cf7e25db93dc5/dpdk/mk/rte.app.mk:457: testpipeline] Error 1
gmake[4]: *** [/root/FreeBSD1201-64_K12.1_Clang8.0.1/x86_64-native-bsdapp-clang/353b3d4a62504426b49cf7e25db93dc5/dpdk/mk/rte.subdir.mk:37: test-pipeline] Error 2
  CC test_ticketlock.o
  CC noisy_vnf.o
  CC test_memzone.o
--
  CC test_table_tables.o
  CC test_table_combined.o
  LD testpmd
ld: error: unable to find library -lrte_pmd_bcmfs
clang: error: linker command failed with exit code 1 (use -v to see invocation)
gmake[5]: *** [/root/FreeBSD1201-64_K12.1_Clang8.0.1/x86_64-native-bsdapp-clang/353b3d4a62504426b49cf7e25db93dc5/dpdk/mk/rte.app.mk:457: testpmd] Error 1
gmake[4]: *** [/root/FreeBSD1201-64_K12.1_Clang8.0.1/x86_64-native-bsdapp-clang/353b3d4a62504426b49cf7e25db93dc5/dpdk/mk/rte.subdir.mk:37: test-pmd] Error 2
  CC test_table_acl.o
  CC test_flow_classify.o
  CC test_lcores.o
--
  CC test_ipsec_sad.o
  MKRES test_resource_c.res.o
  LD test
ld: error: unable to find library -lrte_pmd_bcmfs
clang: error: linker command failed with exit code 1 (use -v to see invocation)
gmake[5]: *** [/root/FreeBSD1201-64_K12.1_Clang8.0.1/x86_64-native-bsdapp-clang/353b3d4a62504426b49cf7e25db93dc5/dpdk/mk/rte.app.mk:457: test] Error 1
gmake[4]: *** [/root/FreeBSD1201-64_K12.1_Clang8.0.1/x86_64-native-bsdapp-clang/353b3d4a62504426b49cf7e25db93dc5/dpdk/mk/rte.subdir.mk:37: test] Error 2
gmake[3]: *** [/root/FreeBSD1201-64_K12.1_Clang8.0.1/x86_64-native-bsdapp-clang/353b3d4a62504426b49cf7e25db93dc5/dpdk/mk/rte.sdkbuild.mk:53: app] Error 2
gmake[2]: *** [/root/FreeBSD1201-64_K12.1_Clang8.0.1/x86_64-native-bsdapp-clang/353b3d4a62504426b49cf7e25db93dc5/dpdk/mk/rte.sdkroot.mk:115: all] Error 2
gmake[1]: *** [/root/FreeBSD1201-64_K12.1_Clang8.0.1/x86_64-native-bsdapp-clang/353b3d4a62504426b49cf7e25db93dc5/dpdk/mk/rte.sdkinstall.mk:61: pre_install] Error 2
gmake: *** [/root/FreeBSD1201-64_K12.1_Clang8.0.1/x86_64-native-bsdapp-clang/353b3d4a62504426b49cf7e25db93dc5/dpdk/mk/rte.sdkroot.mk:92: install] Error 2


*Makefile Build Failed #10:
OS: FreeBSD1201-64
Target: x86_64-native-bsdapp-gcc+debug
awk -f /usr/src/sys/tools/makeobjops.awk /usr/src/sys/kern/bus_if.m -h
awk -f /usr/src/sys/tools/makeobjops.awk /usr/src/sys/dev/pci/pci_if.m -h
Warning: Object directory not changed from original /root/FreeBSD1201-64_K12.1_GCC7.3.0/x86_64-native-bsdapp-gcc+debug/353b3d4a62504426b49cf7e25db93dc5/dpdk/x86_64-native-bsdapp-gcc/build/kernel/freebsd/contigmem
cc  -Winline -Wall -Werror -include /root/FreeBSD1201-64_K12.1_GCC7.3.0/x86_64-native-bsdapp-gcc+debug/353b3d4a62504426b49cf7e25db93dc5/dpdk/x86_64-native-bsdapp-gcc/include/rte_config.h  -Werror -D_KERNEL -DKLD_MODULE -nostdinc  -I/root/FreeBSD1201-64_K12.1_GCC7.3.0/x86_64-native-bsdapp-gcc+debug/353b3d4a62504426b49cf7e25db93dc5/dpdk/kernel/freebsd/contigmem -I/root/FreeBSD1201-64_K12.1_GCC7.3.0/x86_64-native-bsdapp-gcc+debug/353b3d4a62504426b49cf7e25db93dc5/dpdk/x86_64-native-bsdapp-gcc/include -I. -I/usr/src/sys -I/usr/src/sys/contrib/ck/include -fno-common  -fno-omit-frame-pointer -mno-omit-leaf-frame-pointer -fdebug-prefix-map=./machine=/usr/src/sys/amd64/include -fdebug-prefix-map=./x86=/usr/src/sys/x86/include   -MD  -MF.depend.contigmem.o -MTcontigmem.o -mcmodel=kernel -mno-red-zone -mno-mmx -mno-sse -msoft-float  -fno-asynchronous-unwind-tables -ffreestanding -fwrapv -fstack-protector -Wall -Wredundant-decls -Wnested-externs -Wstrict-prototypes -Wmissing-prototypes -Wpointer-arith -Wcast-qual -Wundef -Wno-pointer-sign -D__printf__=__freebsd_kprintf__ -Wmissing-include-dirs -fdiagnostics-show-option -Wno-unknown-pragmas -Wno-error-tautological-compare -Wno-error-empty-body -Wno-error-parentheses-equality -Wno-error-unused-function -Wno-error-pointer-sign -Wno-error-shift-negative-value -Wno-address-of-packed-member  -mno-aes -mno-avx  -std=iso9899:1999 -c contigmem.c -o contigmem.o
== Build drivers/common
Warning: Object directory not changed from original /root/FreeBSD1201-64_K12.1_GCC7.3.0/x86_64-native-bsdapp-gcc+debug/353b3d4a62504426b49cf7e25db93dc5/dpdk/x86_64-native-bsdapp-gcc/build/kernel/freebsd/nic_uio
cc  -Winline -Wall -Werror -include /root/FreeBSD1201-64_K12.1_GCC7.3.0/x86_64-native-bsdapp-gcc+debug/353b3d4a62504426b49cf7e25db93dc5/dpdk/x86_64-native-bsdapp-gcc/include/rte_config.h  -Werror -D_KERNEL -DKLD_MODULE -nostdinc  -I/root/FreeBSD1201-64_K12.1_GCC7.3.0/x86_64-native-bsdapp-gcc+debug/353b3d4a62504426b49cf7e25db93dc5/dpdk/kernel/freebsd/nic_uio -I/root/FreeBSD1201-64_K12.1_GCC7.3.0/x86_64-native-bsdapp-gcc+debug/353b3d4a62504426b49cf7e25db93dc5/dpdk/x86_64-native-bsdapp-gcc/include -I. -I/usr/src/sys -I/usr/src/sys/contrib/ck/include -fno-common  -fno-omit-frame-pointer -mno-omit-leaf-frame-pointer -fdebug-prefix-map=./machine=/usr/src/sys/amd64/include -fdebug-prefix-map=./x86=/usr/src/sys/x86/include   -MD  -MF.depend.nic_uio.o -MTnic_uio.o -mcmodel=kernel -mno-red-zone -mno-mmx -mno-sse -msoft-float  -fno-asynchronous-unwind-tables -ffreestanding -fwrapv -fstack-protector -Wall -Wredundant-decls -Wnested-externs -Wstrict-prototypes -Wmissing-prototypes -Wpointer-arith -Wcast-qual -Wundef -Wno-pointer-sign -D__printf__=__freebsd_kprintf__ -Wmissing-include-dirs -fdiagnostics-show-option -Wno-unknown-pragmas -Wno-error-tautological-compare -Wno-error-empty-body -Wno-error-parentheses-equality -Wno-error-unused-function -Wno-error-pointer-sign -Wno-error-shift-negative-value -Wno-address-of-packed-member  -mno-aes -mno-avx  -std=iso9899:1999 -c nic_uio.c -o nic_uio.o
ld -m elf_x86_64_fbsd -L/root/FreeBSD1201-64_K12.1_GCC7.3.0/x86_64-native-bsdapp-gcc+debug/353b3d4a62504426b49cf7e25db93dc5/dpdk/x86_64-native-bsdapp-gcc/lib -d -warn-common --build-id=sha1 -r -d -o contigmem.ko contigmem.o
ld -m elf_x86_64_fbsd -L/root/FreeBSD1201-64_K12.1_GCC7.3.0/x86_64-native-bsdapp-gcc+debug/353b3d4a62504426b49cf7e25db93dc5/dpdk/x86_64-native-bsdapp-gcc/lib -d -warn-common --build-id=sha1 -r -d -o nic_uio.ko nic_uio.o
:> export_syms
--
  LD dpdk-pdump
  LD testsad
/usr/local/bin/ld: cannot find -lrte_pmd_bcmfs
collect2: error: ld returned 1 exit status
gmake[5]: *** [/root/FreeBSD1201-64_K12.1_GCC7.3.0/x86_64-native-bsdapp-gcc+debug/353b3d4a62504426b49cf7e25db93dc5/dpdk/mk/rte.app.mk:457: dpdk-pdump] Error 1
gmake[4]: *** [/root/FreeBSD1201-64_K12.1_GCC7.3.0/x86_64-native-bsdapp-gcc+debug/353b3d4a62504426b49cf7e25db93dc5/dpdk/mk/rte.subdir.mk:37: pdump] Error 2
gmake[4]: *** Waiting for unfinished jobs....
  CC flow_gen.o
  CC test.o
  CC config.o
/usr/local/bin/ld: cannot find -lrte_pmd_bcmfs
collect2: error: ld returned 1 exit status
gmake[5]: *** [/root/FreeBSD1201-64_K12.1_GCC7.3.0/x86_64-native-bsdapp-gcc+debug/353b3d4a62504426b49cf7e25db93dc5/dpdk/mk/rte.app.mk:457: testsad] Error 1
gmake[4]: *** [/root/FreeBSD1201-64_K12.1_GCC7.3.0/x86_64-native-bsdapp-gcc+debug/353b3d4a62504426b49cf7e25db93dc5/dpdk/mk/rte.subdir.mk:37: test-sad] Error 2
  LD testacl
  CC parameters.o
  CC init.o
/usr/local/bin/ld: cannot find -lrte_pmd_bcmfs
collect2: error: ld returned 1 exit status
gmake[5]: *** [/root/FreeBSD1201-64_K12.1_GCC7.3.0/x86_64-native-bsdapp-gcc+debug/353b3d4a62504426b49cf7e25db93dc5/dpdk/mk/rte.app.mk:457: testacl] Error 1
gmake[4]: *** [/root/FreeBSD1201-64_K12.1_GCC7.3.0/x86_64-native-bsdapp-gcc+debug/353b3d4a62504426b49cf7e25db93dc5/dpdk/mk/rte.subdir.mk:37: test-acl] Error 2
  LD cmdline_test
  CC resource.o
  LD dpdk-test-regex
/usr/local/bin/ld  LD testfib
: cannot find -lrte_pmd_bcmfs
collect2: error: ld returned 1 exit status
gmake[5]: *** [/root/FreeBSD1201-64_K12.1_GCC7.3.0/x86_64-native-bsdapp-gcc+debug/353b3d4a62504426b49cf7e25db93dc5/dpdk/mk/rte.app.mk:457: cmdline_test] Error 1
  CC cmdline.o
gmake[4]: *** [/root/FreeBSD1201-64_K12.1_GCC7.3.0/x86_64-native-bsdapp-gcc+debug/353b3d4a62504426b49cf7e25db93dc5/dpdk/mk/rte.subdir.mk:37: test-cmdline] Error 2
  CC test_resource.o
/usr/local/bin/ld: cannot find -lrte_pmd_bcmfs
collect2: error: ld returned 1 exit status
gmake[5]: *** [/root/FreeBSD1201-64_K12.1_GCC7.3.0/x86_64-native-bsdapp-gcc+debug/353b3d4a62504426b49cf7e25db93dc5/dpdk/mk/rte.app.mk:457: dpdk-test-regex] Error 1
gmake[4]: *** [/root/FreeBSD1201-64_K12.1_GCC7.3.0/x86_64-native-bsdapp-gcc+debug/353b3d4a62504426b49cf7e25db93dc5/dpdk/mk/rte.subdir.mk:37: test-regex] Error 2
  CC cmdline_mtr.o
  CC cmdline_flow.o
  CC main.o
  CC items_gen.o
/usr/local/bin/ld: cannot find -lrte_pmd_bcmfs
collect2: error: ld returned 1 exit status
gmake[5]: *** [/root/FreeBSD1201-64_K12.1_GCC7.3.0/x86_64-native-bsdapp-gcc+debug/353b3d4a62504426b49cf7e25db93dc5/dpdk/mk/rte.app.mk:457: testfib] Error 1
gmake[4]: *** [/root/FreeBSD1201-64_K12.1_GCC7.3.0/x86_64-native-bsdapp-gcc+debug/353b3d4a62504426b49cf7e25db93dc5/dpdk/mk/rte.subdir.mk:37: test-fib] Error 2
  CC test_prefetch.o
  CC cmdline_tm.o
  CC runtime.o
--
  CC iofwd.o
  CC pipeline_lpm_ipv6.o
/usr/local/bin/ld: cannot find -lrte_pmd_bcmfs
collect2: error: ld returned 1 exit status
gmake[5]: *** [/root/FreeBSD1201-64_K12.1_GCC7.3.0/x86_64-native-bsdapp-gcc+debug/353b3d4a62504426b49cf7e25db93dc5/dpdk/mk/rte.app.mk:457: dpdk-test-flow-perf] Error 1
gmake[4]: *** [/root/FreeBSD1201-64_K12.1_GCC7.3.0/x86_64-native-bsdapp-gcc+debug/353b3d4a62504426b49cf7e25db93dc5/dpdk/mk/rte.subdir.mk:37: test-flow-perf] Error 2
  CC macfwd.o
  CC test_atomic.o
  CC pipeline_acl.o
--
  CC test_ticketlock.o
  CC noisy_vnf.o
/usr/local/bin/ld: cannot find -lrte_pmd_bcmfs
collect2: error: ld returned 1 exit status
gmake[5]: *** [/root/FreeBSD1201-64_K12.1_GCC7.3.0/x86_64-native-bsdapp-gcc+debug/353b3d4a62504426b49cf7e25db93dc5/dpdk/mk/rte.app.mk:457: testpipeline] Error 1
gmake[4]: *** [/root/FreeBSD1201-64_K12.1_GCC7.3.0/x86_64-native-bsdapp-gcc+debug/353b3d4a62504426b49cf7e25db93dc5/dpdk/mk/rte.subdir.mk:37: test-pipeline] Error 2
  CC test_memzone.o
  CC test_memory.o
  CC test_bitmap.o
--
  CC test_rwlock.o
  LD testpmd
/usr/local/bin/ld: cannot find -lrte_pmd_bcmfs
collect2: error: ld returned 1 exit status
gmake[5]: *** [/root/FreeBSD1201-64_K12.1_GCC7.3.0/x86_64-native-bsdapp-gcc+debug/353b3d4a62504426b49cf7e25db93dc5/dpdk/mk/rte.app.mk:457: testpmd] Error 1
gmake[4]: *** [/root/FreeBSD1201-64_K12.1_GCC7.3.0/x86_64-native-bsdapp-gcc+debug/353b3d4a62504426b49cf7e25db93dc5/dpdk/mk/rte.subdir.mk:37: test-pmd] Error 2
  CC test_lcores.o
  CC test_stack_perf.o
  CC test_stack.o
--
  MKRES test_resource_c.res.o
  LD test
/usr/local/bin/ld: cannot find -lrte_pmd_bcmfs
collect2: error: ld returned 1 exit status
gmake[5]: *** [/root/FreeBSD1201-64_K12.1_GCC7.3.0/x86_64-native-bsdapp-gcc+debug/353b3d4a62504426b49cf7e25db93dc5/dpdk/mk/rte.app.mk:457: test] Error 1
gmake[4]: *** [/root/FreeBSD1201-64_K12.1_GCC7.3.0/x86_64-native-bsdapp-gcc+debug/353b3d4a62504426b49cf7e25db93dc5/dpdk/mk/rte.subdir.mk:37: test] Error 2
gmake[3]: *** [/root/FreeBSD1201-64_K12.1_GCC7.3.0/x86_64-native-bsdapp-gcc+debug/353b3d4a62504426b49cf7e25db93dc5/dpdk/mk/rte.sdkbuild.mk:53: app] Error 2
gmake[2]: *** [/root/FreeBSD1201-64_K12.1_GCC7.3.0/x86_64-native-bsdapp-gcc+debug/353b3d4a62504426b49cf7e25db93dc5/dpdk/mk/rte.sdkroot.mk:115: all] Error 2
gmake[1]: *** [/root/FreeBSD1201-64_K12.1_GCC7.3.0/x86_64-native-bsdapp-gcc+debug/353b3d4a62504426b49cf7e25db93dc5/dpdk/mk/rte.sdkinstall.mk:61: pre_install] Error 2
gmake: *** [/root/FreeBSD1201-64_K12.1_GCC7.3.0/x86_64-native-bsdapp-gcc+debug/353b3d4a62504426b49cf7e25db93dc5/dpdk/mk/rte.sdkroot.mk:92: install] Error 2


*Makefile Build Failed #11:
OS: RHEL82-64
Target: x86_64-native-linuxapp-gcc
  CC flow_gen.o
  LD testsad
/usr/bin/ld: cannot find -lrte_pmd_bcmfs
collect2: error: ld returned 1 exit status
make[5]: *** [/root/RHEL82-64_K4.18.0_GCC8.3.1/x86_64-native-linuxapp-gcc/353b3d4a62504426b49cf7e25db93dc5/dpdk/mk/rte.app.mk:457: cmdline_test] Error 1
  LD testacl
make[4]: *** [/root/RHEL82-64_K4.18.0_GCC8.3.1/x86_64-native-linuxapp-gcc/353b3d4a62504426b49cf7e25db93dc5/dpdk/mk/rte.subdir.mk:37: test-cmdline] Error 2
make[4]: *** Waiting for unfinished jobs....
  LD dpdk-procinfo
  CC init.o
/usr/bin/ld: cannot find -lrte_pmd_bcmfs
collect2: error: ld returned 1 exit status
make[5]: *** [/root/RHEL82-64_K4.18.0_GCC8.3.1/x86_64-native-linuxapp-gcc/353b3d4a62504426b49cf7e25db93dc5/dpdk/mk/rte.app.mk:457: testsad] Error 1
make[4]: *** [/root/RHEL82-64_K4.18.0_GCC8.3.1/x86_64-native-linuxapp-gcc/353b3d4a62504426b49cf7e25db93dc5/dpdk/mk/rte.subdir.mk:37: test-sad] Error 2
  CC runtime.o
/usr/bin/ld: cannot find -lrte_pmd_bcmfs
collect2: error: ld returned 1 exit status
make[5]: *** [/root/RHEL82-64_K4.18.0_GCC8.3.1/x86_64-native-linuxapp-gcc/353b3d4a62504426b49cf7e25db93dc5/dpdk/mk/rte.app.mk:457: testacl] Error 1
make[4]: *** [/root/RHEL82-64_K4.18.0_GCC8.3.1/x86_64-native-linuxapp-gcc/353b3d4a62504426b49cf7e25db93dc5/dpdk/mk/rte.subdir.mk:37: test-acl] Error 2
  CC test.o
  CC items_gen.o
  LD dpdk-pdump
/usr/bin/ld: cannot find -lrte_pmd_bcmfs
collect2: error: ld returned 1 exit status
make[5]: *** [/root/RHEL82-64_K4.18.0_GCC8.3.1/x86_64-native-linuxapp-gcc/353b3d4a62504426b49cf7e25db93dc5/dpdk/mk/rte.app.mk:457: dpdk-procinfo] Error 1
make[4]: *** [/root/RHEL82-64_K4.18.0_GCC8.3.1/x86_64-native-linuxapp-gcc/353b3d4a62504426b49cf7e25db93dc5/dpdk/mk/rte.subdir.mk:37: proc-info] Error 2
  CC resource.o
  CC main.o
  CC pipeline_stub.o
--
  LD testfib
  CC pipeline_lpm_ipv6.o
/usr/bin/ld: cannot find -lrte_pmd_bcmfs
collect2: error: ld returned 1 exit status
make[5]: *** [/root/RHEL82-64_K4.18.0_GCC8.3.1/x86_64-native-linuxapp-gcc/353b3d4a62504426b49cf7e25db93dc5/dpdk/mk/rte.app.mk:457: dpdk-pdump] Error 1
make[4]: *** [/root/RHEL82-64_K4.18.0_GCC8.3.1/x86_64-native-linuxapp-gcc/353b3d4a62504426b49cf7e25db93dc5/dpdk/mk/rte.subdir.mk:37: pdump] Error 2
  CC parameters.o
  CC test_prefetch.o
  CC pipeline_acl.o
/usr/bin/ld: cannot find -lrte_pmd_bcmfs
collect2: error: ld returned 1 exit status
make[5]: *** [/root/RHEL82-64_K4.18.0_GCC8.3.1/x86_64-native-linuxapp-gcc/353b3d4a62504426b49cf7e25db93dc5/dpdk/mk/rte.app.mk:457: testfib] Error 1
make[4]: *** [/root/RHEL82-64_K4.18.0_GCC8.3.1/x86_64-native-linuxapp-gcc/353b3d4a62504426b49cf7e25db93dc5/dpdk/mk/rte.subdir.mk:37: test-fib] Error 2
  CC test_byteorder.o
  CC test_per_lcore.o
  CC test_atomic.o
--
  CC test_bitmap.o
  CC cmdline_tm.o
/usr/bin/ld: cannot find -lrte_pmd_bcmfs
collect2: error: ld returned 1 exit status
make[5]: *** [/root/RHEL82-64_K4.18.0_GCC8.3.1/x86_64-native-linuxapp-gcc/353b3d4a62504426b49cf7e25db93dc5/dpdk/mk/rte.app.mk:457: testpipeline] Error 1
make[4]: *** [/root/RHEL82-64_K4.18.0_GCC8.3.1/x86_64-native-linuxapp-gcc/353b3d4a62504426b49cf7e25db93dc5/dpdk/mk/rte.subdir.mk:37: test-pipeline] Error 2
  CC config.o
  CC test_bitops.o
/usr/bin/ld: cannot find -lrte_pmd_bcmfs
collect2: error: ld returned 1 exit status
make[5]: *** [/root/RHEL82-64_K4.18.0_GCC8.3.1/x86_64-native-linuxapp-gcc/353b3d4a62504426b49cf7e25db93dc5/dpdk/mk/rte.app.mk:457: dpdk-test-flow-perf] Error 1
make[4]: *** [/root/RHEL82-64_K4.18.0_GCC8.3.1/x86_64-native-linuxapp-gcc/353b3d4a62504426b49cf7e25db93dc5/dpdk/mk/rte.subdir.mk:37: test-flow-perf] Error 2
  CC iofwd.o
  CC test_reciprocal_division.o
  CC test_reciprocal_division_perf.o
--
  LD testpmd
  CC test_stack.o
/usr/bin/ld: cannot find -lrte_pmd_bcmfs
collect2: error: ld returned 1 exit status
make[5]: *** [/root/RHEL82-64_K4.18.0_GCC8.3.1/x86_64-native-linuxapp-gcc/353b3d4a62504426b49cf7e25db93dc5/dpdk/mk/rte.app.mk:457: testpmd] Error 1
make[4]: *** [/root/RHEL82-64_K4.18.0_GCC8.3.1/x86_64-native-linuxapp-gcc/353b3d4a62504426b49cf7e25db93dc5/dpdk/mk/rte.subdir.mk:37: test-pmd] Error 2
  CC test_stack_perf.o
  CC test_timer.o
  CC test_timer_perf.o
--
  MKRES test_resource_c.res.o
  LD test
/usr/bin/ld: cannot find -lrte_pmd_bcmfs
collect2: error: ld returned 1 exit status
make[5]: *** [/root/RHEL82-64_K4.18.0_GCC8.3.1/x86_64-native-linuxapp-gcc/353b3d4a62504426b49cf7e25db93dc5/dpdk/mk/rte.app.mk:457: test] Error 1
make[4]: *** [/root/RHEL82-64_K4.18.0_GCC8.3.1/x86_64-native-linuxapp-gcc/353b3d4a62504426b49cf7e25db93dc5/dpdk/mk/rte.subdir.mk:37: test] Error 2
make[3]: *** [/root/RHEL82-64_K4.18.0_GCC8.3.1/x86_64-native-linuxapp-gcc/353b3d4a62504426b49cf7e25db93dc5/dpdk/mk/rte.sdkbuild.mk:53: app] Error 2
make[2]: *** [/root/RHEL82-64_K4.18.0_GCC8.3.1/x86_64-native-linuxapp-gcc/353b3d4a62504426b49cf7e25db93dc5/dpdk/mk/rte.sdkroot.mk:115: all] Error 2
make[1]: *** [/root/RHEL82-64_K4.18.0_GCC8.3.1/x86_64-native-linuxapp-gcc/353b3d4a62504426b49cf7e25db93dc5/dpdk/mk/rte.sdkinstall.mk:61: pre_install] Error 2
make: *** [/root/RHEL82-64_K4.18.0_GCC8.3.1/x86_64-native-linuxapp-gcc/353b3d4a62504426b49cf7e25db93dc5/dpdk/mk/rte.sdkroot.mk:92: install] Error 2


*Makefile Build Failed #12:
OS: SUSE15-64
Target: x86_64-native-linuxapp-clang
  LD cmdline_test
  CC config.o
/usr/bin/ld: cannot find -lrte_pmd_bcmfs
clang-5.0.1: error: linker command failed with exit code 1 (use -v to see invocation)
make[5]: *** [/root/SUSE15-64_K4.12.14_Clang5.0.1/x86_64-native-linuxapp-clang/353b3d4a62504426b49cf7e25db93dc5/dpdk/mk/rte.app.mk:457: cmdline_test] Error 1
make[4]: *** [/root/SUSE15-64_K4.12.14_Clang5.0.1/x86_64-native-linuxapp-clang/353b3d4a62504426b49cf7e25db93dc5/dpdk/mk/rte.subdir.mk:37: test-cmdline] Error 2
make[4]: *** Waiting for unfinished jobs....
  CC test.o
  CC resource.o
--
  CC init.o
/usr/bin/ld: cannot find -lrte_pmd_bcmfs
  LD testsad
clang-5.0.1: error: linker command failed with exit code 1 (use -v to see invocation)
make[5]: *** [/root/SUSE15-64_K4.12.14_Clang5.0.1/x86_64-native-linuxapp-clang/353b3d4a62504426b49cf7e25db93dc5/dpdk/mk/rte.app.mk:457: dpdk-pdump] Error 1
make[4]: *** [/root/SUSE15-64_K4.12.14_Clang5.0.1/x86_64-native-linuxapp-clang/353b3d4a62504426b49cf7e25db93dc5/dpdk/mk/rte.subdir.mk:37: pdump] Error 2
  CC test_resource.o
/usr/bin/ld: cannot find -lrte_pmd_bcmfs
clang-5.0.1: error: linker command failed with exit code 1 (use -v to see invocation)
  LD dpdk-procinfo
make[5]: *** [/root/SUSE15-64_K4.12.14_Clang5.0.1/x86_64-native-linuxapp-clang/353b3d4a62504426b49cf7e25db93dc5/dpdk/mk/rte.app.mk:457: testacl] Error 1
make[4]: *** [/root/SUSE15-64_K4.12.14_Clang5.0.1/x86_64-native-linuxapp-clang/353b3d4a62504426b49cf7e25db93dc5/dpdk/mk/rte.subdir.mk:37: test-acl] Error 2
  CC runtime.o
/usr/bin/ld: cannot find -lrte_pmd_bcmfs
/usr/bin/ld: cannot find -lrte_pmd_bcmfs
  LD testfib
clang-5.0.1: error: linker command failed with exit code 1 (use -v to see invocation)
make[5]: *** [/root/SUSE15-64_K4.12.14_Clang5.0.1/x86_64-native-linuxapp-clang/353b3d4a62504426b49cf7e25db93dc5/dpdk/mk/rte.app.mk:457: testsad] Error 1
make[4]: *** [/root/SUSE15-64_K4.12.14_Clang5.0.1/x86_64-native-linuxapp-clang/353b3d4a62504426b49cf7e25db93dc5/dpdk/mk/rte.subdir.mk:37: test-sad] Error 2
  CC items_gen.o
clang-5.0.1: error: linker command failed with exit code 1 (use -v to see invocation)
make[5]: *** [/root/SUSE15-64_K4.12.14_Clang5.0.1/x86_64-native-linuxapp-clang/353b3d4a62504426b49cf7e25db93dc5/dpdk/mk/rte.app.mk:457: dpdk-procinfo] Error 1
make[4]: *** [/root/SUSE15-64_K4.12.14_Clang5.0.1/x86_64-native-linuxapp-clang/353b3d4a62504426b49cf7e25db93dc5/dpdk/mk/rte.subdir.mk:37: proc-info] Error 2
  CC parameters.o
  CC test_prefetch.o
  CC pipeline_stub.o
/usr/bin/ld: cannot find -lrte_pmd_bcmfs
clang-5.0.1: error: linker command failed with exit code 1 (use -v to see invocation)
make[5]: *** [/root/SUSE15-64_K4.12.14_Clang5.0.1/x86_64-native-linuxapp-clang/353b3d4a62504426b49cf7e25db93dc5/dpdk/mk/rte.app.mk:457: testfib] Error 1
make[4]: *** [/root/SUSE15-64_K4.12.14_Clang5.0.1/x86_64-native-linuxapp-clang/353b3d4a62504426b49cf7e25db93dc5/dpdk/mk/rte.subdir.mk:37: test-fib] Error 2
  CC cmdline.o
  CC test_byteorder.o
  CC main.o
--
  CC config.o
  LD testpipeline
/usr/bin/ld: cannot find -lrte_pmd_bcmfs
clang-5.0.1: error: linker command failed with exit code 1 (use -v to see invocation)
make[5]: *** [/root/SUSE15-64_K4.12.14_Clang5.0.1/x86_64-native-linuxapp-clang/353b3d4a62504426b49cf7e25db93dc5/dpdk/mk/rte.app.mk:457: testpipeline] Error 1
make[4]: *** [/root/SUSE15-64_K4.12.14_Clang5.0.1/x86_64-native-linuxapp-clang/353b3d4a62504426b49cf7e25db93dc5/dpdk/mk/rte.subdir.mk:37: test-pipeline] Error 2
  CC test_memzone.o
  CC test_bitmap.o
  LD dpdk-test-flow-perf
  CC iofwd.o
  CC test_bitops.o
/usr/bin/ld: cannot find -lrte_pmd_bcmfs
clang-5.0.1: error: linker command failed with exit code 1 (use -v to see invocation)
make[5]: *** [/root/SUSE15-64_K4.12.14_Clang5.0.1/x86_64-native-linuxapp-clang/353b3d4a62504426b49cf7e25db93dc5/dpdk/mk/rte.app.mk:457: dpdk-test-flow-perf] Error 1
make[4]: *** [/root/SUSE15-64_K4.12.14_Clang5.0.1/x86_64-native-linuxapp-clang/353b3d4a62504426b49cf7e25db93dc5/dpdk/mk/rte.subdir.mk:37: test-flow-perf] Error 2
  CC test_reciprocal_division.o
  CC macfwd.o
  CC test_reciprocal_division_perf.o
--
  LD testpmd
/usr/bin/ld: cannot find -lrte_pmd_bcmfs
  CC test_flow_classify.o
clang-5.0.1: error: linker command failed with exit code 1 (use -v to see invocation)
make[5]: *** [/root/SUSE15-64_K4.12.14_Clang5.0.1/x86_64-native-linuxapp-clang/353b3d4a62504426b49cf7e25db93dc5/dpdk/mk/rte.app.mk:457: testpmd] Error 1
make[4]: *** [/root/SUSE15-64_K4.12.14_Clang5.0.1/x86_64-native-linuxapp-clang/353b3d4a62504426b49cf7e25db93dc5/dpdk/mk/rte.subdir.mk:37: test-pmd] Error 2
  CC test_rwlock.o
  CC test_lcores.o
  CC test_stack.o
--
  MKRES test_resource_c.res.o
  LD test
/usr/bin/ld: cannot find -lrte_pmd_bcmfs
clang-5.0.1: error: linker command failed with exit code 1 (use -v to see invocation)
make[5]: *** [/root/SUSE15-64_K4.12.14_Clang5.0.1/x86_64-native-linuxapp-clang/353b3d4a62504426b49cf7e25db93dc5/dpdk/mk/rte.app.mk:457: test] Error 1
make[4]: *** [/root/SUSE15-64_K4.12.14_Clang5.0.1/x86_64-native-linuxapp-clang/353b3d4a62504426b49cf7e25db93dc5/dpdk/mk/rte.subdir.mk:37: test] Error 2
make[3]: *** [/root/SUSE15-64_K4.12.14_Clang5.0.1/x86_64-native-linuxapp-clang/353b3d4a62504426b49cf7e25db93dc5/dpdk/mk/rte.sdkbuild.mk:53: app] Error 2
make[2]: *** [/root/SUSE15-64_K4.12.14_Clang5.0.1/x86_64-native-linuxapp-clang/353b3d4a62504426b49cf7e25db93dc5/dpdk/mk/rte.sdkroot.mk:115: all] Error 2
make[1]: *** [/root/SUSE15-64_K4.12.14_Clang5.0.1/x86_64-native-linuxapp-clang/353b3d4a62504426b49cf7e25db93dc5/dpdk/mk/rte.sdkinstall.mk:61: pre_install] Error 2
make: *** [/root/SUSE15-64_K4.12.14_Clang5.0.1/x86_64-native-linuxapp-clang/353b3d4a62504426b49cf7e25db93dc5/dpdk/mk/rte.sdkroot.mk:92: install] Error 2


*Makefile Build Failed #13:
OS: SUSE15-64
Target: x86_64-native-linuxapp-gcc
  LD dpdk-procinfo
  CC config.o
/usr/lib64/gcc/x86_64-suse-linux/7/../../../../x86_64-suse-linux/bin/ld: cannot find -lrte_pmd_bcmfs
collect2: error: ld returned 1 exit status
make[5]: *** [/root/SUSE15-64_K4.12.14_GCC7.3.1/x86_64-native-linuxapp-gcc/353b3d4a62504426b49cf7e25db93dc5/dpdk/mk/rte.app.mk:457: testacl] Error 1
make[4]: *** [/root/SUSE15-64_K4.12.14_GCC7.3.1/x86_64-native-linuxapp-gcc/353b3d4a62504426b49cf7e25db93dc5/dpdk/mk/rte.subdir.mk:35: test-acl] Error 2
make[4]: *** Waiting for unfinished jobs....
  LD dpdk-pdump
  CC items_gen.o
/usr/lib64/gcc/x86_64-suse-linux/7/../../../../x86_64-suse-linux/bin/ld: cannot find -lrte_pmd_bcmfs
collect2: error: ld returned 1 exit status
make[5]: *** [/root/SUSE15-64_K4.12.14_GCC7.3.1/x86_64-native-linuxapp-gcc/353b3d4a62504426b49cf7e25db93dc5/dpdk/mk/rte.app.mk:457: dpdk-procinfo] Error 1
make[4]: *** [/root/SUSE15-64_K4.12.14_GCC7.3.1/x86_64-native-linuxapp-gcc/353b3d4a62504426b49cf7e25db93dc5/dpdk/mk/rte.subdir.mk:35: proc-info] Error 2
  CC main.o
/usr/lib64/gcc/x86_64-suse-linux/7/../../../../x86_64-suse-linux/bin/ld: cannot find -lrte_pmd_bcmfs
collect2: error: ld returned 1 exit status
make[5]: *** [/root/SUSE15-64_K4.12.14_GCC7.3.1/x86_64-native-linuxapp-gcc/353b3d4a62504426b49cf7e25db93dc5/dpdk/mk/rte.app.mk:457: cmdline_test] Error 1
make[4]: *** [/root/SUSE15-64_K4.12.14_GCC7.3.1/x86_64-native-linuxapp-gcc/353b3d4a62504426b49cf7e25db93dc5/dpdk/mk/rte.subdir.mk:35: test-cmdline] Error 2
  CC init.o
/usr/lib64/gcc/x86_64-suse-linux/7/../../../../x86_64-suse-linux/bin/ld: cannot find -lrte_pmd_bcmfs
collect2: error: ld returned 1 exit status
make[5]: *** [/root/SUSE15-64_K4.12.14_GCC7.3.1/x86_64-native-linuxapp-gcc/353b3d4a62504426b49cf7e25db93dc5/dpdk/mk/rte.app.mk:457: dpdk-pdump] Error 1
  CC test.o
make[4]: *** [/root/SUSE15-64_K4.12.14_GCC7.3.1/x86_64-native-linuxapp-gcc/353b3d4a62504426b49cf7e25db93dc5/dpdk/mk/rte.subdir.mk:35: pdump] Error 2
  CC runtime.o
  LD testsad
  CC pipeline_stub.o
  CC pipeline_hash.o
  CC resource.o
/usr/lib64/gcc/x86_64-suse-linux/7/../../../../x86_64-suse-linux/bin/ld: cannot find -lrte_pmd_bcmfs
collect2: error: ld returned 1 exit status
make[5]: *** [/root/SUSE15-64_K4.12.14_GCC7.3.1/x86_64-native-linuxapp-gcc/353b3d4a62504426b49cf7e25db93dc5/dpdk/mk/rte.app.mk:457: testsad] Error 1
  CC test_resource.o
make[4]: *** [/root/SUSE15-64_K4.12.14_GCC7.3.1/x86_64-native-linuxapp-gcc/353b3d4a62504426b49cf7e25db93dc5/dpdk/mk/rte.subdir.mk:35: test-sad] Error 2
  LD testfib
  CC test_prefetch.o
  CC pipeline_lpm.o
  CC test_byteorder.o
  CC test_per_lcore.o
/usr/lib64/gcc/x86_64-suse-linux/7/../../../../x86_64-suse-linux/bin/ld: cannot find -lrte_pmd_bcmfs
collect2: error: ld returned 1 exit status
make[5]: *** [/root/SUSE15-64_K4.12.14_GCC7.3.1/x86_64-native-linuxapp-gcc/353b3d4a62504426b49cf7e25db93dc5/dpdk/mk/rte.app.mk:457: testfib] Error 1
make[4]: *** [/root/SUSE15-64_K4.12.14_GCC7.3.1/x86_64-native-linuxapp-gcc/353b3d4a62504426b49cf7e25db93dc5/dpdk/mk/rte.subdir.mk:35: test-fib] Error 2
  CC test_atomic.o
  CC pipeline_lpm_ipv6.o
  CC pipeline_acl.o
--
  CC test_bitmap.o
  CC test_bitops.o
/usr/lib64/gcc/x86_64-suse-linux/7/../../../../x86_64-suse-linux/bin/ld: cannot find -lrte_pmd_bcmfs
collect2: error: ld returned 1 exit status
make[5]: *** [/root/SUSE15-64_K4.12.14_GCC7.3.1/x86_64-native-linuxapp-gcc/353b3d4a62504426b49cf7e25db93dc5/dpdk/mk/rte.app.mk:457: dpdk-test-flow-perf] Error 1
make[4]: *** [/root/SUSE15-64_K4.12.14_GCC7.3.1/x86_64-native-linuxapp-gcc/353b3d4a62504426b49cf7e25db93dc5/dpdk/mk/rte.subdir.mk:35: test-flow-perf] Error 2
  CC test_reciprocal_division.o
  CC parameters.o
  CC test_reciprocal_division_perf.o
  CC test_fbarray.o
  CC cmdline.o
/usr/lib64/gcc/x86_64-suse-linux/7/../../../../x86_64-suse-linux/bin/ld: cannot find -lrte_pmd_bcmfs
collect2: error: ld returned 1 exit status
make[5]: *** [/root/SUSE15-64_K4.12.14_GCC7.3.1/x86_64-native-linuxapp-gcc/353b3d4a62504426b49cf7e25db93dc5/dpdk/mk/rte.app.mk:457: testpipeline] Error 1
make[4]: *** [/root/SUSE15-64_K4.12.14_GCC7.3.1/x86_64-native-linuxapp-gcc/353b3d4a62504426b49cf7e25db93dc5/dpdk/mk/rte.subdir.mk:35: test-pipeline] Error 2
  CC cmdline_flow.o
  CC test_external_mem.o
  CC test_rand_perf.o
--
  CC test_hash_readwrite_lf_perf.o
  CC test_rib.o
/usr/lib64/gcc/x86_64-suse-linux/7/../../../../x86_64-suse-linux/bin/ld: cannot find -lrte_pmd_bcmfs
collect2: error: ld returned 1 exit status
make[5]: *** [/root/SUSE15-64_K4.12.14_GCC7.3.1/x86_64-native-linuxapp-gcc/353b3d4a62504426b49cf7e25db93dc5/dpdk/mk/rte.app.mk:457: testpmd] Error 1
make[4]: *** [/root/SUSE15-64_K4.12.14_GCC7.3.1/x86_64-native-linuxapp-gcc/353b3d4a62504426b49cf7e25db93dc5/dpdk/mk/rte.subdir.mk:35: test-pmd] Error 2
  CC test_rib6.o
  CC test_fib.o
  CC test_fib6.o
--
  MKRES test_resource_c.res.o
  LD test
/usr/lib64/gcc/x86_64-suse-linux/7/../../../../x86_64-suse-linux/bin/ld: cannot find -lrte_pmd_bcmfs
collect2: error: ld returned 1 exit status
make[5]: *** [/root/SUSE15-64_K4.12.14_GCC7.3.1/x86_64-native-linuxapp-gcc/353b3d4a62504426b49cf7e25db93dc5/dpdk/mk/rte.app.mk:457: test] Error 1
make[4]: *** [/root/SUSE15-64_K4.12.14_GCC7.3.1/x86_64-native-linuxapp-gcc/353b3d4a62504426b49cf7e25db93dc5/dpdk/mk/rte.subdir.mk:35: test] Error 2
make[3]: *** [/root/SUSE15-64_K4.12.14_GCC7.3.1/x86_64-native-linuxapp-gcc/353b3d4a62504426b49cf7e25db93dc5/dpdk/mk/rte.sdkbuild.mk:53: app] Error 2
make[2]: *** [/root/SUSE15-64_K4.12.14_GCC7.3.1/x86_64-native-linuxapp-gcc/353b3d4a62504426b49cf7e25db93dc5/dpdk/mk/rte.sdkroot.mk:115: all] Error 2
make[1]: *** [/root/SUSE15-64_K4.12.14_GCC7.3.1/x86_64-native-linuxapp-gcc/353b3d4a62504426b49cf7e25db93dc5/dpdk/mk/rte.sdkinstall.mk:61: pre_install] Error 2
make: *** [/root/SUSE15-64_K4.12.14_GCC7.3.1/x86_64-native-linuxapp-gcc/353b3d4a62504426b49cf7e25db93dc5/dpdk/mk/rte.sdkroot.mk:92: install] Error 2


*Makefile Build Failed #14:
OS: UB1804-64
Target: x86_64-native-linuxapp-gcc
  LD testacl
  CC test.o
/usr/bin/ld: cannot find -lrte_pmd_bcmfs
collect2: error: ld returned 1 exit status
/usr/bin/ld: cannot find -lrte_pmd_bcmfs
/root/UB1804-64_K4.15.0_GCC7.3.0/x86_64-native-linuxapp-gcc/353b3d4a62504426b49cf7e25db93dc5/dpdk/mk/rte.app.mk:455: recipe for target 'cmdline_test' failed
make[5]: *** [cmdline_test] Error 1
/root/UB1804-64_K4.15.0_GCC7.3.0/x86_64-native-linuxapp-gcc/353b3d4a62504426b49cf7e25db93dc5/dpdk/mk/rte.subdir.mk:35: recipe for target 'test-cmdline' failed
make[4]: *** [test-cmdline] Error 2
make[4]: *** Waiting for unfinished jobs....
collect2: error: ld returned 1 exit status
/root/UB1804-64_K4.15.0_GCC7.3.0/x86_64-native-linuxapp-gcc/353b3d4a62504426b49cf7e25db93dc5/dpdk/mk/rte.app.mk:455: recipe for target 'dpdk-procinfo' failed
make[5]: *** [dpdk-procinfo] Error 1
/root/UB1804-64_K4.15.0_GCC7.3.0/x86_64-native-linuxapp-gcc/353b3d4a62504426b49cf7e25db93dc5/dpdk/mk/rte.subdir.mk:35: recipe for target 'proc-info' failed
make[4]: *** [proc-info] Error 2
  CC items_gen.o
  CC init.o
/usr/bin/ld: cannot find -lrte_pmd_bcmfs
collect2: error: ld returned 1 exit status
/root/UB1804-64_K4.15.0_GCC7.3.0/x86_64-native-linuxapp-gcc/353b3d4a62504426b49cf7e25db93dc5/dpdk/mk/rte.app.mk:455: recipe for target 'testsad' failed
make[5]: *** [testsad] Error 1
/root/UB1804-64_K4.15.0_GCC7.3.0/x86_64-native-linuxapp-gcc/353b3d4a62504426b49cf7e25db93dc5/dpdk/mk/rte.subdir.mk:35: recipe for target 'test-sad' failed
make[4]: *** [test-sad] Error 2
  LD dpdk-pdump
  CC runtime.o
/usr/bin/ld: cannot find -lrte_pmd_bcmfs
collect2: error: ld returned 1 exit status
  CC resource.o
  CC main.o
/root/UB1804-64_K4.15.0_GCC7.3.0/x86_64-native-linuxapp-gcc/353b3d4a62504426b49cf7e25db93dc5/dpdk/mk/rte.app.mk:455: recipe for target 'testacl' failed
make[5]: *** [testacl] Error 1
/root/UB1804-64_K4.15.0_GCC7.3.0/x86_64-native-linuxapp-gcc/353b3d4a62504426b49cf7e25db93dc5/dpdk/mk/rte.subdir.mk:35: recipe for target 'test-acl' failed
make[4]: *** [test-acl] Error 2
  CC parameters.o
  CC pipeline_stub.o
  CC test_resource.o
/usr/bin/ld: cannot find -lrte_pmd_bcmfs
collect2: error: ld returned 1 exit status
/root/UB1804-64_K4.15.0_GCC7.3.0/x86_64-native-linuxapp-gcc/353b3d4a62504426b49cf7e25db93dc5/dpdk/mk/rte.app.mk:455: recipe for target 'dpdk-pdump' failed
make[5]: *** [dpdk-pdump] Error 1
/root/UB1804-64_K4.15.0_GCC7.3.0/x86_64-native-linuxapp-gcc/353b3d4a62504426b49cf7e25db93dc5/dpdk/mk/rte.subdir.mk:35: recipe for target 'pdump' failed
make[4]: *** [pdump] Error 2
  LD testfib
  CC test_prefetch.o
  CC test_byteorder.o
--
  CC pipeline_lpm.o
  CC test_malloc.o
/usr/bin/ld: cannot find -lrte_pmd_bcmfs
collect2: error: ld returned 1 exit status
/root/UB1804-64_K4.15.0_GCC7.3.0/x86_64-native-linuxapp-gcc/353b3d4a62504426b49cf7e25db93dc5/dpdk/mk/rte.app.mk:455: recipe for target 'testfib' failed
make[5]: *** [testfib] Error 1
/root/UB1804-64_K4.15.0_GCC7.3.0/x86_64-native-linuxapp-gcc/353b3d4a62504426b49cf7e25db93dc5/dpdk/mk/rte.subdir.mk:35: recipe for target 'test-fib' failed
make[4]: *** [test-fib] Error 2
  CC cmdline.o
  CC test_cycles.o
  CC pipeline_lpm_ipv6.o
--
  CC cmdline_mtr.o
  CC test_memory.o
/usr/bin/ld: cannot find -lrte_pmd_bcmfs
collect2: error: ld returned 1 exit status
/root/UB1804-64_K4.15.0_GCC7.3.0/x86_64-native-linuxapp-gcc/353b3d4a62504426b49cf7e25db93dc5/dpdk/mk/rte.app.mk:455: recipe for target 'dpdk-test-flow-perf' failed
make[5]: *** [dpdk-test-flow-perf] Error 1
/root/UB1804-64_K4.15.0_GCC7.3.0/x86_64-native-linuxapp-gcc/353b3d4a62504426b49cf7e25db93dc5/dpdk/mk/rte.subdir.mk:35: recipe for target 'test-flow-perf' failed
make[4]: *** [test-flow-perf] Error 2
  CC test_memzone.o
  CC cmdline_tm.o
  CC config.o
--
  CC test_fbarray.o
  CC macfwd.o
/usr/bin/ld: cannot find -lrte_pmd_bcmfs
collect2: error: ld returned 1 exit status
/root/UB1804-64_K4.15.0_GCC7.3.0/x86_64-native-linuxapp-gcc/353b3d4a62504426b49cf7e25db93dc5/dpdk/mk/rte.app.mk:455: recipe for target 'testpipeline' failed
make[5]: *** [testpipeline] Error 1
/root/UB1804-64_K4.15.0_GCC7.3.0/x86_64-native-linuxapp-gcc/353b3d4a62504426b49cf7e25db93dc5/dpdk/mk/rte.subdir.mk:35: recipe for target 'test-pipeline' failed
make[4]: *** [test-pipeline] Error 2
  CC macswap.o
  CC test_external_mem.o
  CC test_rand_perf.o
--
  CC test_mbuf.o
  CC test_logs.o
/usr/bin/ld: cannot find -lrte_pmd_bcmfs
collect2: error: ld returned 1 exit status
/root/UB1804-64_K4.15.0_GCC7.3.0/x86_64-native-linuxapp-gcc/353b3d4a62504426b49cf7e25db93dc5/dpdk/mk/rte.app.mk:455: recipe for target 'testpmd' failed
make[5]: *** [testpmd] Error 1
/root/UB1804-64_K4.15.0_GCC7.3.0/x86_64-native-linuxapp-gcc/353b3d4a62504426b49cf7e25db93dc5/dpdk/mk/rte.subdir.mk:35: recipe for target 'test-pmd' failed
make[4]: *** [test-pmd] Error 2
  CC test_memcpy.o
  CC test_memcpy_perf.o
  CC test_member.o
--
  MKRES test_resource_c.res.o
  LD test
/usr/bin/ld: cannot find -lrte_pmd_bcmfs
collect2: error: ld returned 1 exit status
/root/UB1804-64_K4.15.0_GCC7.3.0/x86_64-native-linuxapp-gcc/353b3d4a62504426b49cf7e25db93dc5/dpdk/mk/rte.app.mk:455: recipe for target 'test' failed
make[5]: *** [test] Error 1
/root/UB1804-64_K4.15.0_GCC7.3.0/x86_64-native-linuxapp-gcc/353b3d4a62504426b49cf7e25db93dc5/dpdk/mk/rte.subdir.mk:35: recipe for target 'test' failed
make[4]: *** [test] Error 2
/root/UB1804-64_K4.15.0_GCC7.3.0/x86_64-native-linuxapp-gcc/353b3d4a62504426b49cf7e25db93dc5/dpdk/mk/rte.sdkbuild.mk:51: recipe for target 'app' failed
make[3]: *** [app] Error 2
/root/UB1804-64_K4.15.0_GCC7.3.0/x86_64-native-linuxapp-gcc/353b3d4a62504426b49cf7e25db93dc5/dpdk/mk/rte.sdkroot.mk:113: recipe for target 'all' failed
make[2]: *** [all] Error 2
/root/UB1804-64_K4.15.0_GCC7.3.0/x86_64-native-linuxapp-gcc/353b3d4a62504426b49cf7e25db93dc5/dpdk/mk/rte.sdkinstall.mk:60: recipe for target 'pre_install' failed
make[1]: *** [pre_install] Error 2
/root/UB1804-64_K4.15.0_GCC7.3.0/x86_64-native-linuxapp-gcc/353b3d4a62504426b49cf7e25db93dc5/dpdk/mk/rte.sdkroot.mk:92: recipe for target 'install' failed
make: *** [install] Error 2


*Makefile Build Failed #15:
OS: UB2004-32
Target: i686-native-linuxapp-gcc
  LD cmdline_test
  LD testacl
/usr/bin/ld: cannot find -lrte_pmd_bcmfs
collect2: error: ld returned 1 exit status
make[5]: *** [/root/UB2004-32_K4.15.0_GCC9.3.0/i686-native-linuxapp-gcc/353b3d4a62504426b49cf7e25db93dc5/dpdk/mk/rte.app.mk:457: dpdk-procinfo] Error 1
make[4]: *** [/root/UB2004-32_K4.15.0_GCC9.3.0/i686-native-linuxapp-gcc/353b3d4a62504426b49cf7e25db93dc5/dpdk/mk/rte.subdir.mk:37: proc-info] Error 2
make[4]: *** Waiting for unfinished jobs....
  CC flow_gen.o
  CC test_resource.o
  CC config.o
/usr/bin/ld: cannot find -lrte_pmd_bcmfs
collect2: error: ld returned 1 exit status
make[5]: *** [/root/UB2004-32_K4.15.0_GCC9.3.0/i686-native-linuxapp-gcc/353b3d4a62504426b49cf7e25db93dc5/dpdk/mk/rte.app.mk:457: cmdline_test] Error 1
make[4]: *** [/root/UB2004-32_K4.15.0_GCC9.3.0/i686-native-linuxapp-gcc/353b3d4a62504426b49cf7e25db93dc5/dpdk/mk/rte.subdir.mk:37: test-cmdline] Error 2
  CC test_prefetch.o
  CC items_gen.o
  CC test_byteorder.o
  LD testfib
  LD testsad
/usr/bin/ld: cannot find -lrte_pmd_bcmfs
collect2: error: ld returned 1 exit status
make[5]: *** [/root/UB2004-32_K4.15.0_GCC9.3.0/i686-native-linuxapp-gcc/353b3d4a62504426b49cf7e25db93dc5/dpdk/mk/rte.app.mk:457: testacl] Error 1
make[4]: *** [/root/UB2004-32_K4.15.0_GCC9.3.0/i686-native-linuxapp-gcc/353b3d4a62504426b49cf7e25db93dc5/dpdk/mk/rte.subdir.mk:37: test-acl] Error 2
  CC main.o
  CC test_per_lcore.o
  CC test_atomic.o
--
  CC test_barrier.o
/usr/bin/ld: cannot find -lrte_pmd_bcmfs
/usr/bin/ld: cannot find -lrte_pmd_bcmfs
collect2: error: ld returned 1 exit status
make[5]: *** [/root/UB2004-32_K4.15.0_GCC9.3.0/i686-native-linuxapp-gcc/353b3d4a62504426b49cf7e25db93dc5/dpdk/mk/rte.app.mk:457: testsad] Error 1
collect2: error: ld returned 1 exit status
make[4]: *** [/root/UB2004-32_K4.15.0_GCC9.3.0/i686-native-linuxapp-gcc/353b3d4a62504426b49cf7e25db93dc5/dpdk/mk/rte.subdir.mk:37: test-sad] Error 2
make[5]: *** [/root/UB2004-32_K4.15.0_GCC9.3.0/i686-native-linuxapp-gcc/353b3d4a62504426b49cf7e25db93dc5/dpdk/mk/rte.app.mk:457: testfib] Error 1
make[4]: *** [/root/UB2004-32_K4.15.0_GCC9.3.0/i686-native-linuxapp-gcc/353b3d4a62504426b49cf7e25db93dc5/dpdk/mk/rte.subdir.mk:37: test-fib] Error 2
  CC parameters.o
  CC test_malloc.o
  CC init.o
  CC runtime.o
  CC test_cycles.o
/usr/bin/ld: cannot find -lrte_pmd_bcmfs
collect2: error: ld returned 1 exit status
make[5]: *** [/root/UB2004-32_K4.15.0_GCC9.3.0/i686-native-linuxapp-gcc/353b3d4a62504426b49cf7e25db93dc5/dpdk/mk/rte.app.mk:457: dpdk-pdump] Error 1
make[4]: *** [/root/UB2004-32_K4.15.0_GCC9.3.0/i686-native-linuxapp-gcc/353b3d4a62504426b49cf7e25db93dc5/dpdk/mk/rte.subdir.mk:37: pdump] Error 2
  CC test_mcslock.o
  CC test_spinlock.o
  CC test_ticketlock.o
--
  CC test_ring_mpmc_stress.o
  CC test_ring_hts_stress.o
/usr/bin/ld: cannot find -lrte_pmd_bcmfs
collect2: error: ld returned 1 exit status
make[5]: *** [/root/UB2004-32_K4.15.0_GCC9.3.0/i686-native-linuxapp-gcc/353b3d4a62504426b49cf7e25db93dc5/dpdk/mk/rte.app.mk:457: dpdk-test-flow-perf] Error 1
make[4]: *** [/root/UB2004-32_K4.15.0_GCC9.3.0/i686-native-linuxapp-gcc/353b3d4a62504426b49cf7e25db93dc5/dpdk/mk/rte.subdir.mk:37: test-flow-perf] Error 2
  CC test_ring_perf.o
  CC pipeline_lpm.o
  CC test_ring_mt_peek_stress.o
--
  LD testpipeline
  CC test_table_tables.o
/usr/bin/ld: cannot find -lrte_pmd_bcmfs
collect2: error: ld returned 1 exit status
make[5]: *** [/root/UB2004-32_K4.15.0_GCC9.3.0/i686-native-linuxapp-gcc/353b3d4a62504426b49cf7e25db93dc5/dpdk/mk/rte.app.mk:457: testpipeline] Error 1
make[4]: *** [/root/UB2004-32_K4.15.0_GCC9.3.0/i686-native-linuxapp-gcc/353b3d4a62504426b49cf7e25db93dc5/dpdk/mk/rte.subdir.mk:37: test-pipeline] Error 2
  CC cmdline_tm.o
  CC test_table_ports.o
  CC test_table_combined.o
--
  CC test_cpuflags.o
  CC test_mp_secondary.o
/usr/bin/ld: cannot find -lrte_pmd_bcmfs
collect2: error: ld returned 1 exit status
make[5]: *** [/root/UB2004-32_K4.15.0_GCC9.3.0/i686-native-linuxapp-gcc/353b3d4a62504426b49cf7e25db93dc5/dpdk/mk/rte.app.mk:457: testpmd] Error 1
make[4]: *** [/root/UB2004-32_K4.15.0_GCC9.3.0/i686-native-linuxapp-gcc/353b3d4a62504426b49cf7e25db93dc5/dpdk/mk/rte.subdir.mk:37: test-pmd] Error 2
  CC test_eal_flags.o
  CC test_eal_fs.o
  CC test_alarm.o
--
  MKRES test_resource_c.res.o
  LD test
/usr/bin/ld: cannot find -lrte_pmd_bcmfs
collect2: error: ld returned 1 exit status
make[5]: *** [/root/UB2004-32_K4.15.0_GCC9.3.0/i686-native-linuxapp-gcc/353b3d4a62504426b49cf7e25db93dc5/dpdk/mk/rte.app.mk:457: test] Error 1
make[4]: *** [/root/UB2004-32_K4.15.0_GCC9.3.0/i686-native-linuxapp-gcc/353b3d4a62504426b49cf7e25db93dc5/dpdk/mk/rte.subdir.mk:37: test] Error 2
make[3]: *** [/root/UB2004-32_K4.15.0_GCC9.3.0/i686-native-linuxapp-gcc/353b3d4a62504426b49cf7e25db93dc5/dpdk/mk/rte.sdkbuild.mk:53: app] Error 2
make[2]: *** [/root/UB2004-32_K4.15.0_GCC9.3.0/i686-native-linuxapp-gcc/353b3d4a62504426b49cf7e25db93dc5/dpdk/mk/rte.sdkroot.mk:115: all] Error 2
make[1]: *** [/root/UB2004-32_K4.15.0_GCC9.3.0/i686-native-linuxapp-gcc/353b3d4a62504426b49cf7e25db93dc5/dpdk/mk/rte.sdkinstall.mk:61: pre_install] Error 2
make: *** [/root/UB2004-32_K4.15.0_GCC9.3.0/i686-native-linuxapp-gcc/353b3d4a62504426b49cf7e25db93dc5/dpdk/mk/rte.sdkroot.mk:92: install] Error 2


*Makefile Build Failed #16:
OS: UB2004-64
Target: x86_64-native-linuxapp-clang
  LD dpdk-pdump
/usr/bin/ld: cannot find -lrte_pmd_bcmfs
  LD testacl
clang: error: linker command failed with exit code 1 (use -v to see invocation)
make[5]: *** [/root/UB2004-64_K5.4.0_Clang10.0.0/x86_64-native-linuxapp-clang/353b3d4a62504426b49cf7e25db93dc5/dpdk/mk/rte.app.mk:457: cmdline_test] Error 1
make[4]: *** [/root/UB2004-64_K5.4.0_Clang10.0.0/x86_64-native-linuxapp-clang/353b3d4a62504426b49cf7e25db93dc5/dpdk/mk/rte.subdir.mk:37: test-cmdline] Error 2
make[4]: *** Waiting for unfinished jobs....
  CC items_gen.o
  CC test.o
--
/usr/bin/ld: cannot find -lrte_pmd_bcmfs
  CC config.o
/usr/bin/ld: cannot find -lrte_pmd_bcmfs
clang: error: linker command failed with exit code 1 (use -v to see invocation)
make[5]: *** [/root/UB2004-64_K5.4.0_Clang10.0.0/x86_64-native-linuxapp-clang/353b3d4a62504426b49cf7e25db93dc5/dpdk/mk/rte.app.mk:457: dpdk-procinfo] Error 1
make[4]: *** [/root/UB2004-64_K5.4.0_Clang10.0.0/x86_64-native-linuxapp-clang/353b3d4a62504426b49cf7e25db93dc5/dpdk/mk/rte.subdir.mk:37: proc-info] Error 2
  CC resource.o
clang: error: linker command failed with exit code 1 (use -v to see invocation)
make[5]: *** [/root/UB2004-64_K5.4.0_Clang10.0.0/x86_64-native-linuxapp-clang/353b3d4a62504426b49cf7e25db93dc5/dpdk/mk/rte.app.mk:457: testsad] Error 1
make[4]: *** [/root/UB2004-64_K5.4.0_Clang10.0.0/x86_64-native-linuxapp-clang/353b3d4a62504426b49cf7e25db93dc5/dpdk/mk/rte.subdir.mk:37: test-sad] Error 2
clang: error: linker command failed with exit code 1 (use -v to see invocation)
  CC init.o
/usr/bin/ld: cannot find -lrte_pmd_bcmfs
make[5]: *** [/root/UB2004-64_K5.4.0_Clang10.0.0/x86_64-native-linuxapp-clang/353b3d4a62504426b49cf7e25db93dc5/dpdk/mk/rte.app.mk:457: dpdk-pdump] Error 1
make[4]: *** [/root/UB2004-64_K5.4.0_Clang10.0.0/x86_64-native-linuxapp-clang/353b3d4a62504426b49cf7e25db93dc5/dpdk/mk/rte.subdir.mk:37: pdump] Error 2
  CC main.o
clang: error: linker command failed with exit code 1 (use -v to see invocation)
make[5]: *** [/root/UB2004-64_K5.4.0_Clang10.0.0/x86_64-native-linuxapp-clang/353b3d4a62504426b49cf7e25db93dc5/dpdk/mk/rte.app.mk:457: testacl] Error 1
make[4]: *** [/root/UB2004-64_K5.4.0_Clang10.0.0/x86_64-native-linuxapp-clang/353b3d4a62504426b49cf7e25db93dc5/dpdk/mk/rte.subdir.mk:37: test-acl] Error 2
  CC test_resource.o
  CC test_prefetch.o
  CC test_byteorder.o
--
  CC test_barrier.o
/usr/bin/ld: cannot find -lrte_pmd_bcmfs
  CC test_malloc.o
clang: error: linker command failed with exit code 1 (use -v to see invocation)
make[5]: *** [/root/UB2004-64_K5.4.0_Clang10.0.0/x86_64-native-linuxapp-clang/353b3d4a62504426b49cf7e25db93dc5/dpdk/mk/rte.app.mk:457: testfib] Error 1
make[4]: *** [/root/UB2004-64_K5.4.0_Clang10.0.0/x86_64-native-linuxapp-clang/353b3d4a62504426b49cf7e25db93dc5/dpdk/mk/rte.subdir.mk:37: test-fib] Error 2
  CC parameters.o
  CC pipeline_hash.o
  CC pipeline_lpm.o
--
  CC test_bitmap.o
/usr/bin/ld: cannot find -lrte_pmd_bcmfs
  CC test_bitops.o
clang: error: linker command failed with exit code 1 (use -v to see invocation)
make[5]: *** [/root/UB2004-64_K5.4.0_Clang10.0.0/x86_64-native-linuxapp-clang/353b3d4a62504426b49cf7e25db93dc5/dpdk/mk/rte.app.mk:457: dpdk-test-flow-perf] Error 1
make[4]: *** [/root/UB2004-64_K5.4.0_Clang10.0.0/x86_64-native-linuxapp-clang/353b3d4a62504426b49cf7e25db93dc5/dpdk/mk/rte.subdir.mk:37: test-flow-perf] Error 2
  CC test_reciprocal_division.o
  CC cmdline_flow.o
  CC test_reciprocal_division_perf.o
--
  CC test_ring_perf.o
  CC test_ring_mt_peek_stress.o
/usr/bin/ld: cannot find -lrte_pmd_bcmfs
clang: error: linker command failed with exit code 1 (use -v to see invocation)
make[5]: *** [/root/UB2004-64_K5.4.0_Clang10.0.0/x86_64-native-linuxapp-clang/353b3d4a62504426b49cf7e25db93dc5/dpdk/mk/rte.app.mk:457: testpipeline] Error 1
make[4]: *** [/root/UB2004-64_K5.4.0_Clang10.0.0/x86_64-native-linuxapp-clang/353b3d4a62504426b49cf7e25db93dc5/dpdk/mk/rte.subdir.mk:37: test-pipeline] Error 2
  CC config.o
  CC test_ring_rts_stress.o
  CC iofwd.o
--
  LD testpmd
/usr/bin/ld: cannot find -lrte_pmd_bcmfs
  CC test_hash_perf.o
clang: error: linker command failed with exit code 1 (use -v to see invocation)
make[5]: *** [/root/UB2004-64_K5.4.0_Clang10.0.0/x86_64-native-linuxapp-clang/353b3d4a62504426b49cf7e25db93dc5/dpdk/mk/rte.app.mk:457: testpmd] Error 1
make[4]: *** [/root/UB2004-64_K5.4.0_Clang10.0.0/x86_64-native-linuxapp-clang/353b3d4a62504426b49cf7e25db93dc5/dpdk/mk/rte.subdir.mk:37: test-pmd] Error 2
  CC test_hash_functions.o
  CC test_hash_multiwriter.o
  CC test_hash_readwrite.o
--
  MKRES test_resource_c.res.o
  LD test
/usr/bin/ld: cannot find -lrte_pmd_bcmfs
clang: error: linker command failed with exit code 1 (use -v to see invocation)
make[5]: *** [/root/UB2004-64_K5.4.0_Clang10.0.0/x86_64-native-linuxapp-clang/353b3d4a62504426b49cf7e25db93dc5/dpdk/mk/rte.app.mk:457: test] Error 1
make[4]: *** [/root/UB2004-64_K5.4.0_Clang10.0.0/x86_64-native-linuxapp-clang/353b3d4a62504426b49cf7e25db93dc5/dpdk/mk/rte.subdir.mk:37: test] Error 2
make[3]: *** [/root/UB2004-64_K5.4.0_Clang10.0.0/x86_64-native-linuxapp-clang/353b3d4a62504426b49cf7e25db93dc5/dpdk/mk/rte.sdkbuild.mk:53: app] Error 2
make[2]: *** [/root/UB2004-64_K5.4.0_Clang10.0.0/x86_64-native-linuxapp-clang/353b3d4a62504426b49cf7e25db93dc5/dpdk/mk/rte.sdkroot.mk:115: all] Error 2
make[1]: *** [/root/UB2004-64_K5.4.0_Clang10.0.0/x86_64-native-linuxapp-clang/353b3d4a62504426b49cf7e25db93dc5/dpdk/mk/rte.sdkinstall.mk:61: pre_install] Error 2
make: *** [/root/UB2004-64_K5.4.0_Clang10.0.0/x86_64-native-linuxapp-clang/353b3d4a62504426b49cf7e25db93dc5/dpdk/mk/rte.sdkroot.mk:92: install] Error 2


*Makefile Build Failed #17:
OS: UB2004-64
Target: x86_64-native-linuxapp-gcc
/usr/bin/ld: cannot find -lrte_pmd_bcmfs
/usr/bin/ld: cannot find -lrte_pmd_bcmfs
  LD dpdk-pdump
collect2: error: ld returned 1 exit status
make[5]: *** [/root/UB2004-64_K5.4.0_GCC9.3.0/x86_64-native-linuxapp-gcc/353b3d4a62504426b49cf7e25db93dc5/dpdk/mk/rte.app.mk:457: cmdline_test] Error 1
make[4]: *** [/root/UB2004-64_K5.4.0_GCC9.3.0/x86_64-native-linuxapp-gcc/353b3d4a62504426b49cf7e25db93dc5/dpdk/mk/rte.subdir.mk:35: test-cmdline] Error 2
make[4]: *** Waiting for unfinished jobs....
/usr/bin/ld: cannot find -lrte_pmd_bcmfs
  CC resource.o
collect2: error: ld returned 1 exit status
collect2: error: ld returned 1 exit status
make[5]: *** [/root/UB2004-64_K5.4.0_GCC9.3.0/x86_64-native-linuxapp-gcc/353b3d4a62504426b49cf7e25db93dc5/dpdk/mk/rte.app.mk:457: testacl] Error 1
make[4]: *** [/root/UB2004-64_K5.4.0_GCC9.3.0/x86_64-native-linuxapp-gcc/353b3d4a62504426b49cf7e25db93dc5/dpdk/mk/rte.subdir.mk:35: test-acl] Error 2
make[5]: *** [/root/UB2004-64_K5.4.0_GCC9.3.0/x86_64-native-linuxapp-gcc/353b3d4a62504426b49cf7e25db93dc5/dpdk/mk/rte.app.mk:457: testsad] Error 1
make[4]: *** [/root/UB2004-64_K5.4.0_GCC9.3.0/x86_64-native-linuxapp-gcc/353b3d4a62504426b49cf7e25db93dc5/dpdk/mk/rte.subdir.mk:35: test-sad] Error 2
  CC test_resource.o
  CC items_gen.o
collect2: error: ld returned 1 exit status
make[5]: *** [/root/UB2004-64_K5.4.0_GCC9.3.0/x86_64-native-linuxapp-gcc/353b3d4a62504426b49cf7e25db93dc5/dpdk/mk/rte.app.mk:457: dpdk-procinfo] Error 1
make[4]: *** [/root/UB2004-64_K5.4.0_GCC9.3.0/x86_64-native-linuxapp-gcc/353b3d4a62504426b49cf7e25db93dc5/dpdk/mk/rte.subdir.mk:35: proc-info] Error 2
  CC test_prefetch.o
  CC main.o
  CC test_byteorder.o
  CC init.o
/usr/bin/ld: cannot find -lrte_pmd_bcmfs
  CC test_per_lcore.o
collect2: error: ld returned 1 exit status
make[5]: *** [/root/UB2004-64_K5.4.0_GCC9.3.0/x86_64-native-linuxapp-gcc/353b3d4a62504426b49cf7e25db93dc5/dpdk/mk/rte.app.mk:457: dpdk-pdump] Error 1
make[4]: *** [/root/UB2004-64_K5.4.0_GCC9.3.0/x86_64-native-linuxapp-gcc/353b3d4a62504426b49cf7e25db93dc5/dpdk/mk/rte.subdir.mk:35: pdump] Error 2
  CC test_atomic.o
  CC test_barrier.o
  CC test_malloc.o
--
/usr/bin/ld: cannot find -lrte_pmd_bcmfs
  CC test_reciprocal_division_perf.o
  CC test_fbarray.o
collect2: error: ld returned 1 exit status
make[5]: *** [/root/UB2004-64_K5.4.0_GCC9.3.0/x86_64-native-linuxapp-gcc/353b3d4a62504426b49cf7e25db93dc5/dpdk/mk/rte.app.mk:457: testfib] Error 1
make[4]: *** [/root/UB2004-64_K5.4.0_GCC9.3.0/x86_64-native-linuxapp-gcc/353b3d4a62504426b49cf7e25db93dc5/dpdk/mk/rte.subdir.mk:35: test-fib] Error 2
  CC pipeline_hash.o
  LD dpdk-test-flow-perf
  CC test_external_mem.o
--
  CC pipeline_lpm_ipv6.o
  CC test_ring_perf.o
  CC parameters.o
collect2: error: ld returned 1 exit status
make[5]: *** [/root/UB2004-64_K5.4.0_GCC9.3.0/x86_64-native-linuxapp-gcc/353b3d4a62504426b49cf7e25db93dc5/dpdk/mk/rte.app.mk:457: dpdk-test-flow-perf] Error 1
make[4]: *** [/root/UB2004-64_K5.4.0_GCC9.3.0/x86_64-native-linuxapp-gcc/353b3d4a62504426b49cf7e25db93dc5/dpdk/mk/rte.subdir.mk:35: test-flow-perf] Error 2
  CC test_ring_mt_peek_stress.o
  CC pipeline_acl.o
  CC test_ring_rts_stress.o
--
  CC cmdline_mtr.o
  CC test_table_pipeline.o
  CC cmdline_tm.o
collect2: error: ld returned 1 exit status
make[5]: *** [/root/UB2004-64_K5.4.0_GCC9.3.0/x86_64-native-linuxapp-gcc/353b3d4a62504426b49cf7e25db93dc5/dpdk/mk/rte.app.mk:457: testpipeline] Error 1
make[4]: *** [/root/UB2004-64_K5.4.0_GCC9.3.0/x86_64-native-linuxapp-gcc/353b3d4a62504426b49cf7e25db93dc5/dpdk/mk/rte.subdir.mk:35: test-pipeline] Error 2
  CC config.o
  CC test_table_tables.o
  CC test_table_ports.o
--
  CC test_rib6.o
/usr/bin/ld: cannot find -lrte_pmd_bcmfs
  CC test_fib.o
collect2: error: ld returned 1 exit status
make[5]: *** [/root/UB2004-64_K5.4.0_GCC9.3.0/x86_64-native-linuxapp-gcc/353b3d4a62504426b49cf7e25db93dc5/dpdk/mk/rte.app.mk:457: testpmd] Error 1
make[4]: *** [/root/UB2004-64_K5.4.0_GCC9.3.0/x86_64-native-linuxapp-gcc/353b3d4a62504426b49cf7e25db93dc5/dpdk/mk/rte.subdir.mk:35: test-pmd] Error 2
  CC test_fib6.o
  CC test_fib_perf.o
  CC test_fib6_perf.o
--
  MKRES test_resource_c.res.o
  LD test
/usr/bin/ld: cannot find -lrte_pmd_bcmfs
collect2: error: ld returned 1 exit status
make[5]: *** [/root/UB2004-64_K5.4.0_GCC9.3.0/x86_64-native-linuxapp-gcc/353b3d4a62504426b49cf7e25db93dc5/dpdk/mk/rte.app.mk:457: test] Error 1
make[4]: *** [/root/UB2004-64_K5.4.0_GCC9.3.0/x86_64-native-linuxapp-gcc/353b3d4a62504426b49cf7e25db93dc5/dpdk/mk/rte.subdir.mk:35: test] Error 2
make[3]: *** [/root/UB2004-64_K5.4.0_GCC9.3.0/x86_64-native-linuxapp-gcc/353b3d4a62504426b49cf7e25db93dc5/dpdk/mk/rte.sdkbuild.mk:53: app] Error 2
make[2]: *** [/root/UB2004-64_K5.4.0_GCC9.3.0/x86_64-native-linuxapp-gcc/353b3d4a62504426b49cf7e25db93dc5/dpdk/mk/rte.sdkroot.mk:115: all] Error 2
make[1]: *** [/root/UB2004-64_K5.4.0_GCC9.3.0/x86_64-native-linuxapp-gcc/353b3d4a62504426b49cf7e25db93dc5/dpdk/mk/rte.sdkinstall.mk:61: pre_install] Error 2
make: *** [/root/UB2004-64_K5.4.0_GCC9.3.0/x86_64-native-linuxapp-gcc/353b3d4a62504426b49cf7e25db93dc5/dpdk/mk/rte.sdkroot.mk:92: install] Error 2


*Makefile Build Failed #18:
OS: UB2004-64
Target: x86_64-native-linuxapp-icc
  CC items_gen.o
ld: cannot find -lrte_pmd_bcmfs
  CC resource.o
make[5]: *** [/root/UB2004-64_K5.4.0_ICC19.1.0/x86_64-native-linuxapp-icc/353b3d4a62504426b49cf7e25db93dc5/dpdk/mk/rte.app.mk:457: testsad] Error 1
make[4]: *** [/root/UB2004-64_K5.4.0_ICC19.1.0/x86_64-native-linuxapp-icc/353b3d4a62504426b49cf7e25db93dc5/dpdk/mk/rte.subdir.mk:37: test-sad] Error 2
make[4]: *** Waiting for unfinished jobs....
  CC main.o
ld: cannot find -lrte_pmd_bcmfs
ld: cannot find -lrte_pmd_bcmfs
  CC test_resource.o
  CC runtime.o
make[5]: *** [/root/UB2004-64_K5.4.0_ICC19.1.0/x86_64-native-linuxapp-icc/353b3d4a62504426b49cf7e25db93dc5/dpdk/mk/rte.app.mk:457: testacl] Error 1
make[4]: *** [/root/UB2004-64_K5.4.0_ICC19.1.0/x86_64-native-linuxapp-icc/353b3d4a62504426b49cf7e25db93dc5/dpdk/mk/rte.subdir.mk:37: test-acl] Error 2
  CC test_prefetch.o
ld: cannot find -lrte_pmd_bcmfs
make[5]: *** [/root/UB2004-64_K5.4.0_ICC19.1.0/x86_64-native-linuxapp-icc/353b3d4a62504426b49cf7e25db93dc5/dpdk/mk/rte.app.mk:457: dpdk-procinfo] Error 1
make[4]: *** [/root/UB2004-64_K5.4.0_ICC19.1.0/x86_64-native-linuxapp-icc/353b3d4a62504426b49cf7e25db93dc5/dpdk/mk/rte.subdir.mk:37: proc-info] Error 2
  CC test_byteorder.o
make[5]: *** [/root/UB2004-64_K5.4.0_ICC19.1.0/x86_64-native-linuxapp-icc/353b3d4a62504426b49cf7e25db93dc5/dpdk/mk/rte.app.mk:457: cmdline_test] Error 1
make[4]: *** [/root/UB2004-64_K5.4.0_ICC19.1.0/x86_64-native-linuxapp-icc/353b3d4a62504426b49cf7e25db93dc5/dpdk/mk/rte.subdir.mk:37: test-cmdline] Error 2
  CC test_per_lcore.o
  CC test_atomic.o
  LD testfib
--
  CC test_mcslock.o
ld: cannot find -lrte_pmd_bcmfs
  CC test_spinlock.o
make[5]: *** [/root/UB2004-64_K5.4.0_ICC19.1.0/x86_64-native-linuxapp-icc/353b3d4a62504426b49cf7e25db93dc5/dpdk/mk/rte.app.mk:457: testfib] Error 1
  CC test_ticketlock.o
make[4]: *** [/root/UB2004-64_K5.4.0_ICC19.1.0/x86_64-native-linuxapp-icc/353b3d4a62504426b49cf7e25db93dc5/dpdk/mk/rte.subdir.mk:37: test-fib] Error 2
  CC parameters.o
  CC test_memory.o
  CC pipeline_stub.o
--
  CC test_external_mem.o
  CC test_rand_perf.o
ld: cannot find -lrte_pmd_bcmfs
make[5]: *** [/root/UB2004-64_K5.4.0_ICC19.1.0/x86_64-native-linuxapp-icc/353b3d4a62504426b49cf7e25db93dc5/dpdk/mk/rte.app.mk:457: dpdk-test-flow-perf] Error 1
make[4]: *** [/root/UB2004-64_K5.4.0_ICC19.1.0/x86_64-native-linuxapp-icc/353b3d4a62504426b49cf7e25db93dc5/dpdk/mk/rte.subdir.mk:37: test-flow-perf] Error 2
  CC test_ring.o
  CC test_ring_mpmc_stress.o
  CC test_ring_hts_stress.o
--
  CC test_table.o
  CC test_table_pipeline.o
ld: cannot find -lrte_pmd_bcmfs
make[5]: *** [/root/UB2004-64_K5.4.0_ICC19.1.0/x86_64-native-linuxapp-icc/353b3d4a62504426b49cf7e25db93dc5/dpdk/mk/rte.app.mk:457: dpdk-pdump] Error 1
make[4]: *** [/root/UB2004-64_K5.4.0_ICC19.1.0/x86_64-native-linuxapp-icc/353b3d4a62504426b49cf7e25db93dc5/dpdk/mk/rte.subdir.mk:37: pdump] Error 2
  CC cmdline_mtr.o
  LD testpipeline
  CC test_table_tables.o
--
  CC cmdline_tm.o
  CC config.o
ld: cannot find -lrte_pmd_bcmfs
make[5]: *** [/root/UB2004-64_K5.4.0_ICC19.1.0/x86_64-native-linuxapp-icc/353b3d4a62504426b49cf7e25db93dc5/dpdk/mk/rte.app.mk:457: testpipeline] Error 1
make[4]: *** [/root/UB2004-64_K5.4.0_ICC19.1.0/x86_64-native-linuxapp-icc/353b3d4a62504426b49cf7e25db93dc5/dpdk/mk/rte.subdir.mk:37: test-pipeline] Error 2
  CC iofwd.o
  CC test_table_combined.o
  CC test_table_acl.o
--
  CC test_hash_functions.o
  CC test_hash_multiwriter.o
ld: cannot find -lrte_pmd_bcmfs
make[5]: *** [/root/UB2004-64_K5.4.0_ICC19.1.0/x86_64-native-linuxapp-icc/353b3d4a62504426b49cf7e25db93dc5/dpdk/mk/rte.app.mk:457: testpmd] Error 1
make[4]: *** [/root/UB2004-64_K5.4.0_ICC19.1.0/x86_64-native-linuxapp-icc/353b3d4a62504426b49cf7e25db93dc5/dpdk/mk/rte.subdir.mk:37: test-pmd] Error 2
  CC test_hash_readwrite.o
  CC test_hash_readwrite_lf_perf.o
  CC test_rib.o
--
  MKRES test_resource_c.res.o
  LD test
ld: cannot find -lrte_pmd_bcmfs
make[5]: *** [/root/UB2004-64_K5.4.0_ICC19.1.0/x86_64-native-linuxapp-icc/353b3d4a62504426b49cf7e25db93dc5/dpdk/mk/rte.app.mk:457: test] Error 1
make[4]: *** [/root/UB2004-64_K5.4.0_ICC19.1.0/x86_64-native-linuxapp-icc/353b3d4a62504426b49cf7e25db93dc5/dpdk/mk/rte.subdir.mk:37: test] Error 2
make[3]: *** [/root/UB2004-64_K5.4.0_ICC19.1.0/x86_64-native-linuxapp-icc/353b3d4a62504426b49cf7e25db93dc5/dpdk/mk/rte.sdkbuild.mk:53: app] Error 2
make[2]: *** [/root/UB2004-64_K5.4.0_ICC19.1.0/x86_64-native-linuxapp-icc/353b3d4a62504426b49cf7e25db93dc5/dpdk/mk/rte.sdkroot.mk:115: all] Error 2
make[1]: *** [/root/UB2004-64_K5.4.0_ICC19.1.0/x86_64-native-linuxapp-icc/353b3d4a62504426b49cf7e25db93dc5/dpdk/mk/rte.sdkinstall.mk:61: pre_install] Error 2
make: *** [/root/UB2004-64_K5.4.0_ICC19.1.0/x86_64-native-linuxapp-icc/353b3d4a62504426b49cf7e25db93dc5/dpdk/mk/rte.sdkroot.mk:92: install] Error 2
DPDK STV team


More information about the test-report mailing list