[dpdk-test-report] |FAILURE| pw75850 [PATCH] pci/linux: copy new id for inserted device

dpdklab at iol.unh.edu dpdklab at iol.unh.edu
Sat Aug 22 00:28:14 CEST 2020


Test-Label: Performance-Testing
Test-Status: FAILURE
http://dpdk.org/patch/75850

_build patch failure_

Submitter: Jim Harris <james.r.harris at intel.com>
Date: Friday, August 21 2020 22:06:50 
Applied on: CommitID:cd6f1d7a5fde76c4f1e771de9f7aafdf59d691e4
Apply patch set 75850 failed:


=========================== WARNING ============================
It is recommended to build DPDK using 'meson' and 'ninja'
See https://doc.dpdk.org/guides/linux_gsg/build_dpdk.html
Building DPDK with 'make' will be deprecated in a future release
================================================================

Configuration done using x86_64-native-linuxapp-gcc

=========================== WARNING ============================
It is recommended to build DPDK using 'meson' and 'ninja'
See https://doc.dpdk.org/guides/linux_gsg/build_dpdk.html
Building DPDK with 'make' will be deprecated in a future release
================================================================

== Build lib
== Build lib/librte_kvargs
== Build lib/librte_telemetry
== Build lib/librte_eal
/home-local/jenkins-local/jenkins-agent/workspace/Apply-Custom-Patch-Set/dpdk/mk/toolchain/gcc/rte.toolchain-compat.mk:30: AVX512 support disabled because of binutils 2.30. See Bug 97
== Build lib/librte_eal/include
== Build lib/librte_eal/linux
== Build lib/librte_pci
== Build lib/librte_ring
== Build lib/librte_stack
== Build lib/librte_mempool
== Build lib/librte_mbuf
== Build lib/librte_timer
== Build lib/librte_cfgfile
== Build lib/librte_net
== Build lib/librte_cmdline
== Build lib/librte_meter
== Build lib/librte_ethdev
== Build lib/librte_bbdev
== Build lib/librte_cryptodev
== Build lib/librte_security
== Build lib/librte_compressdev
== Build lib/librte_regexdev
== Build lib/librte_hash
== Build lib/librte_eventdev
== Build lib/librte_rawdev
== Build lib/librte_vhost
== Build lib/librte_efd
== Build lib/librte_rib
== Build lib/librte_fib
== Build lib/librte_rcu
== Build lib/librte_lpm
== Build lib/librte_acl
== Build lib/librte_member
== Build lib/librte_ip_frag
== Build lib/librte_gro
== Build lib/librte_jobstats
== Build lib/librte_metrics
== Build lib/librte_bitratestats
== Build lib/librte_latencystats
== Build lib/librte_power
== Build lib/librte_sched
== Build lib/librte_kni
== Build lib/librte_port
== Build lib/librte_table
== Build lib/librte_flow_classify
== Build lib/librte_distributor
== Build lib/librte_pipeline
== Build lib/librte_reorder
== Build lib/librte_pdump
== Build lib/librte_gso
== Build lib/librte_bpf
== Build lib/librte_ipsec
== Build lib/librte_graph
== Build lib/librte_node
== Build buildtools
== Build buildtools/pmdinfogen
== Build kernel
== Build kernel/linux
== Build drivers
== Build drivers/common
== Build drivers/common/cpt
== Build drivers/common/octeontx
== Build drivers/common/octeontx2
== Build drivers/common/dpaax
== Build drivers/common/iavf
== Build drivers/bus
== Build drivers/bus/dpaa
== Build drivers/bus/fslmc
== Build drivers/bus/ifpga
== Build drivers/bus/pci
  CC linux/pci.o
In file included from /home-local/jenkins-local/jenkins-agent/workspace/Apply-Custom-Patch-Set/dpdk/drivers/bus/pci/linux/pci.c:8:0:
/home-local/jenkins-local/jenkins-agent/workspace/Apply-Custom-Patch-Set/dpdk/drivers/bus/pci/linux/pci.c: In function ‘pci_scan_one’:
/home-local/jenkins-local/jenkins-agent/workspace/Apply-Custom-Patch-Set/dpdk/x86_64-native-linuxapp-gcc/include/rte_log.h:350:3: error: expected ‘)’ before ‘rte_log’
   rte_log(RTE_LOG_ ## l,     \
   ^
/home-local/jenkins-local/jenkins-agent/workspace/Apply-Custom-Patch-Set/dpdk/drivers/bus/pci/linux/pci.c:381:7: note: in expansion of macro ‘RTE_LOG’
       RTE_LOG(ERR, EAL, "Unexpected device scan at %s!\n",
       ^~~~~~~
/home-local/jenkins-local/jenkins-agent/workspace/Apply-Custom-Patch-Set/dpdk/drivers/bus/pci/linux/pci.c:388:5: error: expected expression before ‘}’ token
     }
     ^
/home-local/jenkins-local/jenkins-agent/workspace/Apply-Custom-Patch-Set/dpdk/drivers/bus/pci/linux/pci.c: At top level:
cc1: error: unrecognized command line option ‘-Wno-address-of-packed-member’ [-Werror]
cc1: all warnings being treated as errors
/home-local/jenkins-local/jenkins-agent/workspace/Apply-Custom-Patch-Set/dpdk/mk/internal/rte.compile-pre.mk:114: recipe for target 'linux/pci.o' failed
make[6]: *** [linux/pci.o] Error 1
/home-local/jenkins-local/jenkins-agent/workspace/Apply-Custom-Patch-Set/dpdk/mk/rte.subdir.mk:35: recipe for target 'pci' failed
make[5]: *** [pci] Error 2
/home-local/jenkins-local/jenkins-agent/workspace/Apply-Custom-Patch-Set/dpdk/mk/rte.subdir.mk:35: recipe for target 'bus' failed
make[4]: *** [bus] Error 2
/home-local/jenkins-local/jenkins-agent/workspace/Apply-Custom-Patch-Set/dpdk/mk/rte.sdkbuild.mk:51: recipe for target 'drivers' failed
make[3]: *** [drivers] Error 2
/home-local/jenkins-local/jenkins-agent/workspace/Apply-Custom-Patch-Set/dpdk/mk/rte.sdkroot.mk:113: recipe for target 'all' failed
make[2]: *** [all] Error 2
/home-local/jenkins-local/jenkins-agent/workspace/Apply-Custom-Patch-Set/dpdk/mk/rte.sdkinstall.mk:60: recipe for target 'pre_install' failed
make[1]: *** [pre_install] Error 2
/home-local/jenkins-local/jenkins-agent/workspace/Apply-Custom-Patch-Set/dpdk/mk/rte.sdkroot.mk:92: recipe for target 'install' failed
make: *** [install] Error 2

https://lab.dpdk.org/results/dashboard/patchsets/12675/

UNH-IOL DPDK Community Lab


More information about the test-report mailing list