[dpdk-test-report] |FAILURE| pw64324[v2] net/axgbe: add a HW quirk for register definitions

sys_stv at intel.com sys_stv at intel.com
Thu Jan 9 08:35:56 CET 2020


Test-Label: Intel-compilation
Test-Status: FAILURE
http://dpdk.org/patch/64324

_Compilation issues_

Submitter: Selwin Sebastian <selwin.sebastian at amd.com>
Date: 2020-01-09 12:39:37
Reply_mail: 20200109123937.10658-1-Selwin.Sebastian at amd.com
DPDK git baseline: Repo:dpdk-next-net, CommitID: c60f2c8041ab075a2c3dec5432350637cf8eb3db

Makefile build Summary: 23 Builds Done, 21 Successful, 2 Failures

Meson build Summary: 8 Builds Done, 3 Successful, 5 Failures

               +==============================================+===========+==========+
               |                   Makefile                   |   Meson   | Document |
+----------------+------+-------+------+------------+-----------+-----------+----------+
| os             | gcc  | clang | icc  | gcc+shared | gcc+debug | gcc/clang | pdf/html |
+----------------+------+-------+------+------------+-----------+-----------+----------+
| RHEL80-64      | pass |       |      |            |           |           |          |
| UB1804-64      | pass | pass  | pass |            |           | FAIL      | pass     |
| UB1604-32      | pass |       |      |            |           | FAIL      |          |
| CENTOS77-64    | pass | pass  | pass | FAIL       | pass      | FAIL      |          |
| UB1604-64      | pass | pass  |      |            |           |           |          |
| FC30-64        | FAIL |       |      |            |           |           |          |
| WIN10-64       |      |       |      |            |           | pass      |          |
| UB1910-64      | pass |       |      |            |           |           |          |
| FC31-64        | pass | pass  |      |            |           | FAIL      |          |
| CENTOS80-64    | pass |       |      |            |           |           |          |
| FreeBSD1201-64 | pass | pass  |      | FAIL       | pass      | pass      |          |
| RHEL77-64      | pass |       |      |            |           |           |          |
| SUSE15-64      | pass | pass  |      |            |           | FAIL      |          |
+----------------+------+-------+------+------------+-----------+-----------+----------+

Test environment and configuration as below:

** Makefile build **


OS: UB1804-64
	Kernel Version: 4.15.0-20-generic
	CPU info: Intel(R) Xeon(R) CPU E5-2699 v3 @ 2.30GHz
	GCC Version: gcc (Ubuntu 7.3.0-16ubuntu3) 7.3.0
	Clang Version: 6.0.0-1ubuntu2 (tags/RELEASE_600/final)
	x86_64-native-linuxapp-clang
	x86_64-native-linuxapp-icc
	x86_64-native-linuxapp-gcc


OS: UB1604-32
	Kernel Version: 4.4.0-131-generic
	CPU info: Intel(R) Xeon(R) CPU E5-2699 v3 @ 2.30GHz
	GCC Version: gcc (Ubuntu 5.4.0-6ubuntu1~16.04.11) 5.4.0 20160609
	Clang Version: 3.8.0-2ubuntu4 (tags/RELEASE_380/final)
	i686-native-linuxapp-gcc


OS: CENTOS77-64
	Kernel Version: 3.10.0-1062.9.1.el7.x86_64
	CPU info: Intel(R) Xeon(R) CPU E5-2699 v4 @ 2.20GHz
	GCC Version: gcc (GCC) 4.8.5 20150623 (Red Hat 4.8.5-39)
	Clang Version: 3.4.2 (tags/RELEASE_34/dot2-final)
	x86_64-native-linuxapp-gcc+shared
	x86_64-native-linuxapp-gcc
	x86_64-native-linuxapp-clang
	x86_64-native-linuxapp-gcc+debug
	x86_64-native-linuxapp-icc


OS: UB1910-64
	Kernel Version: 5.3.0-18-generic
	CPU info: Intel(R) Xeon(R) CPU E5-2699 v3 @ 2.30GHz
	GCC Version: gcc (Ubuntu 9.2.1-9ubuntu2) 9.2.1 20191008
	Clang Version: 9.0.0-2 (tags/RELEASE_900/final)
	x86_64-native-linuxapp-gcc


OS: CENTOS80-64
	Kernel Version: 4.18.0-80.11.2.el8_0.x86_64
	CPU info: Intel(R) Xeon(R) CPU E5-2699 v4 @ 2.20GHz
	GCC Version: gcc (GCC) 8.2.1 20180905 (Red Hat 8.2.1-3)
	Clang Version: 7.0.1 (tags/RELEASE_701/final)
	x86_64-native-linuxapp-gcc


OS: UB1604-64
	Kernel Version: 4.4.0-170-generic
	CPU info: Intel(R) Xeon(R) CPU E5-2699 v3 @ 2.30GHz
	GCC Version: gcc (Ubuntu 5.4.0-6ubuntu1~16.04.12) 5.4.0 20160609
	Clang Version: 3.8.0-2ubuntu4 (tags/RELEASE_380/final)
	x86_64-native-linuxapp-clang
	x86_64-native-linuxapp-gcc


OS: FC31-64
	Kernel Version: 5.3.15-300.fc31.x86_64
	CPU info: Intel(R) Xeon(R) CPU E5-2699 v4 @ 2.20GHz
	GCC Version: gcc (GCC) 9.2.1 20190827 (Red Hat 9.2.1-1)
	Clang Version: 9.0.0 (Fedora 9.0.0-1.fc31)
	x86_64-native-linuxapp-gcc
	x86_64-native-linuxapp-clang


OS: RHEL80-64
	Kernel Version: 4.18.0-80.el8.x86_64
	CPU info: Intel(R) Xeon(R) CPU E5-2699 v4 @ 2.20GHz
	GCC Version: gcc (GCC) 8.2.1 20180905 (Red Hat 8.2.1-3)
	Clang Version: 6.0.1 (tags/RELEASE_601/final)
	x86_64-native-linuxapp-gcc


OS: FreeBSD1201-64
	Kernel Version: 12.1-RELEASE
	CPU info: Intel(R) Xeon(R) CPU E5-2699 v4 @ 2.20GHz (2194.98-MHz K8-class CPU)
	GCC Version: gcc (FreeBSD Ports Collection) 9.2.0
	Clang Version: 8.0.1 (tags/RELEASE_801/final 366581) (based on LLVM 8.0.1)
	x86_64-native-bsdapp-gcc+shared
	x86_64-native-bsdapp-gcc+debug
	x86_64-native-bsdapp-clang
	x86_64-native-bsdapp-gcc


OS: RHEL77-64
	Kernel Version: 3.10.0-1062.9.1.el7.x86_64
	CPU info: Intel(R) Xeon(R) CPU E5-2699 v4 @ 2.20GHz
	GCC Version: gcc (GCC) 4.8.5 20150623 (Red Hat 4.8.5-39)
	Clang Version: 3.4.2 (tags/RELEASE_34/dot2-final)
	x86_64-native-linuxapp-gcc


OS: SUSE15-64
	Kernel Version: 4.12.14-lp150.11-default
	CPU info: Intel(R) Xeon(R) CPU E5-2699 v4 @ 2.20GHz
	GCC Version: gcc (SUSE Linux) 7.3.1 20180323 [gcc-7-branch revision 258812]
	Clang Version: 5.0.1 (tags/RELEASE_501/final 312548)
	x86_64-native-linuxapp-gcc
	x86_64-native-linuxapp-clang


** Meson build **


OS: UB1804-64
	Kernel Version: 4.15.0-20-generic
	CPU info: Intel(R) Xeon(R) CPU E5-2699 v4 @ 2.20GHz
	GCC Version: gcc (Ubuntu 7.3.0-27ubuntu1~18.04) 7.3.0
	Clang Version: 6.0.0-1ubuntu2 (tags/RELEASE_600/final)
	x86_64-native-linuxapp-doc
	./build-gcc-static
	./build-gcc-shared
	./build-clang-static
	./build-clang-shared
	./build-x86-default


OS: UB1604-32
	Kernel Version: 4.4.0-131-generic
	CPU info: Intel(R) Xeon(R) CPU E5-2699 v4 @ 2.20GHz
	GCC Version: gcc (Ubuntu 5.4.0-6ubuntu1~16.04.11) 5.4.0 20160609
	Clang Version: 3.8.0-2ubuntu4 (tags/RELEASE_380/final)
	./build-gcc-static
	./build-gcc-shared
	./build-clang-static
	./build-clang-shared
	./build-x86-default


OS: CENTOS77-64
	Kernel Version: 3.10.0-1062.9.1.el7.x86_64
	CPU info: Intel(R) Xeon(R) CPU E5-2699 v4 @ 2.20GHz
	GCC Version: gcc (GCC) 4.8.5 20150623 (Red Hat 4.8.5-39)
	Clang Version: 3.4.2 (tags/RELEASE_34/dot2-final)
	./build-gcc-static
	./build-gcc-shared
	./build-clang-static
	./build-clang-shared
	./build-x86-default


OS: WIN10-64
	Kernel Version: N/A
	CPU info: N/A
	GCC Version: N/A
	Clang Version: Clang 8.0.0
	x86_64-windows-clang


OS: FC31-64
	Kernel Version: 5.3.14-300.fc31.x86_64
	CPU info: Intel(R) Xeon(R) CPU E5-2699 v4 @ 2.20GHz
	GCC Version: gcc (GCC) 9.2.1 20190827 (Red Hat 9.2.1-1)
	Clang Version: 9.0.0 (Fedora 9.0.0-1.fc31)
	./build-gcc-static
	./build-gcc-shared
	./build-clang-static
	./build-clang-shared
	./build-x86-default


OS: FreeBSD1201-64
	Kernel Version: 12.1-RELEASE
	CPU info: Intel(R) Xeon(R) CPU E5-2699 v4 @ 2.20GHz (2194.97-MHz K8-class CPU)
	GCC Version: gcc (FreeBSD Ports Collection) 9.2.0
	Clang Version: 8.0.1 (tags/RELEASE_801/final 366581) (based on LLVM 8.0.1)
	./build-gcc-static
	./build-gcc-shared
	./build-clang-static
	./build-clang-shared
	./build-x86-default


OS: SUSE15-64
	Kernel Version: 4.12.14-lp150.11-default
	CPU info: Intel(R) Xeon(R) CPU E5-2699 v4 @ 2.20GHz
	GCC Version: gcc (SUSE Linux) 7.3.1 20180323 [gcc-7-branch revision 258812]
	Clang Version: 5.0.1 (tags/RELEASE_501/final 312548)
	./build-gcc-static
	./build-gcc-shared
	./build-clang-static
	./build-clang-shared
	./build-x86-default


*Make Build Failed #1:
OS: CENTOS77-64
Target: x86_64-native-linuxapp-gcc+shared
  LD librte_pmd_axgbe.so.20.0.1
  CC otx_cryptodev_mbox.o
axgbe_ethdev.o: In function `eth_axgbe_dev_init.part.4':
axgbe_ethdev.c:(.text.unlikely+0x41): undefined reference to `rte_pci_bus'
collect2: error: ld returned 1 exit status
make[6]: *** [librte_pmd_axgbe.so.20.0.1] Error 1
  PMDINFO cxgbe_ethdev.o.pmd.c
make[5]: *** [axgbe] Error 2
make[5]: *** Waiting for unfinished jobs....
  CC cxgbe_ethdev.o.pmd.o
== Build drivers/crypto/octeontx2
  LD cxgbe_ethdev.o
  CC ark_rqp.o
--
  LD librte_pmd_openssl.so.20.0.1
  CC virtio_rxtx.o
  CC scheduler_roundrobin.o
  INSTALL-LIB librte_pmd_octeontx_crypto.so.20.0.1
  INSTALL-LIB librte_pmd_bnx2x.so.20.0.1
make[4]: *** [net] Error 2
make[4]: *** Waiting for unfinished jobs....
  CC scheduler_pkt_size_distr.o
  CC scheduler_failover.o
  INSTALL-LIB librte_pmd_openssl.so.20.0.1
  CC scheduler_multicore.o
--
  LD dpaa_sec.o
  LD librte_pmd_dpaa2_sec.so.20.0.1
  LD librte_pmd_dpaa_sec.so.20.0.1
  INSTALL-LIB librte_pmd_dpaa2_sec.so.20.0.1
  INSTALL-LIB librte_pmd_dpaa_sec.so.20.0.1
make[3]: *** [drivers] Error 2
make[2]: *** [all] Error 2
make[1]: *** [pre_install] Error 2
make: *** [install] Error 2


*Make Build Failed #2:
OS: FreeBSD1201-64
Target: x86_64-native-bsdapp-gcc+shared
  CC rte_eth_bond_pmd.o.pmd.o
  LD librte_pmd_axgbe.so.20.0.1
/usr/local/bin/ld: axgbe_ethdev.o: in function `eth_axgbe_dev_init.part.0':
axgbe_ethdev.c:(.text+0xa6a): undefined reference to `rte_pci_bus'
collect2: error: ld returned 1 exit status
gmake[6]: *** [/root/FreeBSD1201-64_K12.1_GCC7.3.0/x86_64-native-bsdapp-gcc+shared/d2acc45a1d0b489294c023076dc5072f/dpdk/mk/rte.lib.mk:100: librte_pmd_axgbe.so.20.0.1] Error 1
gmake[5]: *** [/root/FreeBSD1201-64_K12.1_GCC7.3.0/x86_64-native-bsdapp-gcc+shared/d2acc45a1d0b489294c023076dc5072f/dpdk/mk/rte.subdir.mk:37: axgbe] Error 2
gmake[5]: *** Waiting for unfinished jobs....
== Build drivers/crypto/nitrox
  LD rte_eth_bond_pmd.o
  CC ecore_sp.o
  CC null_crypto_pmd.o
--
  PMDINFO igb_ethdev.o.pmd.c
  CC igb_ethdev.o.pmd.o
  LD igb_ethdev.o
  LD librte_pmd_e1000.so.20.0.1
  INSTALL-LIB librte_pmd_e1000.so.20.0.1
gmake[4]: *** [/root/FreeBSD1201-64_K12.1_GCC7.3.0/x86_64-native-bsdapp-gcc+shared/d2acc45a1d0b489294c023076dc5072f/dpdk/mk/rte.subdir.mk:35: net] Error 2
gmake[3]: *** [/root/FreeBSD1201-64_K12.1_GCC7.3.0/x86_64-native-bsdapp-gcc+shared/d2acc45a1d0b489294c023076dc5072f/dpdk/mk/rte.sdkbuild.mk:46: drivers] Error 2
gmake[2]: *** [/root/FreeBSD1201-64_K12.1_GCC7.3.0/x86_64-native-bsdapp-gcc+shared/d2acc45a1d0b489294c023076dc5072f/dpdk/mk/rte.sdkroot.mk:99: all] Error 2
gmake[1]: *** [/root/FreeBSD1201-64_K12.1_GCC7.3.0/x86_64-native-bsdapp-gcc+shared/d2acc45a1d0b489294c023076dc5072f/dpdk/mk/rte.sdkinstall.mk:61: pre_install] Error 2
gmake: *** [/root/FreeBSD1201-64_K12.1_GCC7.3.0/x86_64-native-bsdapp-gcc+shared/d2acc45a1d0b489294c023076dc5072f/dpdk/mk/rte.sdkroot.mk:77: install] Error 2

*Meson Build Failed #1:
OS: FC31-64
Target:./build-gcc-static
FAILED: drivers/librte_pmd_axgbe.so.20.0.1 
gcc  -o drivers/librte_pmd_axgbe.so.20.0.1 'drivers/a715181@@rte_pmd_axgbe at sha/meson-generated_.._rte_pmd_axgbe.pmd.c.o' 'drivers/a715181@@tmp_rte_pmd_axgbe at sta/net_axgbe_axgbe_ethdev.c.o' 'drivers/a715181@@tmp_rte_pmd_axgbe at sta/net_axgbe_axgbe_dev.c.o' 'drivers/a715181@@tmp_rte_pmd_axgbe at sta/net_axgbe_axgbe_mdio.c.o' 'drivers/a715181@@tmp_rte_pmd_axgbe at sta/net_axgbe_axgbe_phy_impl.c.o' 'drivers/a715181@@tmp_rte_pmd_axgbe at sta/net_axgbe_axgbe_i2c.c.o' 'drivers/a715181@@tmp_rte_pmd_axgbe at sta/net_axgbe_axgbe_rxtx.c.o' 'drivers/a715181@@tmp_rte_pmd_axgbe at sta/net_axgbe_axgbe_rxtx_vec_sse.c.o' -Wl,--as-needed -Wl,--no-undefined -Wl,-O1 -shared -fPIC -Wl,--start-group -Wl,-soname,librte_pmd_axgbe.so.20.0 -Wl,--no-as-needed -pthread -lm -ldl -lnuma lib/librte_ethdev.so.20.0.1 lib/librte_eal.so.20.0.1 lib/librte_kvargs.so.20.0.1 lib/librte_net.so.20.0.1 lib/librte_mbuf.so.20.0.1 lib/librte_mempool.so.20.0.1 lib/librte_ring.so.20.0.1 lib/librte_meter.so.20.0.1 drivers/librte_bus_pci.so.20.0.1 lib/librte_pci.so.20.0.1 drivers/librte_bus_vdev.so.20.0.1 -Wl,--end-group -Wl,--version-script=/root/FC31-64_K5.3.14_GCC9.2.1/x86_64-native-linuxapp-gcc/d2acc45a1d0b489294c023076dc5072f/dpdk/drivers/net/axgbe/rte_pmd_axgbe_version.map '-Wl,-rpath,$ORIGIN/../lib:$ORIGIN/' -Wl,-rpath-link,/root/FC31-64_K5.3.14_GCC9.2.1/x86_64-native-linuxapp-gcc/d2acc45a1d0b489294c023076dc5072f/dpdk/build-gcc-static/lib -Wl,-rpath-link,/root/FC31-64_K5.3.14_GCC9.2.1/x86_64-native-linuxapp-gcc/d2acc45a1d0b489294c023076dc5072f/dpdk/build-gcc-static/drivers
/usr/bin/ld: drivers/a715181@@tmp_rte_pmd_axgbe at sta/net_axgbe_axgbe_ethdev.c.o: in function `eth_axgbe_dev_init.part.0':
axgbe_ethdev.c:(.text+0xa6a): undefined reference to `rte_pci_bus'
collect2: error: ld returned 1 exit status
[716/2198] Compiling C object 'drivers/a715181@@tmp_rte_pmd_bond at sta/net_bonding_rte_eth_bond_8023ad.c.o'.
[717/2198] Compiling C object 'drivers/a715181@@tmp_rte_pmd_bnx2x at sta/net_bnx2x_bnx2x_ethdev.c.o'.
[718/2198] Compiling C object 'drivers/a715181@@tmp_rte_pmd_bnx2x at sta/net_bnx2x_bnx2x_vfpf.c.o'.
[719/2198] Compiling C object 'drivers/a715181@@tmp_rte_pmd_bond at sta/net_bonding_rte_eth_bond_pmd.c.o'.
[720/2198] Compiling C object 'drivers/a715181@@tmp_rte_pmd_bnx2x at sta/net_bnx2x_bnx2x_stats.c.o'.
[721/2198] Compiling C object 'drivers/a715181@@tmp_rte_pmd_bnx2x at sta/net_bnx2x_bnx2x.c.o'.
[722/2198] Compiling C object 'lib/76b5a35@@rte_pipeline at sta/librte_pipeline_rte_table_action.c.o'.
ninja: build stopped: subcommand failed




*Meson Build Failed #2:
OS: UB1604-32
Target:./build-gcc-static
FAILED: drivers/librte_pmd_axgbe.so.20.0.1 
gcc  -o drivers/librte_pmd_axgbe.so.20.0.1 'drivers/a715181@@rte_pmd_axgbe at sha/meson-generated_.._rte_pmd_axgbe.pmd.c.o' 'drivers/a715181@@tmp_rte_pmd_axgbe at sta/net_axgbe_axgbe_ethdev.c.o' 'drivers/a715181@@tmp_rte_pmd_axgbe at sta/net_axgbe_axgbe_dev.c.o' 'drivers/a715181@@tmp_rte_pmd_axgbe at sta/net_axgbe_axgbe_mdio.c.o' 'drivers/a715181@@tmp_rte_pmd_axgbe at sta/net_axgbe_axgbe_phy_impl.c.o' 'drivers/a715181@@tmp_rte_pmd_axgbe at sta/net_axgbe_axgbe_i2c.c.o' 'drivers/a715181@@tmp_rte_pmd_axgbe at sta/net_axgbe_axgbe_rxtx.c.o' 'drivers/a715181@@tmp_rte_pmd_axgbe at sta/net_axgbe_axgbe_rxtx_vec_sse.c.o' -Wl,--no-undefined -Wl,--as-needed -Wl,-O1 -shared -fPIC -Wl,--start-group -Wl,-soname,librte_pmd_axgbe.so.20.0 -Wl,--no-as-needed -pthread -lm -ldl -lnuma lib/librte_ethdev.so.20.0.1 lib/librte_eal.so.20.0.1 lib/librte_kvargs.so.20.0.1 lib/librte_net.so.20.0.1 lib/librte_mbuf.so.20.0.1 lib/librte_mempool.so.20.0.1 lib/librte_ring.so.20.0.1 lib/librte_meter.so.20.0.1 drivers/librte_bus_pci.so.20.0.1 lib/librte_pci.so.20.0.1 drivers/librte_bus_vdev.so.20.0.1 -Wl,--end-group -Wl,--version-script=/root/UB1604-32_K4.4.0_GCC5.4.0/i686-native-linuxapp-gcc/d2acc45a1d0b489294c023076dc5072f/dpdk/drivers/net/axgbe/rte_pmd_axgbe_version.map '-Wl,-rpath,$ORIGIN/../lib:$ORIGIN/' -Wl,-rpath-link,/root/UB1604-32_K4.4.0_GCC5.4.0/i686-native-linuxapp-gcc/d2acc45a1d0b489294c023076dc5072f/dpdk/build-gcc-static/lib:/root/UB1604-32_K4.4.0_GCC5.4.0/i686-native-linuxapp-gcc/d2acc45a1d0b489294c023076dc5072f/dpdk/build-gcc-static/drivers 
drivers/a715181@@tmp_rte_pmd_axgbe at sta/net_axgbe_axgbe_ethdev.c.o: In function `eth_axgbe_dev_init.part.5':
axgbe_ethdev.c:(.text.unlikely+0x50): undefined reference to `rte_pci_bus'
collect2: error: ld returned 1 exit status
[714/1949] Compiling C object 'drivers/a715181@@tmp_rte_pmd_bond at sta/net_bonding_rte_eth_bond_alb.c.o'.
[715/1949] Compiling C object 'drivers/a715181@@tmp_rte_pmd_bnxt at sta/net_bnxt_bnxt_filter.c.o'.
[716/1949] Compiling C object 'drivers/a715181@@tmp_rte_pmd_bond at sta/net_bonding_rte_eth_bond_pmd.c.o'.
[717/1949] Compiling C object 'drivers/a715181@@tmp_rte_pmd_bond at sta/net_bonding_rte_eth_bond_8023ad.c.o'.
[718/1949] Compiling C object 'drivers/a715181@@tmp_rte_pmd_bnxt at sta/net_bnxt_bnxt_ethdev.c.o'.
ninja: build stopped: subcommand failed




*Meson Build Failed #3:
OS: SUSE15-64
Target:./build-gcc-static
FAILED: drivers/librte_pmd_axgbe.so.20.0.1 
gcc  -o drivers/librte_pmd_axgbe.so.20.0.1 'drivers/a715181@@rte_pmd_axgbe at sha/meson-generated_.._rte_pmd_axgbe.pmd.c.o' 'drivers/a715181@@tmp_rte_pmd_axgbe at sta/net_axgbe_axgbe_ethdev.c.o' 'drivers/a715181@@tmp_rte_pmd_axgbe at sta/net_axgbe_axgbe_dev.c.o' 'drivers/a715181@@tmp_rte_pmd_axgbe at sta/net_axgbe_axgbe_mdio.c.o' 'drivers/a715181@@tmp_rte_pmd_axgbe at sta/net_axgbe_axgbe_phy_impl.c.o' 'drivers/a715181@@tmp_rte_pmd_axgbe at sta/net_axgbe_axgbe_i2c.c.o' 'drivers/a715181@@tmp_rte_pmd_axgbe at sta/net_axgbe_axgbe_rxtx.c.o' 'drivers/a715181@@tmp_rte_pmd_axgbe at sta/net_axgbe_axgbe_rxtx_vec_sse.c.o' -Wl,--no-undefined -Wl,--as-needed -Wl,-O1 -shared -fPIC -Wl,--start-group -Wl,-soname,librte_pmd_axgbe.so.20.0 -Wl,--no-as-needed -pthread -lm -ldl -lnuma lib/librte_ethdev.so.20.0.1 lib/librte_eal.so.20.0.1 lib/librte_kvargs.so.20.0.1 lib/librte_net.so.20.0.1 lib/librte_mbuf.so.20.0.1 lib/librte_mempool.so.20.0.1 lib/librte_ring.so.20.0.1 lib/librte_meter.so.20.0.1 drivers/librte_bus_pci.so.20.0.1 lib/librte_pci.so.20.0.1 drivers/librte_bus_vdev.so.20.0.1 -Wl,--end-group -Wl,--version-script=/root/SUSE15-64_K4.12.14_GCC7.3.1/x86_64-native-linuxapp-gcc/d2acc45a1d0b489294c023076dc5072f/dpdk/drivers/net/axgbe/rte_pmd_axgbe_version.map '-Wl,-rpath,$ORIGIN/../lib:$ORIGIN/' -Wl,-rpath-link,/root/SUSE15-64_K4.12.14_GCC7.3.1/x86_64-native-linuxapp-gcc/d2acc45a1d0b489294c023076dc5072f/dpdk/build-gcc-static/lib:/root/SUSE15-64_K4.12.14_GCC7.3.1/x86_64-native-linuxapp-gcc/d2acc45a1d0b489294c023076dc5072f/dpdk/build-gcc-static/drivers 
drivers/a715181@@tmp_rte_pmd_axgbe at sta/net_axgbe_axgbe_ethdev.c.o: In function `eth_axgbe_dev_init.part.5':
axgbe_ethdev.c:(.text.unlikely+0x43): undefined reference to `rte_pci_bus'
collect2: error: ld returned 1 exit status
[720/2185] Generating rte_pmd_bond.pmd.c with a custom command.
[721/2185] Compiling C object 'drivers/a715181@@tmp_rte_pmd_bnx2x at sta/net_bnx2x_bnx2x_rxtx.c.o'.
[722/2185] Generating pipeline.exp_chk with a meson_exe.py custom command.
[723/2185] Compiling C object 'drivers/a715181@@tmp_rte_pmd_bnx2x at sta/net_bnx2x_bnx2x_vfpf.c.o'.
[724/2185] Compiling C object 'drivers/a715181@@tmp_rte_pmd_bnx2x at sta/net_bnx2x_bnx2x_stats.c.o'.
[725/2185] Compiling C object 'drivers/a715181@@tmp_rte_pmd_bnx2x at sta/net_bnx2x_ecore_sp.c.o'.
[726/2185] Compiling C object 'drivers/a715181@@tmp_rte_pmd_bnx2x at sta/net_bnx2x_bnx2x.c.o'.
ninja: build stopped: subcommand failed




*Meson Build Failed #4:
OS: CENTOS77-64
Target:./build-gcc-static
FAILED: drivers/librte_pmd_axgbe.so.20.0.1 
gcc  -o drivers/librte_pmd_axgbe.so.20.0.1 'drivers/a715181@@rte_pmd_axgbe at sha/meson-generated_.._rte_pmd_axgbe.pmd.c.o' 'drivers/a715181@@tmp_rte_pmd_axgbe at sta/net_axgbe_axgbe_ethdev.c.o' 'drivers/a715181@@tmp_rte_pmd_axgbe at sta/net_axgbe_axgbe_dev.c.o' 'drivers/a715181@@tmp_rte_pmd_axgbe at sta/net_axgbe_axgbe_mdio.c.o' 'drivers/a715181@@tmp_rte_pmd_axgbe at sta/net_axgbe_axgbe_phy_impl.c.o' 'drivers/a715181@@tmp_rte_pmd_axgbe at sta/net_axgbe_axgbe_i2c.c.o' 'drivers/a715181@@tmp_rte_pmd_axgbe at sta/net_axgbe_axgbe_rxtx.c.o' 'drivers/a715181@@tmp_rte_pmd_axgbe at sta/net_axgbe_axgbe_rxtx_vec_sse.c.o' -Wl,--as-needed -Wl,--no-undefined -Wl,-O1 -shared -fPIC -Wl,--start-group -Wl,-soname,librte_pmd_axgbe.so.20.0 -Wl,--no-as-needed -pthread -lm -ldl -lnuma lib/librte_ethdev.so.20.0.1 lib/librte_eal.so.20.0.1 lib/librte_kvargs.so.20.0.1 lib/librte_net.so.20.0.1 lib/librte_mbuf.so.20.0.1 lib/librte_mempool.so.20.0.1 lib/librte_ring.so.20.0.1 lib/librte_meter.so.20.0.1 drivers/librte_bus_pci.so.20.0.1 lib/librte_pci.so.20.0.1 drivers/librte_bus_vdev.so.20.0.1 -Wl,--end-group -Wl,--version-script=/root/CENTOS77-64_K3.10.0_GCC4.8.5/x86_64-native-linuxapp-gcc/d2acc45a1d0b489294c023076dc5072f/dpdk/drivers/net/axgbe/rte_pmd_axgbe_version.map '-Wl,-rpath,$ORIGIN/../lib:$ORIGIN/' -Wl,-rpath-link,/root/CENTOS77-64_K3.10.0_GCC4.8.5/x86_64-native-linuxapp-gcc/d2acc45a1d0b489294c023076dc5072f/dpdk/build-gcc-static/lib -Wl,-rpath-link,/root/CENTOS77-64_K3.10.0_GCC4.8.5/x86_64-native-linuxapp-gcc/d2acc45a1d0b489294c023076dc5072f/dpdk/build-gcc-static/drivers
drivers/a715181@@tmp_rte_pmd_axgbe at sta/net_axgbe_axgbe_ethdev.c.o: In function `eth_axgbe_dev_init.part.4':
axgbe_ethdev.c:(.text.unlikely+0x41): undefined reference to `rte_pci_bus'
collect2: error: ld returned 1 exit status
[728/2195] Linking static target drivers/libtmp_rte_pmd_bond.a.
[729/2195] Compiling C object 'drivers/a715181@@tmp_rte_pmd_bnx2x at sta/net_bnx2x_bnx2x_vfpf.c.o'.
[730/2195] Compiling C object 'drivers/a715181@@tmp_rte_pmd_bnx2x at sta/net_bnx2x_bnx2x_rxtx.c.o'.
[731/2195] Compiling C object 'drivers/a715181@@tmp_rte_pmd_bnx2x at sta/net_bnx2x_bnx2x_stats.c.o'.
[732/2195] Compiling C object 'drivers/a715181@@tmp_rte_pmd_bnx2x at sta/net_bnx2x_bnx2x.c.o'.
ninja: build stopped: subcommand failed




*Meson Build Failed #5:
OS: UB1804-64
Target:./build-gcc-static
FAILED: drivers/librte_pmd_axgbe.so.20.0.1 
gcc  -o drivers/librte_pmd_axgbe.so.20.0.1 'drivers/a715181@@rte_pmd_axgbe at sha/meson-generated_.._rte_pmd_axgbe.pmd.c.o' 'drivers/a715181@@tmp_rte_pmd_axgbe at sta/net_axgbe_axgbe_ethdev.c.o' 'drivers/a715181@@tmp_rte_pmd_axgbe at sta/net_axgbe_axgbe_dev.c.o' 'drivers/a715181@@tmp_rte_pmd_axgbe at sta/net_axgbe_axgbe_mdio.c.o' 'drivers/a715181@@tmp_rte_pmd_axgbe at sta/net_axgbe_axgbe_phy_impl.c.o' 'drivers/a715181@@tmp_rte_pmd_axgbe at sta/net_axgbe_axgbe_i2c.c.o' 'drivers/a715181@@tmp_rte_pmd_axgbe at sta/net_axgbe_axgbe_rxtx.c.o' 'drivers/a715181@@tmp_rte_pmd_axgbe at sta/net_axgbe_axgbe_rxtx_vec_sse.c.o' -Wl,--no-undefined -Wl,--as-needed -Wl,-O1 -shared -fPIC -Wl,--start-group -Wl,-soname,librte_pmd_axgbe.so.20.0 -Wl,--no-as-needed -pthread -lm -ldl -lnuma lib/librte_ethdev.so.20.0.1 lib/librte_eal.so.20.0.1 lib/librte_kvargs.so.20.0.1 lib/librte_net.so.20.0.1 lib/librte_mbuf.so.20.0.1 lib/librte_mempool.so.20.0.1 lib/librte_ring.so.20.0.1 lib/librte_meter.so.20.0.1 drivers/librte_bus_pci.so.20.0.1 lib/librte_pci.so.20.0.1 drivers/librte_bus_vdev.so.20.0.1 -Wl,--end-group -Wl,--version-script=/root/UB1804-64_K4.15.0_GCC7.3.0/x86_64-native-linuxapp-gcc/d2acc45a1d0b489294c023076dc5072f/dpdk/drivers/net/axgbe/rte_pmd_axgbe_version.map '-Wl,-rpath,$ORIGIN/../lib:$ORIGIN/' -Wl,-rpath-link,/root/UB1804-64_K4.15.0_GCC7.3.0/x86_64-native-linuxapp-gcc/d2acc45a1d0b489294c023076dc5072f/dpdk/build-gcc-static/lib:/root/UB1804-64_K4.15.0_GCC7.3.0/x86_64-native-linuxapp-gcc/d2acc45a1d0b489294c023076dc5072f/dpdk/build-gcc-static/drivers 
drivers/a715181@@tmp_rte_pmd_axgbe at sta/net_axgbe_axgbe_ethdev.c.o: In function `eth_axgbe_dev_init.part.5':
axgbe_ethdev.c:(.text.unlikely+0x43): undefined reference to `rte_pci_bus'
collect2: error: ld returned 1 exit status
[722/2137] Compiling C object 'drivers/a715181@@tmp_rte_pmd_bnx2x at sta/net_bnx2x_bnx2x_ethdev.c.o'.
[723/2137] Compiling C object 'drivers/a715181@@tmp_rte_pmd_bond at sta/net_bonding_rte_eth_bond_8023ad.c.o'.
[724/2137] Compiling C object 'drivers/a715181@@tmp_rte_pmd_bnx2x at sta/net_bnx2x_bnx2x_rxtx.c.o'.
[725/2137] Compiling C object 'drivers/a715181@@tmp_rte_pmd_bond at sta/net_bonding_rte_eth_bond_pmd.c.o'.
[726/2137] Compiling C object 'drivers/a715181@@tmp_rte_pmd_bnx2x at sta/net_bnx2x_bnx2x.c.o'.
ninja: build stopped: subcommand failed



DPDK STV team


More information about the test-report mailing list