[dpdk-test-report] |FAILURE| pw64569[v8, 3/6] test/ring: add functional tests for rte_ring_xxx_elem APIs

sys_stv at intel.com sys_stv at intel.com
Mon Jan 13 20:20:52 CET 2020


Test-Label: Intel-compilation
Test-Status: FAILURE
http://dpdk.org/patch/64569

_Compilation issues_

Submitter: Honnappa Nagarahalli <honnappa.nagarahalli at arm.com>
Date: 2020-01-13 17:25:15
Reply_mail: 20200113172518.37815-4-honnappa.nagarahalli at arm.com
DPDK git baseline: Repo:dpdk-next-eventdev, CommitID: 80b4cdd02905f796cde226d724206dfd10e63d35

Makefile build Summary: 23 Builds Done, 18 Successful, 5 Failures

Meson build Summary: 8 Builds Done, 7 Successful, 1 Failures

               +==============================================+===========+==========+
               |                   Makefile                   |   Meson   | Document |
+----------------+------+-------+------+------------+-----------+-----------+----------+
| os             | gcc  | clang | icc  | gcc+shared | gcc+debug | gcc/clang | pdf/html |
+----------------+------+-------+------+------------+-----------+-----------+----------+
| RHEL80-64      | pass |       |      |            |           |           |          |
| UB1804-64      | pass | pass  | pass |            |           | pass      | pass     |
| UB1604-32      | pass |       |      |            |           | pass      |          |
| CENTOS77-64    | FAIL | pass  | FAIL | FAIL       | FAIL      | FAIL      |          |
| UB1604-64      | pass | pass  |      |            |           |           |          |
| WIN10-64       |      |       |      |            |           | pass      |          |
| UB1910-64      | pass |       |      |            |           |           |          |
| FC31-64        | pass | pass  |      |            |           | pass      |          |
| CENTOS80-64    | pass |       |      |            |           |           |          |
| FreeBSD1201-64 | pass | pass  |      | pass       | pass      | pass      |          |
| RHEL77-64      | FAIL |       |      |            |           |           |          |
| SUSE15-64      | pass | pass  |      |            |           | pass      |          |
+----------------+------+-------+------+------------+-----------+-----------+----------+

Test environment and configuration as below:

** Makefile build **


OS: UB1804-64
	Kernel Version: 4.15.0-20-generic
	CPU info: Intel(R) Xeon(R) CPU E5-2699 v3 @ 2.30GHz
	GCC Version: gcc (Ubuntu 7.3.0-27ubuntu1~18.04) 7.3.0
	Clang Version: 6.0.0-1ubuntu2 (tags/RELEASE_600/final)
	x86_64-native-linuxapp-icc
	x86_64-native-linuxapp-clang
	x86_64-native-linuxapp-gcc


OS: UB1604-32
	Kernel Version: 4.4.0-131-generic
	CPU info: Intel(R) Xeon(R) CPU E5-2699 v3 @ 2.30GHz
	GCC Version: gcc (Ubuntu 5.4.0-6ubuntu1~16.04.11) 5.4.0 20160609
	Clang Version: 3.8.0-2ubuntu4 (tags/RELEASE_380/final)
	i686-native-linuxapp-gcc


OS: CENTOS77-64
	Kernel Version: 3.10.0-1062.9.1.el7.x86_64
	CPU info: Intel(R) Xeon(R) CPU E5-2699 v4 @ 2.20GHz
	GCC Version: gcc (GCC) 4.8.5 20150623 (Red Hat 4.8.5-39)
	Clang Version: 3.4.2 (tags/RELEASE_34/dot2-final)
	x86_64-native-linuxapp-gcc
	x86_64-native-linuxapp-gcc+shared
	x86_64-native-linuxapp-gcc+debug
	x86_64-native-linuxapp-icc
	x86_64-native-linuxapp-clang


OS: UB1910-64
	Kernel Version: 5.3.0-18-generic
	CPU info: Intel(R) Xeon(R) CPU E5-2699 v3 @ 2.30GHz
	GCC Version: gcc (Ubuntu 9.2.1-9ubuntu2) 9.2.1 20191008
	Clang Version: 9.0.0-2 (tags/RELEASE_900/final)
	x86_64-native-linuxapp-gcc


OS: CENTOS80-64
	Kernel Version: 4.18.0-80.11.2.el8_0.x86_64
	CPU info: Intel(R) Xeon(R) CPU E5-2699 v4 @ 2.20GHz
	GCC Version: gcc (GCC) 8.2.1 20180905 (Red Hat 8.2.1-3)
	Clang Version: 7.0.1 (tags/RELEASE_701/final)
	x86_64-native-linuxapp-gcc


OS: UB1604-64
	Kernel Version: 4.4.0-170-generic
	CPU info: Intel(R) Xeon(R) CPU E5-2699 v3 @ 2.30GHz
	GCC Version: gcc (Ubuntu 5.4.0-6ubuntu1~16.04.12) 5.4.0 20160609
	Clang Version: 3.8.0-2ubuntu4 (tags/RELEASE_380/final)
	x86_64-native-linuxapp-clang
	x86_64-native-linuxapp-gcc


OS: FC31-64
	Kernel Version: 5.3.15-300.fc31.x86_64
	CPU info: Intel(R) Xeon(R) CPU E5-2699 v4 @ 2.20GHz
	GCC Version: gcc (GCC) 9.2.1 20190827 (Red Hat 9.2.1-1)
	Clang Version: 9.0.0 (Fedora 9.0.0-1.fc31)
	x86_64-native-linuxapp-gcc
	x86_64-native-linuxapp-clang


OS: RHEL80-64
	Kernel Version: 4.18.0-80.el8.x86_64
	CPU info: Intel(R) Xeon(R) CPU E5-2699 v4 @ 2.20GHz
	GCC Version: gcc (GCC) 8.2.1 20180905 (Red Hat 8.2.1-3)
	Clang Version: 6.0.1 (tags/RELEASE_601/final)
	x86_64-native-linuxapp-gcc


OS: FreeBSD1201-64
	Kernel Version: 12.1-RELEASE
	CPU info: Intel(R) Xeon(R) CPU E5-2699 v4 @ 2.20GHz (2194.98-MHz K8-class CPU)
	GCC Version: gcc (FreeBSD Ports Collection) 9.2.0
	Clang Version: 8.0.1 (tags/RELEASE_801/final 366581) (based on LLVM 8.0.1)
	x86_64-native-bsdapp-gcc+debug
	x86_64-native-bsdapp-gcc+shared
	x86_64-native-bsdapp-gcc
	x86_64-native-bsdapp-clang


OS: RHEL77-64
	Kernel Version: 3.10.0-1062.9.1.el7.x86_64
	CPU info: Intel(R) Xeon(R) CPU E5-2699 v4 @ 2.20GHz
	GCC Version: gcc (GCC) 4.8.5 20150623 (Red Hat 4.8.5-39)
	Clang Version: 3.4.2 (tags/RELEASE_34/dot2-final)
	x86_64-native-linuxapp-gcc


OS: SUSE15-64
	Kernel Version: 4.12.14-lp150.11-default
	CPU info: Intel(R) Xeon(R) CPU E5-2699 v4 @ 2.20GHz
	GCC Version: gcc (SUSE Linux) 7.3.1 20180323 [gcc-7-branch revision 258812]
	Clang Version: 5.0.1 (tags/RELEASE_501/final 312548)
	x86_64-native-linuxapp-gcc
	x86_64-native-linuxapp-clang


** Meson build **


OS: UB1804-64
	Kernel Version: 4.15.0-20-generic
	CPU info: Intel(R) Xeon(R) CPU E5-2699 v4 @ 2.20GHz
	GCC Version: gcc (Ubuntu 7.3.0-27ubuntu1~18.04) 7.3.0
	Clang Version: 6.0.0-1ubuntu2 (tags/RELEASE_600/final)
	x86_64-native-linuxapp-doc
	build-gcc-static
	build-gcc-shared
	build-clang-static
	build-clang-shared
	build-x86-default


OS: UB1604-32
	Kernel Version: 4.4.0-131-generic
	CPU info: Intel(R) Xeon(R) CPU E5-2699 v4 @ 2.20GHz
	GCC Version: gcc (Ubuntu 5.4.0-6ubuntu1~16.04.11) 5.4.0 20160609
	Clang Version: 3.8.0-2ubuntu4 (tags/RELEASE_380/final)
	build-gcc-static
	build-gcc-shared
	build-clang-static
	build-clang-shared
	build-x86-default


OS: CENTOS77-64
	Kernel Version: 3.10.0-1062.9.1.el7.x86_64
	CPU info: Intel(R) Xeon(R) CPU E5-2699 v4 @ 2.20GHz
	GCC Version: gcc (GCC) 4.8.5 20150623 (Red Hat 4.8.5-39)
	Clang Version: 3.4.2 (tags/RELEASE_34/dot2-final)
	build-gcc-static
	build-gcc-shared
	build-clang-static
	build-clang-shared
	build-x86-default


OS: WIN10-64
	Kernel Version: N/A
	CPU info: N/A
	GCC Version: N/A
	Clang Version: Clang 8.0.0
	x86_64-windows-clang


OS: FC31-64
	Kernel Version: 5.3.14-300.fc31.x86_64
	CPU info: Intel(R) Xeon(R) CPU E5-2699 v4 @ 2.20GHz
	GCC Version: gcc (GCC) 9.2.1 20190827 (Red Hat 9.2.1-1)
	Clang Version: 9.0.0 (Fedora 9.0.0-1.fc31)
	build-gcc-static
	build-gcc-shared
	build-clang-static
	build-clang-shared
	build-x86-default


OS: FreeBSD1201-64
	Kernel Version: 12.1-RELEASE
	CPU info: Intel(R) Xeon(R) CPU E5-2699 v4 @ 2.20GHz (2194.97-MHz K8-class CPU)
	GCC Version: gcc (FreeBSD Ports Collection) 9.2.0
	Clang Version: 8.0.1 (tags/RELEASE_801/final 366581) (based on LLVM 8.0.1)
	build-gcc-static
	build-gcc-shared
	build-clang-static
	build-clang-shared
	build-x86-default


OS: SUSE15-64
	Kernel Version: 4.12.14-lp150.11-default
	CPU info: Intel(R) Xeon(R) CPU E5-2699 v4 @ 2.20GHz
	GCC Version: gcc (SUSE Linux) 7.3.1 20180323 [gcc-7-branch revision 258812]
	Clang Version: 5.0.1 (tags/RELEASE_501/final 312548)
	build-gcc-static
	build-gcc-shared
	build-clang-static
	build-clang-shared
	build-x86-default


*Make Build Failed #1:
OS: CENTOS77-64
Target: x86_64-native-linuxapp-gcc
  for (uint32_t i = 1; i < num_key_slots; i++)
  ^
  INSTALL-LIB librte_mempool.a
/root/CENTOS77-64_K3.10.0_GCC4.8.5/x86_64-native-linuxapp-gcc/63284ecce08c4bfbb0060ccae3caec88/dpdk/lib/librte_hash/rte_cuckoo_hash.c: At top level:
cc1: warning: unrecognized command line option "-Wno-address-of-packed-member" [enabled by default]
make[5]: *** [rte_cuckoo_hash.o] Error 1
make[5]: *** Waiting for unfinished jobs....
== Build lib/librte_rib
== Build lib/librte_mbuf
make[4]: *** [librte_hash] Error 2
make[4]: *** Waiting for unfinished jobs....
  AR librte_power.a
  INSTALL-LIB librte_power.a
  SYMLINK-FILE include/rte_rib.h
  SYMLINK-FILE include/rte_rib6.h
--
  CC rte_mbuf_dyn.o
  AR librte_rib.a
  INSTALL-LIB librte_rib.a
  AR librte_mbuf.a
  INSTALL-LIB librte_mbuf.a
make[3]: *** [lib] Error 2
make[2]: *** [all] Error 2
make[1]: *** [pre_install] Error 2
make: *** [install] Error 2


*Make Build Failed #2:
OS: CENTOS77-64
Target: x86_64-native-linuxapp-gcc+shared
/root/CENTOS77-64_K3.10.0_GCC4.8.5/x86_64-native-linuxapp-gcc+shared/63284ecce08c4bfbb0060ccae3caec88/dpdk/lib/librte_hash/rte_cuckoo_hash.c:435:2: error: ‘for’ loop initial declarations are only allowed in C99 mode
  for (uint32_t i = 1; i < num_key_slots; i++)
  ^
/root/CENTOS77-64_K3.10.0_GCC4.8.5/x86_64-native-linuxapp-gcc+shared/63284ecce08c4bfbb0060ccae3caec88/dpdk/lib/librte_hash/rte_cuckoo_hash.c: At top level:
cc1: warning: unrecognized command line option "-Wno-address-of-packed-member" [enabled by default]
make[5]: *** [rte_cuckoo_hash.o] Error 1
make[5]: *** Waiting for unfinished jobs....
make[4]: *** [librte_hash] Error 2
make[4]: *** Waiting for unfinished jobs....
  SYMLINK-FILE include/rte_power.h
  SYMLINK-FILE include/rte_power_empty_poll.h
  CC rte_power.o
  CC power_acpi_cpufreq.o
--
  INSTALL-LIB librte_acl.so.20.0
  LD librte_mempool.so.20.0
  INSTALL-LIB librte_mempool.so.20.0
  LD librte_power.so.20.0
  INSTALL-LIB librte_power.so.20.0
make[3]: *** [lib] Error 2
make[2]: *** [all] Error 2
make[1]: *** [pre_install] Error 2
make: *** [install] Error 2


*Make Build Failed #3:
OS: CENTOS77-64
Target: x86_64-native-linuxapp-gcc+debug
  for (uint32_t i = 1; i < num_key_slots; i++)
  ^
  CC guest_channel.o
/root/CENTOS77-64_K3.10.0_GCC4.8.5/x86_64-native-linuxapp-gcc+debug/63284ecce08c4bfbb0060ccae3caec88/dpdk/lib/librte_hash/rte_cuckoo_hash.c: At top level:
cc1: warning: unrecognized command line option "-Wno-address-of-packed-member" [enabled by default]
make[5]: *** [rte_cuckoo_hash.o] Error 1
make[5]: *** Waiting for unfinished jobs....
  CC rte_power_empty_poll.o
  AR librte_acl.a
  INSTALL-LIB librte_acl.a
  CC power_pstate_cpufreq.o
  AR librte_mempool.a
make[4]: *** [librte_hash] Error 2
make[4]: *** Waiting for unfinished jobs....
  INSTALL-LIB librte_mempool.a
  AR librte_power.a
  INSTALL-LIB librte_power.a
make[3]: *** [lib] Error 2
make[2]: *** [all] Error 2
make[1]: *** [pre_install] Error 2
make: *** [install] Error 2


*Make Build Failed #4:
OS: CENTOS77-64
Target: x86_64-native-linuxapp-icc
/root/CENTOS77-64_K3.10.0_ICC19.0.0/x86_64-native-linuxapp-icc/63284ecce08c4bfbb0060ccae3caec88/dpdk/lib/librte_hash/rte_cuckoo_hash.c(435): error: identifier "i" is undefined
  	for (uint32_t i = 1; i < num_key_slots; i++)
  	                     ^

compilation aborted for /root/CENTOS77-64_K3.10.0_ICC19.0.0/x86_64-native-linuxapp-icc/63284ecce08c4bfbb0060ccae3caec88/dpdk/lib/librte_hash/rte_cuckoo_hash.c (code 2)
make[5]: *** [rte_cuckoo_hash.o] Error 2
make[5]: *** Waiting for unfinished jobs....
  CC rte_power_empty_poll.o
  CC power_pstate_cpufreq.o
  AR librte_acl.a
  INSTALL-LIB librte_acl.a
make[4]: *** [librte_hash] Error 2
make[4]: *** Waiting for unfinished jobs....
  AR librte_mempool.a
  INSTALL-LIB librte_mempool.a
  AR librte_power.a
  INSTALL-LIB librte_power.a
make[3]: *** [lib] Error 2
make[2]: *** [all] Error 2
make[1]: *** [pre_install] Error 2
make: *** [install] Error 2


*Make Build Failed #5:
OS: RHEL77-64
Target: x86_64-native-linuxapp-gcc
  for (uint32_t i = 1; i < num_key_slots; i++)
  ^
/root/RHEL77-64_K3.10.0_GCC4.8.5/x86_64-native-linuxapp-gcc/63284ecce08c4bfbb0060ccae3caec88/dpdk/lib/librte_hash/rte_cuckoo_hash.c: At top level:
cc1: warning: unrecognized command line option "-Wno-address-of-packed-member" [enabled by default]
  CC rte_mempool.o
make[5]: *** [rte_cuckoo_hash.o] Error 1
make[5]: *** Waiting for unfinished jobs....
  CC rte_mempool_ops.o
  CC rte_mempool_ops_default.o
make[4]: *** [librte_hash] Error 2
make[4]: *** Waiting for unfinished jobs....
  AR librte_power.a
  INSTALL-LIB librte_power.a
  AR librte_mempool.a
  INSTALL-LIB librte_mempool.a
make[3]: *** [lib] Error 2
make[2]: *** [all] Error 2
make[1]: *** [pre_install] Error 2
make: *** [install] Error 2

*Meson Build Failed #1:
OS: CENTOS77-64
Target:build-gcc-static
FAILED: lib/76b5a35@@rte_hash at sta/librte_hash_rte_cuckoo_hash.c.o 
gcc -Ilib/76b5a35@@rte_hash at sta -Ilib -I../lib -Ilib/librte_hash -I../lib/librte_hash -I. -I../ -Iconfig -I../config -Ilib/librte_eal/common/include -I../lib/librte_eal/common/include -I../lib/librte_eal/linux/eal/include -Ilib/librte_eal/common -I../lib/librte_eal/common -Ilib/librte_eal/common/include/arch/x86 -I../lib/librte_eal/common/include/arch/x86 -Ilib/librte_eal -I../lib/librte_eal -Ilib/librte_kvargs -I../lib/librte_kvargs -Ilib/librte_ring -I../lib/librte_ring -pipe -D_FILE_OFFSET_BITS=64 -Wall -Winvalid-pch -Werror -O3 -include rte_config.h -Wextra -Wcast-qual -Wdeprecated -Wformat-nonliteral -Wformat-security -Wmissing-declarations -Wmissing-prototypes -Wnested-externs -Wold-style-definition -Wpointer-arith -Wsign-compare -Wstrict-prototypes -Wundef -Wwrite-strings -Wno-missing-field-initializers -D_GNU_SOURCE -fPIC -march=native -DALLOW_EXPERIMENTAL_API -MD -MQ 'lib/76b5a35@@rte_hash at sta/librte_hash_rte_cuckoo_hash.c.o' -MF 'lib/76b5a35@@rte_hash at sta/librte_hash_rte_cuckoo_hash.c.o.d' -o 'lib/76b5a35@@rte_hash at sta/librte_hash_rte_cuckoo_hash.c.o' -c ../lib/librte_hash/rte_cuckoo_hash.c
../lib/librte_hash/rte_cuckoo_hash.c: In function ‘rte_hash_create’:
../lib/librte_hash/rte_cuckoo_hash.c:296:3: error: ‘for’ loop initial declarations are only allowed in C99 mode
   for (uint32_t i = 1; i <= num_buckets; i++)
   ^
../lib/librte_hash/rte_cuckoo_hash.c:296:3: note: use option -std=c99 or -std=gnu99 to compile your code
../lib/librte_hash/rte_cuckoo_hash.c:435:2: error: ‘for’ loop initial declarations are only allowed in C99 mode
  for (uint32_t i = 1; i < num_key_slots; i++)
  ^
[121/2195] Compiling C object 'lib/76b5a35@@rte_metrics at sta/librte_metrics_rte_metrics.c.o'.
[122/2195] Compiling C object 'lib/76b5a35@@rte_latencystats at sta/librte_latencystats_rte_latencystats.c.o'.
[123/2195] Compiling C object 'lib/76b5a35@@rte_ethdev at sta/librte_ethdev_rte_ethdev.c.o'.
[124/2195] Generating cmdline.exp_chk with a meson_exe.py custom command.
[125/2195] Generating eal.exp_chk with a meson_exe.py custom command.
ninja: build stopped: subcommand failed



DPDK STV team


More information about the test-report mailing list