[dpdk-test-report] |FAILURE| pw63934[v3, 1/2] eal: add API to check if its interrupt context

sys_stv at intel.com sys_stv at intel.com
Wed Jan 22 01:45:23 CET 2020


Test-Label: Intel-compilation
Test-Status: FAILURE
http://dpdk.org/patch/63934

_Compilation issues_

Submitter: Sunil Kumar Kori <skori at marvell.com>
Date: 2019-12-16 10:39:47
Reply_mail: 20191216103948.22976-1-skori at marvell.com
DPDK git baseline: Repo:dpdk, CommitID: 73c392e24f5e29acbe53044dccb6b07ebbae2467

Makefile build Summary: 23 Builds Done, 21 Successful, 2 Failures

Meson build Summary: 8 Builds Done, 2 Successful, 6 Failures

               +==============================================+===========+==========+
               |                   Makefile                   |   Meson   | Document |
+----------------+------+-------+------+------------+-----------+-----------+----------+
| os             | gcc  | clang | icc  | gcc+shared | gcc+debug | gcc/clang | pdf/html |
+----------------+------+-------+------+------------+-----------+-----------+----------+
| RHEL80-64      | pass |       |      |            |           |           |          |
| UB1804-64      | pass | pass  | pass |            |           | FAIL      | pass     |
| UB1604-32      | pass |       |      |            |           | FAIL      |          |
| CENTOS77-64    | pass | pass  | pass | FAIL       | pass      | FAIL      |          |
| UB1604-64      | pass | pass  |      |            |           |           |          |
| WIN10-64       |      |       |      |            |           | pass      |          |
| UB1910-64      | pass |       |      |            |           |           |          |
| FC31-64        | pass | pass  |      |            |           | FAIL      |          |
| CENTOS80-64    | pass |       |      |            |           |           |          |
| FreeBSD1201-64 | pass | pass  |      | FAIL       | pass      | FAIL      |          |
| RHEL77-64      | pass |       |      |            |           |           |          |
| SUSE15-64      | pass | pass  |      |            |           | FAIL      |          |
+----------------+------+-------+------+------------+-----------+-----------+----------+

Test environment and configuration as below:

** Makefile build **


OS: UB1804-64
	Kernel Version: 4.15.0-20-generic
	CPU info: Intel(R) Xeon(R) CPU E5-2699 v3 @ 2.30GHz
	GCC Version: gcc (Ubuntu 7.3.0-27ubuntu1~18.04) 7.3.0
	Clang Version: 6.0.0-1ubuntu2 (tags/RELEASE_600/final)
	x86_64-native-linuxapp-icc
	x86_64-native-linuxapp-clang
	x86_64-native-linuxapp-gcc


OS: UB1604-32
	Kernel Version: 4.4.0-131-generic
	CPU info: Intel(R) Xeon(R) CPU E5-2699 v3 @ 2.30GHz
	GCC Version: gcc (Ubuntu 5.4.0-6ubuntu1~16.04.11) 5.4.0 20160609
	Clang Version: 3.8.0-2ubuntu4 (tags/RELEASE_380/final)
	i686-native-linuxapp-gcc


OS: CENTOS77-64
	Kernel Version: 3.10.0-1062.9.1.el7.x86_64
	CPU info: Intel(R) Xeon(R) CPU E5-2699 v4 @ 2.20GHz
	GCC Version: gcc (GCC) 4.8.5 20150623 (Red Hat 4.8.5-39)
	Clang Version: 3.4.2 (tags/RELEASE_34/dot2-final)
	x86_64-native-linuxapp-gcc+shared
	x86_64-native-linuxapp-clang
	x86_64-native-linuxapp-gcc
	x86_64-native-linuxapp-gcc+debug
	x86_64-native-linuxapp-icc


OS: UB1910-64
	Kernel Version: 5.3.0-18-generic
	CPU info: Intel(R) Xeon(R) CPU E5-2699 v3 @ 2.30GHz
	GCC Version: gcc (Ubuntu 9.2.1-9ubuntu2) 9.2.1 20191008
	Clang Version: 9.0.0-2 (tags/RELEASE_900/final)
	x86_64-native-linuxapp-gcc


OS: CENTOS80-64
	Kernel Version: 4.18.0-80.11.2.el8_0.x86_64
	CPU info: Intel(R) Xeon(R) CPU E5-2699 v4 @ 2.20GHz
	GCC Version: gcc (GCC) 8.2.1 20180905 (Red Hat 8.2.1-3)
	Clang Version: 7.0.1 (tags/RELEASE_701/final)
	x86_64-native-linuxapp-gcc


OS: UB1604-64
	Kernel Version: 4.4.0-170-generic
	CPU info: Intel(R) Xeon(R) CPU E5-2699 v3 @ 2.30GHz
	GCC Version: gcc (Ubuntu 5.4.0-6ubuntu1~16.04.12) 5.4.0 20160609
	Clang Version: 3.8.0-2ubuntu4 (tags/RELEASE_380/final)
	x86_64-native-linuxapp-clang
	x86_64-native-linuxapp-gcc


OS: FC31-64
	Kernel Version: 5.3.15-300.fc31.x86_64
	CPU info: Intel(R) Xeon(R) CPU E5-2699 v4 @ 2.20GHz
	GCC Version: gcc (GCC) 9.2.1 20190827 (Red Hat 9.2.1-1)
	Clang Version: 9.0.0 (Fedora 9.0.0-1.fc31)
	x86_64-native-linuxapp-gcc
	x86_64-native-linuxapp-clang


OS: RHEL80-64
	Kernel Version: 4.18.0-80.el8.x86_64
	CPU info: Intel(R) Xeon(R) CPU E5-2699 v4 @ 2.20GHz
	GCC Version: gcc (GCC) 8.2.1 20180905 (Red Hat 8.2.1-3)
	Clang Version: 6.0.1 (tags/RELEASE_601/final)
	x86_64-native-linuxapp-gcc


OS: FreeBSD1201-64
	Kernel Version: 12.1-RELEASE
	CPU info: Intel(R) Xeon(R) CPU E5-2699 v4 @ 2.20GHz (2194.98-MHz K8-class CPU)
	GCC Version: gcc (FreeBSD Ports Collection) 9.2.0
	Clang Version: 8.0.1 (tags/RELEASE_801/final 366581) (based on LLVM 8.0.1)
	x86_64-native-bsdapp-gcc+shared
	x86_64-native-bsdapp-gcc+debug
	x86_64-native-bsdapp-gcc
	x86_64-native-bsdapp-clang


OS: RHEL77-64
	Kernel Version: 3.10.0-1062.9.1.el7.x86_64
	CPU info: Intel(R) Xeon(R) CPU E5-2699 v4 @ 2.20GHz
	GCC Version: gcc (GCC) 4.8.5 20150623 (Red Hat 4.8.5-39)
	Clang Version: 3.4.2 (tags/RELEASE_34/dot2-final)
	x86_64-native-linuxapp-gcc


OS: SUSE15-64
	Kernel Version: 4.12.14-lp150.11-default
	CPU info: Intel(R) Xeon(R) CPU E5-2699 v4 @ 2.20GHz
	GCC Version: gcc (SUSE Linux) 7.3.1 20180323 [gcc-7-branch revision 258812]
	Clang Version: 5.0.1 (tags/RELEASE_501/final 312548)
	x86_64-native-linuxapp-gcc
	x86_64-native-linuxapp-clang


** Meson build **


OS: UB1804-64
	Kernel Version: 4.15.0-20-generic
	CPU info: Intel(R) Xeon(R) CPU E5-2699 v4 @ 2.20GHz
	GCC Version: gcc (Ubuntu 7.3.0-27ubuntu1~18.04) 7.3.0
	Clang Version: 6.0.0-1ubuntu2 (tags/RELEASE_600/final)
	x86_64-native-linuxapp-doc
	./build-gcc-static
	./build-gcc-shared
	./build-clang-static
	./build-clang-shared
	./build-x86-default


OS: UB1604-32
	Kernel Version: 4.4.0-131-generic
	CPU info: Intel(R) Xeon(R) CPU E5-2699 v4 @ 2.20GHz
	GCC Version: gcc (Ubuntu 5.4.0-6ubuntu1~16.04.11) 5.4.0 20160609
	Clang Version: 3.8.0-2ubuntu4 (tags/RELEASE_380/final)
	./build-gcc-static
	./build-gcc-shared
	./build-clang-static
	./build-clang-shared
	./build-x86-default


OS: CENTOS77-64
	Kernel Version: 3.10.0-1062.9.1.el7.x86_64
	CPU info: Intel(R) Xeon(R) CPU E5-2699 v4 @ 2.20GHz
	GCC Version: gcc (GCC) 4.8.5 20150623 (Red Hat 4.8.5-39)
	Clang Version: 3.4.2 (tags/RELEASE_34/dot2-final)
	./build-gcc-static
	./build-gcc-shared
	./build-clang-static
	./build-clang-shared
	./build-x86-default


OS: WIN10-64
	Kernel Version: N/A
	CPU info: N/A
	GCC Version: N/A
	Clang Version: Clang 8.0.0
	x86_64-windows-clang


OS: FC31-64
	Kernel Version: 5.3.14-300.fc31.x86_64
	CPU info: Intel(R) Xeon(R) CPU E5-2699 v4 @ 2.20GHz
	GCC Version: gcc (GCC) 9.2.1 20190827 (Red Hat 9.2.1-1)
	Clang Version: 9.0.0 (Fedora 9.0.0-1.fc31)
	./build-gcc-static
	./build-gcc-shared
	./build-clang-static
	./build-clang-shared
	./build-x86-default


OS: FreeBSD1201-64
	Kernel Version: 12.1-RELEASE
	CPU info: Intel(R) Xeon(R) CPU E5-2699 v4 @ 2.20GHz (2194.97-MHz K8-class CPU)
	GCC Version: gcc (FreeBSD Ports Collection) 9.2.0
	Clang Version: 8.0.1 (tags/RELEASE_801/final 366581) (based on LLVM 8.0.1)
	./build-gcc-static
	./build-gcc-shared
	./build-clang-static
	./build-clang-shared
	./build-x86-default


OS: SUSE15-64
	Kernel Version: 4.12.14-lp150.11-default
	CPU info: Intel(R) Xeon(R) CPU E5-2699 v4 @ 2.20GHz
	GCC Version: gcc (SUSE Linux) 7.3.1 20180323 [gcc-7-branch revision 258812]
	Clang Version: 5.0.1 (tags/RELEASE_501/final 312548)
	./build-gcc-static
	./build-gcc-shared
	./build-clang-static
	./build-clang-shared
	./build-x86-default


*Make Build Failed #1:
OS: CENTOS77-64
Target: x86_64-native-linuxapp-gcc+shared
  LD librte_common_octeontx2.so.20.0.1
  LD librte_common_octeontx.so.20.0.1
otx2_mbox.o: In function `otx2_mbox_wait_for_rsp_tmo':
otx2_mbox.c:(.text+0xb95): undefined reference to `rte_thread_is_intr'
collect2: error: ld returned 1 exit status
make[6]: *** [librte_common_octeontx2.so.20.0.1] Error 1
make[5]: *** [octeontx2] Error 2
make[5]: *** Waiting for unfinished jobs....
  INSTALL-LIB librte_common_octeontx.so.20.0.1
  LD librte_common_dpaax.so.20.0.1
  LD      /root/CENTOS77-64_K3.10.0_GCC4.8.5/x86_64-native-linuxapp-gcc+shared/9cb0fca1afb743dba7dd5e30971b17df/dpdk/x86_64-native-linuxapp-gcc/build/kernel/linux/igb_uio/built-in.o
  CC [M]  /root/CENTOS77-64_K3.10.0_GCC4.8.5/x86_64-native-linuxapp-gcc+shared/9cb0fca1afb743dba7dd5e30971b17df/dpdk/x86_64-native-linuxapp-gcc/build/kernel/linux/igb_uio/igb_uio.o
  LD librte_common_iavf.so.20.0.1
  INSTALL-LIB librte_common_dpaax.so.20.0.1
  INSTALL-LIB librte_common_iavf.so.20.0.1
make[4]: *** [common] Error 2
make[3]: *** [drivers] Error 2
make[3]: *** Waiting for unfinished jobs....
  Building modules, stage 2.
  MODPOST 1 modules
  CC      /root/CENTOS77-64_K3.10.0_GCC4.8.5/x86_64-native-linuxapp-gcc+shared/9cb0fca1afb743dba7dd5e30971b17df/dpdk/x86_64-native-linuxapp-gcc/build/kernel/linux/igb_uio/igb_uio.mod.o
  LD [M]  /root/CENTOS77-64_K3.10.0_GCC4.8.5/x86_64-native-linuxapp-gcc+shared/9cb0fca1afb743dba7dd5e30971b17df/dpdk/x86_64-native-linuxapp-gcc/build/kernel/linux/igb_uio/igb_uio.ko
INSTALL-MODULE igb_uio.ko
make[2]: *** [all] Error 2
make[1]: *** [pre_install] Error 2
make: *** [install] Error 2


*Make Build Failed #2:
OS: FreeBSD1201-64
Target: x86_64-native-bsdapp-gcc+shared
  LD librte_common_cpt.so.20.0.1
  LD librte_common_octeontx2.so.20.0.1
/usr/local/bin/ld: otx2_mbox.o: in function `otx2_mbox_wait_for_rsp_tmo':
otx2_mbox.c:(.text+0xb96): undefined reference to `rte_thread_is_intr'
collect2: error: ld returned 1 exit status
gmake[6]: *** [/root/FreeBSD1201-64_K12.1_GCC7.3.0/x86_64-native-bsdapp-gcc+shared/9cb0fca1afb743dba7dd5e30971b17df/dpdk/mk/rte.lib.mk:100: librte_common_octeontx2.so.20.0.1] Error 1
gmake[5]: *** [/root/FreeBSD1201-64_K12.1_GCC7.3.0/x86_64-native-bsdapp-gcc+shared/9cb0fca1afb743dba7dd5e30971b17df/dpdk/mk/rte.subdir.mk:35: octeontx2] Error 2
gmake[5]: *** Waiting for unfinished jobs....
  INSTALL-LIB librte_common_cpt.so.20.0.1
  LD librte_common_iavf.so.20.0.1
  INSTALL-LIB librte_common_iavf.so.20.0.1
gmake[4]: *** [/root/FreeBSD1201-64_K12.1_GCC7.3.0/x86_64-native-bsdapp-gcc+shared/9cb0fca1afb743dba7dd5e30971b17df/dpdk/mk/rte.subdir.mk:37: common] Error 2
gmake[3]: *** [/root/FreeBSD1201-64_K12.1_GCC7.3.0/x86_64-native-bsdapp-gcc+shared/9cb0fca1afb743dba7dd5e30971b17df/dpdk/mk/rte.sdkbuild.mk:46: drivers] Error 2
gmake[2]: *** [/root/FreeBSD1201-64_K12.1_GCC7.3.0/x86_64-native-bsdapp-gcc+shared/9cb0fca1afb743dba7dd5e30971b17df/dpdk/mk/rte.sdkroot.mk:99: all] Error 2
gmake[1]: *** [/root/FreeBSD1201-64_K12.1_GCC7.3.0/x86_64-native-bsdapp-gcc+shared/9cb0fca1afb743dba7dd5e30971b17df/dpdk/mk/rte.sdkinstall.mk:61: pre_install] Error 2
gmake: *** [/root/FreeBSD1201-64_K12.1_GCC7.3.0/x86_64-native-bsdapp-gcc+shared/9cb0fca1afb743dba7dd5e30971b17df/dpdk/mk/rte.sdkroot.mk:77: install] Error 2

*Meson Build Failed #1:
OS: FC31-64
Target:./build-gcc-static
FAILED: drivers/librte_common_octeontx2.so.20.0.1 
gcc  -o drivers/librte_common_octeontx2.so.20.0.1 'drivers/a715181@@rte_common_octeontx2 at sha/meson-generated_.._rte_common_octeontx2.pmd.c.o' 'drivers/a715181@@tmp_rte_common_octeontx2 at sta/common_octeontx2_otx2_dev.c.o' 'drivers/a715181@@tmp_rte_common_octeontx2 at sta/common_octeontx2_otx2_irq.c.o' 'drivers/a715181@@tmp_rte_common_octeontx2 at sta/common_octeontx2_otx2_mbox.c.o' 'drivers/a715181@@tmp_rte_common_octeontx2 at sta/common_octeontx2_otx2_common.c.o' -Wl,--as-needed -Wl,--no-undefined -Wl,-O1 -shared -fPIC -Wl,--start-group -Wl,-soname,librte_common_octeontx2.so.20.0 -Wl,--no-as-needed -pthread -lm -ldl -lnuma lib/librte_eal.so.20.0.1 lib/librte_kvargs.so.20.0.1 lib/librte_pci.so.20.0.1 lib/librte_ethdev.so.20.0.1 lib/librte_net.so.20.0.1 lib/librte_mbuf.so.20.0.1 lib/librte_mempool.so.20.0.1 lib/librte_ring.so.20.0.1 lib/librte_meter.so.20.0.1 -Wl,--end-group -Wl,--version-script=/root/FC31-64_K5.3.14_GCC9.2.1/x86_64-native-linuxapp-gcc/9cb0fca1afb743dba7dd5e30971b17df/dpdk/drivers/common/octeontx2/rte_common_octeontx2_version.map '-Wl,-rpath,$ORIGIN/../lib' -Wl,-rpath-link,/root/FC31-64_K5.3.14_GCC9.2.1/x86_64-native-linuxapp-gcc/9cb0fca1afb743dba7dd5e30971b17df/dpdk/build-gcc-static/lib
/usr/bin/ld: drivers/a715181@@tmp_rte_common_octeontx2 at sta/common_octeontx2_otx2_mbox.c.o: in function `otx2_mbox_wait_for_rsp_tmo':
otx2_mbox.c:(.text+0x3fd): undefined reference to `rte_thread_is_intr'
collect2: error: ld returned 1 exit status
[489/2216] Compiling C object 'drivers/a715181@@tmp_rte_pmd_hns3 at sta/net_hns3_hns3_intr.c.o'.
[490/2216] Compiling C object 'drivers/a715181@@tmp_rte_pmd_hns3 at sta/net_hns3_hns3_ethdev_vf.c.o'.
[491/2216] Compiling C object 'drivers/a715181@@tmp_rte_pmd_hns3 at sta/net_hns3_hns3_flow.c.o'.
[492/2216] Compiling C object 'drivers/a715181@@tmp_rte_bus_dpaa at sta/bus_dpaa_base_fman_fman.c.o'.
[493/2216] Compiling C object 'drivers/a715181@@tmp_rte_bus_dpaa at sta/bus_dpaa_base_fman_fman_hw.c.o'.
[494/2216] Compiling C object 'drivers/a715181@@tmp_rte_pmd_hns3 at sta/net_hns3_hns3_ethdev.c.o'.
[495/2216] Compiling C object 'lib/76b5a35@@rte_pipeline at sta/librte_pipeline_rte_table_action.c.o'.
ninja: build stopped: subcommand failed




*Meson Build Failed #2:
OS: SUSE15-64
Target:./build-gcc-static
FAILED: drivers/librte_common_octeontx2.so.20.0.1 
gcc  -o drivers/librte_common_octeontx2.so.20.0.1 'drivers/a715181@@rte_common_octeontx2 at sha/meson-generated_.._rte_common_octeontx2.pmd.c.o' 'drivers/a715181@@tmp_rte_common_octeontx2 at sta/common_octeontx2_otx2_dev.c.o' 'drivers/a715181@@tmp_rte_common_octeontx2 at sta/common_octeontx2_otx2_irq.c.o' 'drivers/a715181@@tmp_rte_common_octeontx2 at sta/common_octeontx2_otx2_mbox.c.o' 'drivers/a715181@@tmp_rte_common_octeontx2 at sta/common_octeontx2_otx2_common.c.o' -Wl,--no-undefined -Wl,--as-needed -Wl,-O1 -shared -fPIC -Wl,--start-group -Wl,-soname,librte_common_octeontx2.so.20.0 -Wl,--no-as-needed -pthread -lm -ldl -lnuma lib/librte_eal.so.20.0.1 lib/librte_kvargs.so.20.0.1 lib/librte_pci.so.20.0.1 lib/librte_ethdev.so.20.0.1 lib/librte_net.so.20.0.1 lib/librte_mbuf.so.20.0.1 lib/librte_mempool.so.20.0.1 lib/librte_ring.so.20.0.1 lib/librte_meter.so.20.0.1 -Wl,--end-group -Wl,--version-script=/root/SUSE15-64_K4.12.14_GCC7.3.1/x86_64-native-linuxapp-gcc/9cb0fca1afb743dba7dd5e30971b17df/dpdk/drivers/common/octeontx2/rte_common_octeontx2_version.map '-Wl,-rpath,$ORIGIN/../lib' -Wl,-rpath-link,/root/SUSE15-64_K4.12.14_GCC7.3.1/x86_64-native-linuxapp-gcc/9cb0fca1afb743dba7dd5e30971b17df/dpdk/build-gcc-static/lib 
drivers/a715181@@tmp_rte_common_octeontx2 at sta/common_octeontx2_otx2_mbox.c.o: In function `otx2_mbox_wait_for_rsp_tmo':
otx2_mbox.c:(.text+0x3ed): undefined reference to `rte_thread_is_intr'
collect2: error: ld returned 1 exit status
[494/2203] Compiling C object 'drivers/a715181@@tmp_rte_bus_dpaa at sta/bus_dpaa_base_qbman_dpaa_alloc.c.o'.
[495/2203] Compiling C object 'drivers/a715181@@tmp_rte_pmd_hns3 at sta/net_hns3_hns3_dcb.c.o'.
[496/2203] Compiling C object 'drivers/a715181@@tmp_rte_bus_dpaa at sta/bus_dpaa_base_qbman_bman_driver.c.o'.
[497/2203] Compiling C object 'drivers/a715181@@tmp_rte_bus_dpaa at sta/bus_dpaa_base_qbman_bman.c.o'.
[498/2203] Compiling C object 'drivers/a715181@@tmp_rte_bus_dpaa at sta/bus_dpaa_base_fman_netcfg_layer.c.o'.
[499/2203] Compiling C object 'drivers/a715181@@tmp_rte_pmd_hns3 at sta/net_hns3_hns3_ethdev.c.o'.
[500/2203] Compiling C object 'lib/76b5a35@@rte_pipeline at sta/librte_pipeline_rte_table_action.c.o'.
ninja: build stopped: subcommand failed




*Meson Build Failed #3:
OS: UB1604-32
Target:./build-gcc-static
FAILED: drivers/librte_common_octeontx2.so.20.0.1 
gcc  -o drivers/librte_common_octeontx2.so.20.0.1 'drivers/a715181@@rte_common_octeontx2 at sha/meson-generated_.._rte_common_octeontx2.pmd.c.o' 'drivers/a715181@@tmp_rte_common_octeontx2 at sta/common_octeontx2_otx2_dev.c.o' 'drivers/a715181@@tmp_rte_common_octeontx2 at sta/common_octeontx2_otx2_irq.c.o' 'drivers/a715181@@tmp_rte_common_octeontx2 at sta/common_octeontx2_otx2_mbox.c.o' 'drivers/a715181@@tmp_rte_common_octeontx2 at sta/common_octeontx2_otx2_common.c.o' -Wl,--no-undefined -Wl,--as-needed -Wl,-O1 -shared -fPIC -Wl,--start-group -Wl,-soname,librte_common_octeontx2.so.20.0 -Wl,--no-as-needed -pthread -lm -ldl -lnuma lib/librte_eal.so.20.0.1 lib/librte_kvargs.so.20.0.1 lib/librte_pci.so.20.0.1 lib/librte_ethdev.so.20.0.1 lib/librte_net.so.20.0.1 lib/librte_mbuf.so.20.0.1 lib/librte_mempool.so.20.0.1 lib/librte_ring.so.20.0.1 lib/librte_meter.so.20.0.1 -Wl,--end-group -Wl,--version-script=/root/UB1604-32_K4.4.0_GCC5.4.0/i686-native-linuxapp-gcc/9cb0fca1afb743dba7dd5e30971b17df/dpdk/drivers/common/octeontx2/rte_common_octeontx2_version.map '-Wl,-rpath,$ORIGIN/../lib' -Wl,-rpath-link,/root/UB1604-32_K4.4.0_GCC5.4.0/i686-native-linuxapp-gcc/9cb0fca1afb743dba7dd5e30971b17df/dpdk/build-gcc-static/lib 
drivers/a715181@@tmp_rte_common_octeontx2 at sta/common_octeontx2_otx2_mbox.c.o: In function `otx2_mbox_wait_for_rsp_tmo':
otx2_mbox.c:(.text+0x515): undefined reference to `rte_thread_is_intr'
collect2: error: ld returned 1 exit status
[486/1967] Compiling C object 'drivers/a715181@@tmp_rte_bus_dpaa at sta/bus_dpaa_base_qbman_bman_driver.c.o'.
[487/1967] Compiling C object 'drivers/a715181@@tmp_rte_pmd_octeontx2 at sta/net_octeontx2_otx2_rx.c.o'.
[488/1967] Compiling C object 'drivers/net/ice/base/39545a2@@ice_base at sta/ice_dcb.c.o'.
[489/1967] Compiling C object 'drivers/a715181@@tmp_rte_pmd_ice at sta/net_ice_ice_ethdev.c.o'.
[490/1967] Compiling C object 'lib/76b5a35@@rte_pipeline at sta/librte_pipeline_rte_table_action.c.o'.
ninja: build stopped: subcommand failed




*Meson Build Failed #4:
OS: CENTOS77-64
Target:./build-gcc-static
FAILED: drivers/librte_common_octeontx2.so.20.0.1 
gcc  -o drivers/librte_common_octeontx2.so.20.0.1 'drivers/a715181@@rte_common_octeontx2 at sha/meson-generated_.._rte_common_octeontx2.pmd.c.o' 'drivers/a715181@@tmp_rte_common_octeontx2 at sta/common_octeontx2_otx2_dev.c.o' 'drivers/a715181@@tmp_rte_common_octeontx2 at sta/common_octeontx2_otx2_irq.c.o' 'drivers/a715181@@tmp_rte_common_octeontx2 at sta/common_octeontx2_otx2_mbox.c.o' 'drivers/a715181@@tmp_rte_common_octeontx2 at sta/common_octeontx2_otx2_common.c.o' -Wl,--as-needed -Wl,--no-undefined -Wl,-O1 -shared -fPIC -Wl,--start-group -Wl,-soname,librte_common_octeontx2.so.20.0 -Wl,--no-as-needed -pthread -lm -ldl -lnuma lib/librte_eal.so.20.0.1 lib/librte_kvargs.so.20.0.1 lib/librte_pci.so.20.0.1 lib/librte_ethdev.so.20.0.1 lib/librte_net.so.20.0.1 lib/librte_mbuf.so.20.0.1 lib/librte_mempool.so.20.0.1 lib/librte_ring.so.20.0.1 lib/librte_meter.so.20.0.1 -Wl,--end-group -Wl,--version-script=/root/CENTOS77-64_K3.10.0_GCC4.8.5/x86_64-native-linuxapp-gcc/9cb0fca1afb743dba7dd5e30971b17df/dpdk/drivers/common/octeontx2/rte_common_octeontx2_version.map '-Wl,-rpath,$ORIGIN/../lib' -Wl,-rpath-link,/root/CENTOS77-64_K3.10.0_GCC4.8.5/x86_64-native-linuxapp-gcc/9cb0fca1afb743dba7dd5e30971b17df/dpdk/build-gcc-static/lib
drivers/a715181@@tmp_rte_common_octeontx2 at sta/common_octeontx2_otx2_mbox.c.o: In function `otx2_mbox_wait_for_rsp_tmo':
otx2_mbox.c:(.text+0x452): undefined reference to `rte_thread_is_intr'
collect2: error: ld returned 1 exit status
[502/2213] Compiling C object 'drivers/a715181@@tmp_rte_pmd_hns3 at sta/net_hns3_hns3_regs.c.o'.
[503/2213] Compiling C object 'drivers/a715181@@tmp_rte_pmd_hns3 at sta/net_hns3_hns3_mbx.c.o'.
[504/2213] Compiling C object 'drivers/a715181@@tmp_rte_pmd_hns3 at sta/net_hns3_hns3_rss.c.o'.
[505/2213] Compiling C object 'drivers/a715181@@tmp_rte_pmd_hns3 at sta/net_hns3_hns3_flow.c.o'.
[506/2213] Compiling C object 'lib/76b5a35@@rte_pipeline at sta/librte_pipeline_rte_table_action.c.o'.
ninja: build stopped: subcommand failed




*Meson Build Failed #5:
OS: UB1804-64
Target:./build-gcc-static
FAILED: drivers/librte_common_octeontx2.so.20.0.1 
gcc  -o drivers/librte_common_octeontx2.so.20.0.1 'drivers/a715181@@rte_common_octeontx2 at sha/meson-generated_.._rte_common_octeontx2.pmd.c.o' 'drivers/a715181@@tmp_rte_common_octeontx2 at sta/common_octeontx2_otx2_dev.c.o' 'drivers/a715181@@tmp_rte_common_octeontx2 at sta/common_octeontx2_otx2_irq.c.o' 'drivers/a715181@@tmp_rte_common_octeontx2 at sta/common_octeontx2_otx2_mbox.c.o' 'drivers/a715181@@tmp_rte_common_octeontx2 at sta/common_octeontx2_otx2_common.c.o' -Wl,--no-undefined -Wl,--as-needed -Wl,-O1 -shared -fPIC -Wl,--start-group -Wl,-soname,librte_common_octeontx2.so.20.0 -Wl,--no-as-needed -pthread -lm -ldl -lnuma lib/librte_eal.so.20.0.1 lib/librte_kvargs.so.20.0.1 lib/librte_pci.so.20.0.1 lib/librte_ethdev.so.20.0.1 lib/librte_net.so.20.0.1 lib/librte_mbuf.so.20.0.1 lib/librte_mempool.so.20.0.1 lib/librte_ring.so.20.0.1 lib/librte_meter.so.20.0.1 -Wl,--end-group -Wl,--version-script=/root/UB1804-64_K4.15.0_GCC7.3.0/x86_64-native-linuxapp-gcc/9cb0fca1afb743dba7dd5e30971b17df/dpdk/drivers/common/octeontx2/rte_common_octeontx2_version.map '-Wl,-rpath,$ORIGIN/../lib' -Wl,-rpath-link,/root/UB1804-64_K4.15.0_GCC7.3.0/x86_64-native-linuxapp-gcc/9cb0fca1afb743dba7dd5e30971b17df/dpdk/build-gcc-static/lib 
drivers/a715181@@tmp_rte_common_octeontx2 at sta/common_octeontx2_otx2_mbox.c.o: In function `otx2_mbox_wait_for_rsp_tmo':
otx2_mbox.c:(.text+0x3ed): undefined reference to `rte_thread_is_intr'
collect2: error: ld returned 1 exit status
[489/2155] Compiling C object 'drivers/a715181@@tmp_rte_bus_dpaa at sta/bus_dpaa_base_qbman_bman.c.o'.
[490/2155] Compiling C object 'drivers/a715181@@tmp_rte_bus_dpaa at sta/bus_dpaa_base_fman_netcfg_layer.c.o'.
[491/2155] Compiling C object 'drivers/a715181@@tmp_rte_bus_dpaa at sta/bus_dpaa_base_fman_fman.c.o'.
[492/2155] Compiling C object 'drivers/a715181@@tmp_rte_bus_dpaa at sta/bus_dpaa_base_qbman_bman_driver.c.o'.
[493/2155] Compiling C object 'lib/76b5a35@@rte_pipeline at sta/librte_pipeline_rte_table_action.c.o'.
ninja: build stopped: subcommand failed




*Meson Build Failed #6:
OS: FreeBSD1201-64
Target:./build-gcc-static
FAILED: drivers/librte_common_octeontx2.so.20.0.1 
gcc  -o drivers/librte_common_octeontx2.so.20.0.1 'drivers/a715181@@rte_common_octeontx2 at sha/meson-generated_.._rte_common_octeontx2.pmd.c.o' 'drivers/a715181@@tmp_rte_common_octeontx2 at sta/common_octeontx2_otx2_dev.c.o' 'drivers/a715181@@tmp_rte_common_octeontx2 at sta/common_octeontx2_otx2_irq.c.o' 'drivers/a715181@@tmp_rte_common_octeontx2 at sta/common_octeontx2_otx2_mbox.c.o' 'drivers/a715181@@tmp_rte_common_octeontx2 at sta/common_octeontx2_otx2_common.c.o' -Wl,--as-needed -Wl,--no-undefined -Wl,-O1 -shared -fPIC -Wl,--start-group -Wl,-soname,librte_common_octeontx2.so.20.0 -Wl,--no-as-needed -pthread -lm -lexecinfo lib/librte_eal.so.20.0.1 lib/librte_kvargs.so.20.0.1 lib/librte_pci.so.20.0.1 lib/librte_ethdev.so.20.0.1 lib/librte_net.so.20.0.1 lib/librte_mbuf.so.20.0.1 lib/librte_mempool.so.20.0.1 lib/librte_ring.so.20.0.1 lib/librte_meter.so.20.0.1 -Wl,--end-group -Wl,--version-script=/root/FreeBSD1201-64_K12.1_GCC9.2.0/x86_64-native-bsdapp-gcc/9cb0fca1afb743dba7dd5e30971b17df/dpdk/drivers/common/octeontx2/rte_common_octeontx2_version.map '-Wl,-rpath,$ORIGIN/../lib' -Wl,-rpath-link,/root/FreeBSD1201-64_K12.1_GCC9.2.0/x86_64-native-bsdapp-gcc/9cb0fca1afb743dba7dd5e30971b17df/dpdk/build-gcc-static/lib
/usr/local/bin/ld: drivers/a715181@@tmp_rte_common_octeontx2 at sta/common_octeontx2_otx2_mbox.c.o: in function `otx2_mbox_wait_for_rsp_tmo':
otx2_mbox.c:(.text+0x3fd): undefined reference to `rte_thread_is_intr'
collect2: error: ld returned 1 exit status
[579/1634] Generating rte_bus_vdev.pmd.c with a custom command.
[580/1634] Generating rte_bus_pci.exp_chk with a meson_exe.py custom command.
[581/1634] Generating rte_pmd_bnx2x.exp_chk with a meson_exe.py custom command.
[582/1634] Compiling C object 'lib/76b5a35@@rte_pipeline at sta/librte_pipeline_rte_table_action.c.o'.
[583/1634] Compiling C object 'drivers/a715181@@tmp_rte_pmd_iavf at sta/net_iavf_iavf_rxtx_vec_avx2.c.o'.
ninja: build stopped: subcommand failed



DPDK STV team


More information about the test-report mailing list