[dpdk-test-report] |FAILURE| pw63757[2/3] crypto/kasumi: use IPSec library

sys_stv at intel.com sys_stv at intel.com
Fri Jan 24 10:36:37 CET 2020


Test-Label: Intel-compilation
Test-Status: FAILURE
http://dpdk.org/patch/63757

_Compilation issues_

Submitter: Pablo de Lara <pablo.de.lara.guarch at intel.com>
Date: 2019-12-11 14:20:43
Reply_mail: 1576074044-250855-3-git-send-email-pablo.de.lara.guarch at intel.com
DPDK git baseline: Repo:dpdk, CommitID: c465e6b94be343303303f26b95f3c2ae4969063e

Makefile build Summary: 23 Builds Done, 23 Successful, 0 Failures

Meson build Summary: 8 Builds Done, 7 Successful, 1 Failures

               +==============================================+===========+==========+
               |                   Makefile                   |   Meson   | Document |
+----------------+------+-------+------+------------+-----------+-----------+----------+
| os             | gcc  | clang | icc  | gcc+shared | gcc+debug | gcc/clang | pdf/html |
+----------------+------+-------+------+------------+-----------+-----------+----------+
| RHEL80-64      | pass |       |      |            |           |           |          |
| UB1804-64      | pass | pass  | pass |            |           | pass      | pass     |
| UB1604-32      | pass |       |      |            |           | pass      |          |
| CENTOS77-64    | pass | pass  | pass | pass       | pass      | pass      |          |
| UB1604-64      | pass | pass  |      |            |           |           |          |
| WIN10-64       |      |       |      |            |           | pass      |          |
| UB1910-64      | pass |       |      |            |           |           |          |
| FC31-64        | pass | pass  |      |            |           | FAIL      |          |
| CENTOS80-64    | pass |       |      |            |           |           |          |
| FreeBSD1201-64 | pass | pass  |      | pass       | pass      | pass      |          |
| RHEL77-64      | pass |       |      |            |           |           |          |
| SUSE15-64      | pass | pass  |      |            |           | pass      |          |
+----------------+------+-------+------+------------+-----------+-----------+----------+

Test environment and configuration as below:

** Makefile build **


OS: UB1804-64
	Kernel Version: 4.15.0-20-generic
	CPU info: Intel(R) Xeon(R) CPU E5-2699 v3 @ 2.30GHz
	GCC Version: gcc (Ubuntu 7.3.0-27ubuntu1~18.04) 7.3.0
	Clang Version: 6.0.0-1ubuntu2 (tags/RELEASE_600/final)
	x86_64-native-linuxapp-icc
	x86_64-native-linuxapp-clang
	x86_64-native-linuxapp-gcc


OS: UB1604-32
	Kernel Version: 4.4.0-131-generic
	CPU info: Intel(R) Xeon(R) CPU E5-2699 v3 @ 2.30GHz
	GCC Version: gcc (Ubuntu 5.4.0-6ubuntu1~16.04.11) 5.4.0 20160609
	Clang Version: 3.8.0-2ubuntu4 (tags/RELEASE_380/final)
	i686-native-linuxapp-gcc


OS: CENTOS77-64
	Kernel Version: 3.10.0-1062.9.1.el7.x86_64
	CPU info: Intel(R) Xeon(R) CPU E5-2699 v4 @ 2.20GHz
	GCC Version: gcc (GCC) 4.8.5 20150623 (Red Hat 4.8.5-39)
	Clang Version: 3.4.2 (tags/RELEASE_34/dot2-final)
	x86_64-native-linuxapp-gcc+debug
	x86_64-native-linuxapp-gcc+shared
	x86_64-native-linuxapp-gcc
	x86_64-native-linuxapp-clang
	x86_64-native-linuxapp-icc


OS: UB1910-64
	Kernel Version: 5.3.0-18-generic
	CPU info: Intel(R) Xeon(R) CPU E5-2699 v3 @ 2.30GHz
	GCC Version: gcc (Ubuntu 9.2.1-9ubuntu2) 9.2.1 20191008
	Clang Version: 9.0.0-2 (tags/RELEASE_900/final)
	x86_64-native-linuxapp-gcc


OS: CENTOS80-64
	Kernel Version: 4.18.0-80.11.2.el8_0.x86_64
	CPU info: Intel(R) Xeon(R) CPU E5-2699 v4 @ 2.20GHz
	GCC Version: gcc (GCC) 8.2.1 20180905 (Red Hat 8.2.1-3)
	Clang Version: 7.0.1 (tags/RELEASE_701/final)
	x86_64-native-linuxapp-gcc


OS: UB1604-64
	Kernel Version: 4.4.0-170-generic
	CPU info: Intel(R) Xeon(R) CPU E5-2699 v3 @ 2.30GHz
	GCC Version: gcc (Ubuntu 5.4.0-6ubuntu1~16.04.12) 5.4.0 20160609
	Clang Version: 3.8.0-2ubuntu4 (tags/RELEASE_380/final)
	x86_64-native-linuxapp-clang
	x86_64-native-linuxapp-gcc


OS: FC31-64
	Kernel Version: 5.3.15-300.fc31.x86_64
	CPU info: Intel(R) Xeon(R) CPU E5-2699 v4 @ 2.20GHz
	GCC Version: gcc (GCC) 9.2.1 20190827 (Red Hat 9.2.1-1)
	Clang Version: 9.0.0 (Fedora 9.0.0-1.fc31)
	x86_64-native-linuxapp-gcc
	x86_64-native-linuxapp-clang


OS: RHEL80-64
	Kernel Version: 4.18.0-80.el8.x86_64
	CPU info: Intel(R) Xeon(R) CPU E5-2699 v4 @ 2.20GHz
	GCC Version: gcc (GCC) 8.2.1 20180905 (Red Hat 8.2.1-3)
	Clang Version: 6.0.1 (tags/RELEASE_601/final)
	x86_64-native-linuxapp-gcc


OS: FreeBSD1201-64
	Kernel Version: 12.1-RELEASE
	CPU info: Intel(R) Xeon(R) CPU E5-2699 v4 @ 2.20GHz (2194.97-MHz K8-class CPU)
	GCC Version: gcc (FreeBSD Ports Collection) 9.2.0
	Clang Version: 8.0.1 (tags/RELEASE_801/final 366581) (based on LLVM 8.0.1)
	x86_64-native-bsdapp-gcc+debug
	x86_64-native-bsdapp-gcc+shared
	x86_64-native-bsdapp-gcc
	x86_64-native-bsdapp-clang


OS: RHEL77-64
	Kernel Version: 3.10.0-1062.9.1.el7.x86_64
	CPU info: Intel(R) Xeon(R) CPU E5-2699 v4 @ 2.20GHz
	GCC Version: gcc (GCC) 4.8.5 20150623 (Red Hat 4.8.5-39)
	Clang Version: 3.4.2 (tags/RELEASE_34/dot2-final)
	x86_64-native-linuxapp-gcc


OS: SUSE15-64
	Kernel Version: 4.12.14-lp150.11-default
	CPU info: Intel(R) Xeon(R) CPU E5-2699 v4 @ 2.20GHz
	GCC Version: gcc (SUSE Linux) 7.3.1 20180323 [gcc-7-branch revision 258812]
	Clang Version: 5.0.1 (tags/RELEASE_501/final 312548)
	x86_64-native-linuxapp-gcc
	x86_64-native-linuxapp-clang


** Meson build **


OS: UB1804-64
	Kernel Version: 4.15.0-20-generic
	CPU info: Intel(R) Xeon(R) CPU E5-2699 v4 @ 2.20GHz
	GCC Version: gcc (Ubuntu 7.3.0-27ubuntu1~18.04) 7.3.0
	Clang Version: 6.0.0-1ubuntu2 (tags/RELEASE_600/final)
	x86_64-native-linuxapp-doc
	./build-gcc-static
	./build-gcc-shared
	./build-clang-static
	./build-clang-shared
	./build-x86-default


OS: UB1604-32
	Kernel Version: 4.4.0-131-generic
	CPU info: Intel(R) Xeon(R) CPU E5-2699 v4 @ 2.20GHz
	GCC Version: gcc (Ubuntu 5.4.0-6ubuntu1~16.04.11) 5.4.0 20160609
	Clang Version: 3.8.0-2ubuntu4 (tags/RELEASE_380/final)
	./build-gcc-static
	./build-gcc-shared
	./build-clang-static
	./build-clang-shared
	./build-x86-default


OS: CENTOS77-64
	Kernel Version: 3.10.0-1062.9.1.el7.x86_64
	CPU info: Intel(R) Xeon(R) CPU E5-2699 v4 @ 2.20GHz
	GCC Version: gcc (GCC) 4.8.5 20150623 (Red Hat 4.8.5-39)
	Clang Version: 3.4.2 (tags/RELEASE_34/dot2-final)
	./build-gcc-static
	./build-gcc-shared
	./build-clang-static
	./build-clang-shared
	./build-x86-default


OS: WIN10-64
	Kernel Version: N/A
	CPU info: N/A
	GCC Version: N/A
	Clang Version: Clang 8.0.0
	x86_64-windows-clang


OS: FC31-64
	Kernel Version: 5.3.14-300.fc31.x86_64
	CPU info: Intel(R) Xeon(R) CPU E5-2699 v4 @ 2.20GHz
	GCC Version: gcc (GCC) 9.2.1 20190827 (Red Hat 9.2.1-1)
	Clang Version: 9.0.0 (Fedora 9.0.0-1.fc31)
	./build-gcc-static
	./build-gcc-shared
	./build-clang-static
	./build-clang-shared
	./build-x86-default


OS: FreeBSD1201-64
	Kernel Version: 12.1-RELEASE
	CPU info: Intel(R) Xeon(R) CPU E5-2699 v4 @ 2.20GHz (2194.97-MHz K8-class CPU)
	GCC Version: gcc (FreeBSD Ports Collection) 9.2.0
	Clang Version: 8.0.1 (tags/RELEASE_801/final 366581) (based on LLVM 8.0.1)
	./build-gcc-static
	./build-gcc-shared
	./build-clang-static
	./build-clang-shared
	./build-x86-default


OS: SUSE15-64
	Kernel Version: 4.12.14-lp150.11-default
	CPU info: Intel(R) Xeon(R) CPU E5-2699 v4 @ 2.20GHz
	GCC Version: gcc (SUSE Linux) 7.3.1 20180323 [gcc-7-branch revision 258812]
	Clang Version: 5.0.1 (tags/RELEASE_501/final 312548)
	./build-gcc-static
	./build-gcc-shared
	./build-clang-static
	./build-clang-shared
	./build-x86-default


*Meson Build Failed #1:
OS: FC31-64
Target:./build-gcc-static
[1671/2246] Linking static target drivers/librte_pmd_virtio_crypto.a.
[1672/2246] Generating rte_pmd_octeontx2_crypto.exp_chk with a meson_exe.py custom command.
[1673/2246] Generating rte_pmd_octeontx_crypto.exp_chk with a meson_exe.py custom command.
[1674/2246] Linking target drivers/librte_pmd_octeontx2_crypto.so.20.0.1.
[1675/2246] Compiling C object 'drivers/a715181@@tmp_rte_pmd_zuc at sta/crypto_zuc_rte_zuc_pmd.c.o'.
FAILED: drivers/a715181@@tmp_rte_pmd_zuc at sta/crypto_zuc_rte_zuc_pmd.c.o 
clang -Idrivers/a715181@@tmp_rte_pmd_zuc at sta -Idrivers -I../drivers -Idrivers/crypto/zuc -I../drivers/crypto/zuc -Ilib/librte_cryptodev -I../lib/librte_cryptodev -I. -I../ -Iconfig -I../config -Ilib/librte_eal/common/include -I../lib/librte_eal/common/include -I../lib/librte_eal/linux/eal/include -Ilib/librte_eal/common -I../lib/librte_eal/common -Ilib/librte_eal/common/include/arch/x86 -I../lib/librte_eal/common/include/arch/x86 -Ilib/librte_eal -I../lib/librte_eal -Ilib/librte_kvargs -I../lib/librte_kvargs -Ilib/librte_mbuf -I../lib/librte_mbuf -Ilib/librte_mempool -I../lib/librte_mempool -Ilib/librte_ring -I../lib/librte_ring -Idrivers/bus/vdev -I../drivers/bus/vdev -Xclang -fcolor-diagnostics -pipe -D_FILE_OFFSET_BITS=64 -Wall -Winvalid-pch -Werror -O3 -include rte_config.h -Wextra -Wcast-qual -Wdeprecated -Wformat-nonliteral -Wformat-security -Wmissing-declarations -Wmissing-prototypes -Wnested-externs -Wold-style-definition -Wpointer-arith -Wsign-compare -Wstrict-prototypes -Wundef -Wwrite-strings -Wno-address-of-packed-member -Wno-missing-field-initializers -D_GNU_SOURCE -fPIC -march=native -DALLOW_EXPERIMENTAL_API -MD -MQ 'drivers/a715181@@tmp_rte_pmd_zuc at sta/crypto_zuc_rte_zuc_pmd.c.o' -MF 'drivers/a715181@@tmp_rte_pmd_zuc at sta/crypto_zuc_rte_zuc_pmd.c.o.d' -o 'drivers/a715181@@tmp_rte_pmd_zuc at sta/crypto_zuc_rte_zuc_pmd.c.o' -c ../drivers/crypto/zuc/rte_zuc_pmd.c
../drivers/crypto/zuc/rte_zuc_pmd.c:225:51: error: cast from 'uint8_t **' (aka 'unsigned char **') to 'const void **' must have all intermediate pointers const qualified to be safe [-Werror,-Wcast-qual]
        IMB_ZUC_EEA3_N_BUFFER(qp->mb_mgr, (const void **)cipher_keys,
                                                         ^
../drivers/crypto/zuc/rte_zuc_pmd.c:226:19: error: cast from 'uint8_t **' (aka 'unsigned char **') to 'const void **' must have all intermediate pointers const qualified to be safe [-Werror,-Wcast-qual]
--
[1678/2246] Compiling C object 'drivers/a715181@@tmp_rte_pmd_zuc at sta/crypto_zuc_rte_zuc_pmd_ops.c.o'.
[1679/2246] Generating rte_pmd_virtio_crypto.exp_chk with a meson_exe.py custom command.
[1680/2246] Compiling C object 'drivers/a715181@@tmp_rte_pmd_isal at sta/compress_isal_isal_compress_pmd.c.o'.
[1681/2246] Compiling C object 'drivers/a715181@@tmp_rte_pmd_octeontx_compress at sta/compress_octeontx_otx_zip_pmd.c.o'.
[1682/2246] Compiling C object 'drivers/a715181@@tmp_rte_pmd_octeontx_compress at sta/compress_octeontx_otx_zip.c.o'.
ninja: build stopped: subcommand failed.
meson --werror -Dexamples=all --default-library=shared /root/FC31-64_K5.3.14_GCC9.2.1/x86_64-native-linuxapp-gcc/fad18d97c80c438aa6e9bd69c68e8311/dpdk/devtools/.. ./build-clang-shared
The Meson build system
Version: 0.52.1
Source dir: /root/FC31-64_K5.3.14_GCC9.2.1/x86_64-native-linuxapp-gcc/fad18d97c80c438aa6e9bd69c68e8311/dpdk
Build dir: /root/FC31-64_K5.3.14_GCC9.2.1/x86_64-native-linuxapp-gcc/fad18d97c80c438aa6e9bd69c68e8311/dpdk/build-clang-shared
--
[1686/2274] Compiling C object 'drivers/a715181@@rte_pmd_virtio_crypto at sta/meson-generated_.._rte_pmd_virtio_crypto.pmd.c.o'.
[1687/2274] Linking static target drivers/librte_pmd_virtio_crypto.a.
[1688/2274] Generating rte_pmd_octeontx2_crypto.pmd.c with a custom command.
[1689/2274] Compiling C object 'drivers/a715181@@tmp_rte_pmd_isal at sta/compress_isal_isal_compress_pmd_ops.c.o'.
[1690/2274] Compiling C object 'drivers/a715181@@tmp_rte_pmd_zuc at sta/crypto_zuc_rte_zuc_pmd.c.o'.
FAILED: drivers/a715181@@tmp_rte_pmd_zuc at sta/crypto_zuc_rte_zuc_pmd.c.o 
clang -Idrivers/a715181@@tmp_rte_pmd_zuc at sta -Idrivers -I../drivers -Idrivers/crypto/zuc -I../drivers/crypto/zuc -Ilib/librte_cryptodev -I../lib/librte_cryptodev -I. -I../ -Iconfig -I../config -Ilib/librte_eal/common/include -I../lib/librte_eal/common/include -I../lib/librte_eal/linux/eal/include -Ilib/librte_eal/common -I../lib/librte_eal/common -Ilib/librte_eal/common/include/arch/x86 -I../lib/librte_eal/common/include/arch/x86 -Ilib/librte_eal -I../lib/librte_eal -Ilib/librte_kvargs -I../lib/librte_kvargs -Ilib/librte_mbuf -I../lib/librte_mbuf -Ilib/librte_mempool -I../lib/librte_mempool -Ilib/librte_ring -I../lib/librte_ring -Idrivers/bus/vdev -I../drivers/bus/vdev -Xclang -fcolor-diagnostics -pipe -D_FILE_OFFSET_BITS=64 -Wall -Winvalid-pch -Werror -O3 -include rte_config.h -Wextra -Wcast-qual -Wdeprecated -Wformat-nonliteral -Wformat-security -Wmissing-declarations -Wmissing-prototypes -Wnested-externs -Wold-style-definition -Wpointer-arith -Wsign-compare -Wstrict-prototypes -Wundef -Wwrite-strings -Wno-address-of-packed-member -Wno-missing-field-initializers -D_GNU_SOURCE -fPIC -march=native -DALLOW_EXPERIMENTAL_API -MD -MQ 'drivers/a715181@@tmp_rte_pmd_zuc at sta/crypto_zuc_rte_zuc_pmd.c.o' -MF 'drivers/a715181@@tmp_rte_pmd_zuc at sta/crypto_zuc_rte_zuc_pmd.c.o.d' -o 'drivers/a715181@@tmp_rte_pmd_zuc at sta/crypto_zuc_rte_zuc_pmd.c.o' -c ../drivers/crypto/zuc/rte_zuc_pmd.c
../drivers/crypto/zuc/rte_zuc_pmd.c:225:51: error: cast from 'uint8_t **' (aka 'unsigned char **') to 'const void **' must have all intermediate pointers const qualified to be safe [-Werror,-Wcast-qual]
        IMB_ZUC_EEA3_N_BUFFER(qp->mb_mgr, (const void **)cipher_keys,
                                                         ^
../drivers/crypto/zuc/rte_zuc_pmd.c:226:19: error: cast from 'uint8_t **' (aka 'unsigned char **') to 'const void **' must have all intermediate pointers const qualified to be safe [-Werror,-Wcast-qual]
--
[1693/2274] Compiling C object 'drivers/a715181@@tmp_rte_pmd_zuc at sta/crypto_zuc_rte_zuc_pmd_ops.c.o'.
[1694/2274] Compiling C object 'drivers/a715181@@rte_pmd_octeontx2_crypto at sta/meson-generated_.._rte_pmd_octeontx2_crypto.pmd.c.o'.
[1695/2274] Generating rte_pmd_virtio_crypto.exp_chk with a meson_exe.py custom command.
[1696/2274] Compiling C object 'drivers/a715181@@tmp_rte_pmd_octeontx_crypto at sta/crypto_octeontx_otx_cryptodev_ops.c.o'.
[1697/2274] Compiling C object 'drivers/a715181@@tmp_rte_pmd_isal at sta/compress_isal_isal_compress_pmd.c.o'.
ninja: build stopped: subcommand failed.
meson --werror -Dexamples=all -Dlibdir=lib -Dmachine=nehalem --default-library=shared /root/FC31-64_K5.3.14_GCC9.2.1/x86_64-native-linuxapp-gcc/fad18d97c80c438aa6e9bd69c68e8311/dpdk/devtools/.. ./build-x86-default
The Meson build system
Version: 0.52.1
Source dir: /root/FC31-64_K5.3.14_GCC9.2.1/x86_64-native-linuxapp-gcc/fad18d97c80c438aa6e9bd69c68e8311/dpdk
Build dir: /root/FC31-64_K5.3.14_GCC9.2.1/x86_64-native-linuxapp-gcc/fad18d97c80c438aa6e9bd69c68e8311/dpdk/build-x86-default

DPDK STV team


More information about the test-report mailing list