[dpdk-test-report] |FAILURE| pw(72844) [v2, 2/2] test/ring: rearrange names for ring stress tests

sys_stv at intel.com sys_stv at intel.com
Sat Jul 4 08:01:17 CEST 2020


Test-Label: Intel-compilation
Test-Status: FAILURE
http://dpdk.org/patch/72844

_Compilation issues_

Submitter: Konstantin Ananyev <konstantin.ananyev at intel.com>
Date: 2020-07-02 14:10:27
Reply_mail: 20200702141027.18447-3-konstantin.ananyev at intel.com

DPDK git baseline: Repo:dpdk, CommitID: 24cd1b529f35f106d323ebdd4df0203261824dcc


Meson build Summary: 8 Builds Done, 6 Successful, 2 Failures, 0 Blocked

Makefile build Summary: 20 Builds Done, 18 Successful, 2 Failures, 0 Blocked

                +==============================================+===========+==========+
                |                   Makefile                   |   Meson   | Document |
+----------------+------+-------+------+------------+-----------+-----------+----------+
| os             | gcc  | clang | icc  | gcc+shared | gcc+debug | gcc/clang | pdf/html |
+----------------+------+-------+------+------------+-----------+-----------+----------+
| CENTOS82-64    | pass | pass  | pass | pass       | pass      | pass      |          |
| RHEL82-64      | pass |       |      |            |           |           |          |
| UB1804-64      | pass |       |      |            |           |           |          |
| FC32-64        | FAIL | pass  |      |            |           | FAIL      |          |
| CENTOS77-64    | pass |       |      |            |           |           |          |
| UB2004-64      | FAIL | pass  | pass |            |           | pass      | pass     |
| WIN10-64       |      |       |      |            |           | pass      |          |
| UB2004-32      | pass |       |      |            |           |           |          |
| UB1804-32      |      |       |      |            |           | FAIL      |          |
| FreeBSD1201-64 | pass | pass  |      | pass       | pass      | pass      |          |
| SUSE15-64      | pass | pass  |      |            |           | pass      |          |
+----------------+------+-------+------+------------+-----------+-----------+----------+
Test environment and configuration as below:

** Makefile build **


OS: CENTOS82-64
	Kernel Version: 4.18.0-193.el8.x86_64
	CPU info: Intel(R) Xeon(R) Platinum 8280M CPU @ 2.70GHz
	GCC Version: gcc (GCC) 8.3.1 20191121 (Red Hat 8.3.1-5)
	Clang Version: 9.0.1 (Red Hat 9.0.1-2.module_el8.2.0+309+0c7b6b03)
	x86_64-native-linuxapp-gcc
	x86_64-native-linuxapp-clang
	x86_64-native-linuxapp-icc
	x86_64-native-linuxapp-gcc+shared
	x86_64-native-linuxapp-gcc+debug


OS: RHEL82-64
	Kernel Version: 4.18.0-193.el8.x86_64
	CPU info: Intel(R) Xeon(R) Platinum 8280M CPU @ 2.70GHz
	GCC Version: gcc (GCC) 8.3.1 20191121 (Red Hat 8.3.1-5)
	Clang Version: 8.0.1 (Red Hat 8.0.1-1.module_el8.1.0+215+a01033fb)
	x86_64-native-linuxapp-gcc


OS: UB1804-64
	Kernel Version: 4.15.0-29-generic
	CPU info: Intel(R) Xeon(R) Platinum 8180 CPU @ 2.50GHz
	GCC Version: gcc (Ubuntu 7.5.0-3ubuntu1~18.04) 7.5.0
	Clang Version: 6.0.0-1ubuntu2 (tags/RELEASE_600/final)
	x86_64-native-linuxapp-gcc


OS: FC32-64
	Kernel Version: 5.6.0-0.rc7.git0.2.fc32.x86_64
	CPU info: Intel(R) Xeon(R) Platinum 8280M CPU @ 2.70GHz
	GCC Version: gcc (GCC) 10.0.1 20200311 (Red Hat 10.0.1-0.9)
	Clang Version: 10.0.0 (Fedora 10.0.0-0.3.rc4.fc32)
	x86_64-native-linuxapp-gcc
	x86_64-native-linuxapp-clang


OS: CENTOS77-64
	Kernel Version: 3.10.0-1062.9.1.el7.x86_64
	CPU info: Intel(R) Xeon(R) Platinum 8280M CPU @ 2.70GHz
	GCC Version: gcc (GCC) 4.8.5 20150623 (Red Hat 4.8.5-39)
	Clang Version: 3.4.2 (tags/RELEASE_34/dot2-final)
	x86_64-native-linuxapp-gcc


OS: UB2004-64
	Kernel Version: 5.4.0-26-generic
	CPU info: Intel(R) Xeon(R) Platinum 8180 CPU @ 2.50GHz
	GCC Version: gcc (Ubuntu 10-20200416-0ubuntu1) 10.0.1 20200416 (experimental) [master revision 3c3f12e2a76:dcee354ce56:44b326839d864fc10c459916abcc97f35a9ac3de]
	Clang Version: 10.0.0-4ubuntu1
	x86_64-native-linuxapp-clang
	x86_64-native-linuxapp-gcc
	x86_64-native-linuxapp-icc


OS: UB2004-32
	Kernel Version: 5.4.0-26-generic
	CPU info: Intel(R) Xeon(R) Platinum 8180 CPU @ 2.50GHz
	GCC Version: gcc (Ubuntu 9.3.0-10ubuntu2) 9.3.0
	Clang Version: 10.0.0-4ubuntu1
	i686-native-linuxapp-gcc


OS: FreeBSD1201-64
	Kernel Version: 12.1-RELEASE
	CPU info: Intel(R) Xeon(R) CPU E5-2699 v3 @ 2.30GHz (2294.74-MHz K8-class CPU)
	GCC Version: gcc (FreeBSD Ports Collection) 9.2.0
	Clang Version: 8.0.1 (tags/RELEASE_801/final 366581) (based on LLVM 8.0.1)
	x86_64-native-bsdapp-gcc
	x86_64-native-bsdapp-clang
	x86_64-native-bsdapp-gcc+shared
	x86_64-native-bsdapp-gcc+debug


OS: SUSE15-64
	Kernel Version: 4.12.14-lp150.11-default
	CPU info: Intel(R) Xeon(R) CPU E5-2699 v4 @ 2.20GHz
	GCC Version: gcc (SUSE Linux) 7.3.1 20180323 [gcc-7-branch revision 258812]
	Clang Version: 5.0.1 (tags/RELEASE_501/final 312548)
	x86_64-native-linuxapp-clang
	x86_64-native-linuxapp-gcc

** Meson build **


OS: CENTOS82-64
	Kernel Version: 4.18.0-193.el8.x86_64
	CPU info: Intel(R) Xeon(R) CPU E5-2699 v4 @ 2.20GHz
	GCC Version: gcc (GCC) 8.3.1 20191121 (Red Hat 8.3.1-5)
	Clang Version: 9.0.1 (Red Hat 9.0.1-2.module_el8.2.0+309+0c7b6b03)
	./build-gcc-static
	./build-gcc-shared
	./build-clang-static
	./build-clang-shared
	./build-x86-default


OS: UB2004-64
	Kernel Version: 5.4.0-26-generic
	CPU info: Intel(R) Xeon(R) Platinum 8180 CPU @ 2.50GHz
	GCC Version: gcc (Ubuntu 9.3.0-10ubuntu2) 9.3.0
	Clang Version: 10.0.0-4ubuntu1
	x86_64-native-linuxapp-doc
	./build-gcc-static
	./build-gcc-shared
	./build-clang-static
	./build-clang-shared
	./build-x86-default


OS: FC32-64
	Kernel Version: 5.6.0-0.rc7.git0.2.fc32.x86_64
	CPU info: Intel(R) Xeon(R) CPU E5-2699 v4 @ 2.20GHz
	GCC Version: gcc (GCC) 10.0.1 20200311 (Red Hat 10.0.1-0.9)
	Clang Version: 10.0.0 (Fedora 10.0.0-0.3.rc4.fc32)
	./build-gcc-static
	./build-gcc-shared
	./build-clang-static
	./build-clang-shared
	./build-x86-default


OS: WIN10-64
	Kernel Version: N/A
	CPU info: N/A
	GCC Version: N/A
	Clang Version: Clang 8.0.0
	x86_64-windows-clang


OS: UB1804-32
	Kernel Version: 4.15.0-20-generic
	CPU info: Intel(R) Xeon(R) CPU E5-2699 v4 @ 2.20GHz
	GCC Version: gcc (Ubuntu 7.5.0-3ubuntu1~18.04) 7.5.0
	Clang Version: 6.0.0-1ubuntu2 (tags/RELEASE_600/final)
	./build-gcc-static
	./build-gcc-shared
	./build-clang-static
	./build-clang-shared
	./build-x86-default


OS: FreeBSD1201-64
	Kernel Version: 12.1-RELEASE
	CPU info: Intel(R) Xeon(R) CPU E5-2699 v4 @ 2.20GHz (2194.97-MHz K8-class CPU)
	GCC Version: gcc (FreeBSD Ports Collection) 9.2.0
	Clang Version: 8.0.1 (tags/RELEASE_801/final 366581) (based on LLVM 8.0.1)
	./build-gcc-static
	./build-gcc-shared
	./build-clang-static
	./build-clang-shared
	./build-x86-default


OS: SUSE15-64
	Kernel Version: 4.12.14-lp150.12.82-default
	CPU info: Intel(R) Xeon(R) CPU E5-2699 v4 @ 2.20GHz
	GCC Version: gcc (SUSE Linux) 7.4.1 20190905 [gcc-7-branch revision 275407]
	Clang Version: 5.0.1 (tags/RELEASE_501/final 312548)
	./build-gcc-static
	./build-gcc-shared
	./build-clang-static
	./build-clang-shared
	./build-x86-default



*Meson Build Failed #1:
OS: FC32-64
Target:./build-gcc-static
FAILED: drivers/librte_pmd_bnxt.so.20.0.2 
gcc  -o drivers/librte_pmd_bnxt.so.20.0.2 'drivers/a715181@@rte_pmd_bnxt at sha/meson-generated_.._rte_pmd_bnxt.pmd.c.o' 'drivers/a715181@@tmp_rte_pmd_bnxt at sta/net_bnxt_bnxt_cpr.c.o' 'drivers/a715181@@tmp_rte_pmd_bnxt at sta/net_bnxt_bnxt_ethdev.c.o' 'drivers/a715181@@tmp_rte_pmd_bnxt at sta/net_bnxt_bnxt_filter.c.o' 'drivers/a715181@@tmp_rte_pmd_bnxt at sta/net_bnxt_bnxt_flow.c.o' 'drivers/a715181@@tmp_rte_pmd_bnxt at sta/net_bnxt_bnxt_hwrm.c.o' 'drivers/a715181@@tmp_rte_pmd_bnxt at sta/net_bnxt_bnxt_irq.c.o' 'drivers/a715181@@tmp_rte_pmd_bnxt at sta/net_bnxt_bnxt_ring.c.o' 'drivers/a715181@@tmp_rte_pmd_bnxt at sta/net_bnxt_bnxt_rxq.c.o' 'drivers/a715181@@tmp_rte_pmd_bnxt at sta/net_bnxt_bnxt_rxr.c.o' 'drivers/a715181@@tmp_rte_pmd_bnxt at sta/net_bnxt_bnxt_stats.c.o' 'drivers/a715181@@tmp_rte_pmd_bnxt at sta/net_bnxt_bnxt_txq.c.o' 'drivers/a715181@@tmp_rte_pmd_bnxt at sta/net_bnxt_bnxt_txr.c.o' 'drivers/a715181@@tmp_rte_pmd_bnxt at sta/net_bnxt_bnxt_util.c.o' 'drivers/a715181@@tmp_rte_pmd_bnxt at sta/net_bnxt_bnxt_vnic.c.o' 'drivers/a715181@@tmp_rte_pmd_bnxt at sta/net_bnxt_tf_core_tf_core.c.o' 'drivers/a715181@@tmp_rte_pmd_bnxt at sta/net_bnxt_tf_core_bitalloc.c.o' 'drivers/a715181@@tmp_rte_pmd_bnxt at sta/net_bnxt_tf_core_tf_msg.c.o' 'drivers/a715181@@tmp_rte_pmd_bnxt at sta/net_bnxt_tf_core_rand.c.o' 'drivers/a715181@@tmp_rte_pmd_bnxt at sta/net_bnxt_tf_core_stack.c.o' 'drivers/a715181@@tmp_rte_pmd_bnxt at sta/net_bnxt_tf_core_tf_em.c.o' 'drivers/a715181@@tmp_rte_pmd_bnxt at sta/net_bnxt_tf_core_tf_rm.c.o' 'drivers/a715181@@tmp_rte_pmd_bnxt at sta/net_bnxt_tf_core_tf_tbl.c.o' 'drivers/a715181@@tmp_rte_pmd_bnxt at sta/net_bnxt_tf_core_tfp.c.o' 'drivers/a715181@@tmp_rte_pmd_bnxt at sta/net_bnxt_tf_ulp_bnxt_ulp.c.o' 'drivers/a715181@@tmp_rte_pmd_bnxt at sta/net_bnxt_tf_ulp_ulp_mark_mgr.c.o' 'drivers/a715181@@tmp_rte_pmd_bnxt at sta/net_bnxt_tf_ulp_ulp_flow_db.c.o' 'drivers/a715181@@tmp_rte_pmd_bnxt at sta/net_bnxt_tf_ulp_ulp_template_db.c.o' 'drivers/a715181@@tmp_rte_pmd_bnxt at sta/net_bnxt_tf_ulp_ulp_utils.c.o' 'drivers/a715181@@tmp_rte_pmd_bnxt at sta/net_bnxt_tf_ulp_ulp_mapper.c.o' 'drivers/a715181@@tmp_rte_pmd_bnxt at sta/net_bnxt_tf_ulp_ulp_matcher.c.o' 'drivers/a715181@@tmp_rte_pmd_bnxt at sta/net_bnxt_tf_ulp_ulp_rte_parser.c.o' 'drivers/a715181@@tmp_rte_pmd_bnxt at sta/net_bnxt_tf_ulp_bnxt_ulp_flow.c.o' 'drivers/a715181@@tmp_rte_pmd_bnxt at sta/net_bnxt_tf_ulp_ulp_port_db.c.o' 'drivers/a715181@@tmp_rte_pmd_bnxt at sta/net_bnxt_rte_pmd_bnxt.c.o' 'drivers/a715181@@tmp_rte_pmd_bnxt at sta/net_bnxt_bnxt_rxtx_vec_sse.c.o' -Wl,--as-needed -Wl,--no-undefined -shared -fPIC -Wl,--start-group -Wl,-soname,librte_pmd_bnxt.so.20.0 -Wl,--no-as-needed -pthread -lm -ldl -lnuma lib/librte_ethdev.so.20.0.2 lib/librte_eal.so.20.0.2 lib/librte_kvargs.so.20.0.2 lib/librte_telemetry.so.0.200.2 lib/librte_net.so.20.0.2 lib/librte_mbuf.so.20.0.2 lib/librte_mempool.so.20.0.2 lib/librte_ring.so.20.0.2 lib/librte_meter.so.20.0.2 drivers/librte_bus_pci.so.20.0.2 lib/librte_pci.so.20.0.2 drivers/librte_bus_vdev.so.20.0.2 -Wl,--end-group -Wl,--version-script=/root/FC32-64_K5.6.0_GCC10.0.1/x86_64-native-linuxapp-gcc/24f13610eb684d6f8723171e16a4c9bf/dpdk/drivers/net/bnxt/rte_pmd_bnxt_version.map '-Wl,-rpath,$ORIGIN/../lib:$ORIGIN/' -Wl,-rpath-link,/root/FC32-64_K5.6.0_GCC10.0.1/x86_64-native-linuxapp-gcc/24f13610eb684d6f8723171e16a4c9bf/dpdk/build-gcc-static/lib -Wl,-rpath-link,/root/FC32-64_K5.6.0_GCC10.0.1/x86_64-native-linuxapp-gcc/24f13610eb684d6f8723171e16a4c9bf/dpdk/build-gcc-static/drivers
/usr/bin/ld: drivers/a715181@@tmp_rte_pmd_bnxt at sta/net_bnxt_tf_core_tf_tbl.c.o:/root/FC32-64_K5.6.0_GCC10.0.1/x86_64-native-linuxapp-gcc/24f13610eb684d6f8723171e16a4c9bf/dpdk/build-gcc-static/../drivers/net/bnxt/tf_core/hwrm_tf.h:994: multiple definition of `p994'; drivers/a715181@@tmp_rte_pmd_bnxt at sta/net_bnxt_tf_core_tf_msg.c.o:/root/FC32-64_K5.6.0_GCC10.0.1/x86_64-native-linuxapp-gcc/24f13610eb684d6f8723171e16a4c9bf/dpdk/build-gcc-static/../drivers/net/bnxt/tf_core/hwrm_tf.h:994: first defined here
/usr/bin/ld: drivers/a715181@@tmp_rte_pmd_bnxt at sta/net_bnxt_tf_core_tf_tbl.c.o:/root/FC32-64_K5.6.0_GCC10.0.1/x86_64-native-linuxapp-gcc/24f13610eb684d6f8723171e16a4c9bf/dpdk/build-gcc-static/../drivers/net/bnxt/tf_core/hwrm_tf.h:975: multiple definition of `p975'; drivers/a715181@@tmp_rte_pmd_bnxt at sta/net_bnxt_tf_core_tf_msg.c.o:/root/FC32-64_K5.6.0_GCC10.0.1/x86_64-native-linuxapp-gcc/24f13610eb684d6f8723171e16a4c9bf/dpdk/build-gcc-static/../drivers/net/bnxt/tf_core/hwrm_tf.h:975: first defined here
/usr/bin/ld: drivers/a715181@@tmp_rte_pmd_bnxt at sta/net_bnxt_tf_core_tf_tbl.c.o:/root/FC32-64_K5.6.0_GCC10.0.1/x86_64-native-linuxapp-gcc/24f13610eb684d6f8723171e16a4c9bf/dpdk/build-gcc-static/../drivers/net/bnxt/tf_core/hwrm_tf.h:966: multiple definition of `p966'; drivers/a715181@@tmp_rte_pmd_bnxt at sta/net_bnxt_tf_core_tf_msg.c.o:/root/FC32-64_K5.6.0_GCC10.0.1/x86_64-native-linuxapp-gcc/24f13610eb684d6f8723171e16a4c9bf/dpdk/build-gcc-static/../drivers/net/bnxt/tf_core/hwrm_tf.h:966: first defined here
/usr/bin/ld: drivers/a715181@@tmp_rte_pmd_bnxt at sta/net_bnxt_tf_core_tf_tbl.c.o:/root/FC32-64_K5.6.0_GCC10.0.1/x86_64-native-linuxapp-gcc/24f13610eb684d6f8723171e16a4c9bf/dpdk/build-gcc-static/../drivers/net/bnxt/tf_core/hwrm_tf.h:943: multiple definition of `p943'; drivers/a715181@@tmp_rte_pmd_bnxt at sta/net_bnxt_tf_core_tf_msg.c.o:/root/FC32-64_K5.6.0_GCC10.0.1/x86_64-native-linuxapp-gcc/24f13610eb684d6f8723171e16a4c9bf/dpdk/build-gcc-static/../drivers/net/bnxt/tf_core/hwrm_tf.h:943: first defined here
/usr/bin/ld: drivers/a715181@@tmp_rte_pmd_bnxt at sta/net_bnxt_tf_core_tf_tbl.c.o:/root/FC32-64_K5.6.0_GCC10.0.1/x86_64-native-linuxapp-gcc/24f13610eb684d6f8723171e16a4c9bf/dpdk/build-gcc-static/../drivers/net/bnxt/tf_core/hwrm_tf.h:934: multiple definition of `p934'; drivers/a715181@@tmp_rte_pmd_bnxt at sta/net_bnxt_tf_core_tf_msg.c.o:/root/FC32-64_K5.6.0_GCC10.0.1/x86_64-native-linuxapp-gcc/24f13610eb684d6f8723171e16a4c9bf/dpdk/build-gcc-static/../drivers/net/bnxt/tf_core/hwrm_tf.h:934: first defined here
/usr/bin/ld: drivers/a715181@@tmp_rte_pmd_bnxt at sta/net_bnxt_tf_core_tf_tbl.c.o:/root/FC32-64_K5.6.0_GCC10.0.1/x86_64-native-linuxapp-gcc/24f13610eb684d6f8723171e16a4c9bf/dpdk/build-gcc-static/../drivers/net/bnxt/tf_core/hwrm_tf.h:917: multiple definition of `p917'; drivers/a715181@@tmp_rte_pmd_bnxt at sta/net_bnxt_tf_core_tf_msg.c.o:/root/FC32-64_K5.6.0_GCC10.0.1/x86_64-native-linuxapp-gcc/24f13610eb684d6f8723171e16a4c9bf/dpdk/build-gcc-static/../drivers/net/bnxt/tf_core/hwrm_tf.h:917: first defined here
/usr/bin/ld: drivers/a715181@@tmp_rte_pmd_bnxt at sta/net_bnxt_tf_core_tf_tbl.c.o:/root/FC32-64_K5.6.0_GCC10.0.1/x86_64-native-linuxapp-gcc/24f13610eb684d6f8723171e16a4c9bf/dpdk/build-gcc-static/../drivers/net/bnxt/tf_core/hwrm_tf.h:896: multiple definition of `p896'; drivers/a715181@@tmp_rte_pmd_bnxt at sta/net_bnxt_tf_core_tf_msg.c.o:/root/FC32-64_K5.6.0_GCC10.0.1/x86_64-native-linuxapp-gcc/24f13610eb684d6f8723171e16a4c9bf/dpdk/build-gcc-static/../drivers/net/bnxt/tf_core/hwrm_tf.h:896: first defined here
/usr/bin/ld: drivers/a715181@@tmp_rte_pmd_bnxt at sta/net_bnxt_tf_core_tf_tbl.c.o:/root/FC32-64_K5.6.0_GCC10.0.1/x86_64-native-linuxapp-gcc/24f13610eb684d6f8723171e16a4c9bf/dpdk/build-gcc-static/../drivers/net/bnxt/tf_core/hwrm_tf.h:828: multiple definition of `p828'; drivers/a715181@@tmp_rte_pmd_bnxt at sta/net_bnxt_tf_core_tf_msg.c.o:/root/FC32-64_K5.6.0_GCC10.0.1/x86_64-native-linuxapp-gcc/24f13610eb684d6f8723171e16a4c9bf/dpdk/build-gcc-static/../drivers/net/bnxt/tf_core/hwrm_tf.h:828: first defined here
/usr/bin/ld: drivers/a715181@@tmp_rte_pmd_bnxt at sta/net_bnxt_tf_core_tf_tbl.c.o:/root/FC32-64_K5.6.0_GCC10.0.1/x86_64-native-linuxapp-gcc/24f13610eb684d6f8723171e16a4c9bf/dpdk/build-gcc-static/../drivers/net/bnxt/tf_core/hwrm_tf.h:760: multiple definition of `p760'; drivers/a715181@@tmp_rte_pmd_bnxt at sta/net_bnxt_tf_core_tf_msg.c.o:/root/FC32-64_K5.6.0_GCC10.0.1/x86_64-native-linuxapp-gcc/24f13610eb684d6f8723171e16a4c9bf/dpdk/build-gcc-static/../drivers/net/bnxt/tf_core/hwrm_tf.h:760: first defined here
/usr/bin/ld: drivers/a715181@@tmp_rte_pmd_bnxt at sta/net_bnxt_tf_core_tf_tbl.c.o:/root/FC32-64_K5.6.0_GCC10.0.1/x86_64-native-linuxapp-gcc/24f13610eb684d6f8723171e16a4c9bf/dpdk/build-gcc-static/../drivers/net/bnxt/tf_core/hwrm_tf.h:698: multiple definition of `p698'; drivers/a715181@@tmp_rte_pmd_bnxt at sta/net_bnxt_tf_core_tf_msg.c.o:/root/FC32-64_K5.6.0_GCC10.0.1/x86_64-native-linuxapp-gcc/24f13610eb684d6f8723171e16a4c9bf/dpdk/build-gcc-static/../drivers/net/bnxt/tf_core/hwrm_tf.h:698: first defined here
/usr/bin/ld: drivers/a715181@@tmp_rte_pmd_bnxt at sta/net_bnxt_tf_core_tf_tbl.c.o:/root/FC32-64_K5.6.0_GCC10.0.1/x86_64-native-linuxapp-gcc/24f13610eb684d6f8723171e16a4c9bf/dpdk/build-gcc-static/../drivers/net/bnxt/tf_core/hwrm_tf.h:657: multiple definition of `p657'; drivers/a715181@@tmp_rte_pmd_bnxt at sta/net_bnxt_tf_core_tf_msg.c.o:/root/FC32-64_K5.6.0_GCC10.0.1/x86_64-native-linuxapp-gcc/24f13610eb684d6f8723171e16a4c9bf/dpdk/build-gcc-static/../drivers/net/bnxt/tf_core/hwrm_tf.h:657: first defined here
/usr/bin/ld: drivers/a715181@@tmp_rte_pmd_bnxt at sta/net_bnxt_tf_core_tf_tbl.c.o:/root/FC32-64_K5.6.0_GCC10.0.1/x86_64-native-linuxapp-gcc/24f13610eb684d6f8723171e16a4c9bf/dpdk/build-gcc-static/../drivers/net/bnxt/tf_core/hwrm_tf.h:590: multiple definition of `p590'; drivers/a715181@@tmp_rte_pmd_bnxt at sta/net_bnxt_tf_core_tf_msg.c.o:/root/FC32-64_K5.6.0_GCC10.0.1/x86_64-native-linuxapp-gcc/24f13610eb684d6f8723171e16a4c9bf/dpdk/build-gcc-static/../drivers/net/bnxt/tf_core/hwrm_tf.h:590: first defined here
/usr/bin/ld: drivers/a715181@@tmp_rte_pmd_bnxt at sta/net_bnxt_tf_core_tf_tbl.c.o:/root/FC32-64_K5.6.0_GCC10.0.1/x86_64-native-linuxapp-gcc/24f13610eb684d6f8723171e16a4c9bf/dpdk/build-gcc-static/../drivers/net/bnxt/tf_core/hwrm_tf.h:577: multiple definition of `p577'; drivers/a715181@@tmp_rte_pmd_bnxt at sta/net_bnxt_tf_core_tf_msg.c.o:/root/FC32-64_K5.6.0_GCC10.0.1/x86_64-native-linuxapp-gcc/24f13610eb684d6f8723171e16a4c9bf/dpdk/build-gcc-static/../drivers/net/bnxt/tf_core/hwrm_tf.h:577: first defined here
/usr/bin/ld: drivers/a715181@@tmp_rte_pmd_bnxt at sta/net_bnxt_tf_core_tf_tbl.c.o:/root/FC32-64_K5.6.0_GCC10.0.1/x86_64-native-linuxapp-gcc/24f13610eb684d6f8723171e16a4c9bf/dpdk/build-gcc-static/../drivers/net/bnxt/tf_core/hwrm_tf.h:474: multiple definition of `p474'; drivers/a715181@@tmp_rte_pmd_bnxt at sta/net_bnxt_tf_core_tf_msg.c.o:/root/FC32-64_K5.6.0_GCC10.0.1/x86_64-native-linuxapp-gcc/24f13610eb684d6f8723171e16a4c9bf/dpdk/build-gcc-static/../drivers/net/bnxt/tf_core/hwrm_tf.h:474: first defined here
/usr/bin/ld: drivers/a715181@@tmp_rte_pmd_bnxt at sta/net_bnxt_tf_core_tf_tbl.c.o:/root/FC32-64_K5.6.0_GCC10.0.1/x86_64-native-linuxapp-gcc/24f13610eb684d6f8723171e16a4c9bf/dpdk/build-gcc-static/../drivers/net/bnxt/tf_core/hwrm_tf.h:371: multiple definition of `p371'; drivers/a715181@@tmp_rte_pmd_bnxt at sta/net_bnxt_tf_core_tf_msg.c.o:/root/FC32-64_K5.6.0_GCC10.0.1/x86_64-native-linuxapp-gcc/24f13610eb684d6f8723171e16a4c9bf/dpdk/build-gcc-static/../drivers/net/bnxt/tf_core/hwrm_tf.h:371: first defined here
/usr/bin/ld: drivers/a715181@@tmp_rte_pmd_bnxt at sta/net_bnxt_tf_core_tf_tbl.c.o:/root/FC32-64_K5.6.0_GCC10.0.1/x86_64-native-linuxapp-gcc/24f13610eb684d6f8723171e16a4c9bf/dpdk/build-gcc-static/../drivers/net/bnxt/tf_core/hwrm_tf.h:278: multiple definition of `p278'; drivers/a715181@@tmp_rte_pmd_bnxt at sta/net_bnxt_tf_core_tf_msg.c.o:/root/FC32-64_K5.6.0_GCC10.0.1/x86_64-native-linuxapp-gcc/24f13610eb684d6f8723171e16a4c9bf/dpdk/build-gcc-static/../drivers/net/bnxt/tf_core/hwrm_tf.h:278: first defined here
/usr/bin/ld: drivers/a715181@@tmp_rte_pmd_bnxt at sta/net_bnxt_tf_core_tf_tbl.c.o:/root/FC32-64_K5.6.0_GCC10.0.1/x86_64-native-linuxapp-gcc/24f13610eb684d6f8723171e16a4c9bf/dpdk/build-gcc-static/../drivers/net/bnxt/tf_core/hwrm_tf.h:219: multiple definition of `p219'; drivers/a715181@@tmp_rte_pmd_bnxt at sta/net_bnxt_tf_core_tf_msg.c.o:/root/FC32-64_K5.6.0_GCC10.0.1/x86_64-native-linuxapp-gcc/24f13610eb684d6f8723171e16a4c9bf/dpdk/build-gcc-static/../drivers/net/bnxt/tf_core/hwrm_tf.h:219: first defined here
/usr/bin/ld: drivers/a715181@@tmp_rte_pmd_bnxt at sta/net_bnxt_tf_core_tf_tbl.c.o:/root/FC32-64_K5.6.0_GCC10.0.1/x86_64-native-linuxapp-gcc/24f13610eb684d6f8723171e16a4c9bf/dpdk/build-gcc-static/../drivers/net/bnxt/tf_core/hwrm_tf.h:114: multiple definition of `p114'; drivers/a715181@@tmp_rte_pmd_bnxt at sta/net_bnxt_tf_core_tf_msg.c.o:/root/FC32-64_K5.6.0_GCC10.0.1/x86_64-native-linuxapp-gcc/24f13610eb684d6f8723171e16a4c9bf/dpdk/build-gcc-static/../drivers/net/bnxt/tf_core/hwrm_tf.h:114: first defined here
/usr/bin/ld: drivers/a715181@@tmp_rte_pmd_bnxt at sta/net_bnxt_tf_core_tf_tbl.c.o:/root/FC32-64_K5.6.0_GCC10.0.1/x86_64-native-linuxapp-gcc/24f13610eb684d6f8723171e16a4c9bf/dpdk/build-gcc-static/../drivers/net/bnxt/tf_core/hwrm_tf.h:101: multiple definition of `p101'; drivers/a715181@@tmp_rte_pmd_bnxt at sta/net_bnxt_tf_core_tf_msg.c.o:/root/FC32-64_K5.6.0_GCC10.0.1/x86_64-native-linuxapp-gcc/24f13610eb684d6f8723171e16a4c9bf/dpdk/build-gcc-static/../drivers/net/bnxt/tf_core/hwrm_tf.h:101: first defined here
collect2: error: ld returned 1 exit status
[843/2188] Compiling C object 'drivers/a715181@@tmp_rte_pmd_cxgbe at sta/net_cxgbe_l2t.c.o'.
[844/2188] Linking target lib/librte_pipeline.so.20.0.2.
[845/2188] Compiling C object 'drivers/a715181@@tmp_rte_pmd_cxgbe at sta/net_cxgbe_base_t4vf_hw.c.o'.
[846/2188] Compiling C object 'drivers/a715181@@tmp_rte_pmd_dpaa2 at sta/net_dpaa2_base_dpaa2_hw_dpni.c.o'.
[847/2188] Compiling C object 'drivers/a715181@@tmp_rte_pmd_dpaa2 at sta/net_dpaa2_dpaa2_mux.c.o'.
[848/2188] Compiling C object 'drivers/a715181@@tmp_rte_pmd_dpaa2 at sta/net_dpaa2_dpaa2_flow.c.o'.
[849/2188] Compiling C object 'drivers/a715181@@tmp_rte_pmd_dpaa at sta/net_dpaa_dpaa_ethdev.c.o'.
[850/2188] Compiling C object 'drivers/a715181@@tmp_rte_pmd_cxgbe at sta/net_cxgbe_base_t4_hw.c.o'.
[851/2188] Compiling C object 'drivers/a715181@@tmp_rte_pmd_dpaa at sta/net_dpaa_dpaa_rxtx.c.o'.
ninja: build stopped: subcommand failed




*Meson Build Failed #2:
OS: UB1804-32
Target:./build-gcc-static
[1326/1943] Linking target drivers/librte_pmd_vdev_netvsc.so.20.0.2.
[1327/1943] Linking static target drivers/librte_pmd_tap.a.
[1328/1943] Compiling C object 'drivers/a715181@@tmp_rte_pmd_virtio at sta/net_virtio_virtio_rxtx_packed_avx.c.o'.
FAILED: drivers/a715181@@tmp_rte_pmd_virtio at sta/net_virtio_virtio_rxtx_packed_avx.c.o 
clang -Idrivers/a715181@@tmp_rte_pmd_virtio at sta -Idrivers -I../drivers -Idrivers/net/virtio -I../drivers/net/virtio -Ilib/librte_ethdev -I../lib/librte_ethdev -I. -I../ -Iconfig -I../config -Ilib/librte_eal/include -I../lib/librte_eal/include -Ilib/librte_eal/linux/include -I../lib/librte_eal/linux/include -Ilib/librte_eal/x86/include -I../lib/librte_eal/x86/include -Ilib/librte_eal/common -I../lib/librte_eal/common -Ilib/librte_eal -I../lib/librte_eal -Ilib/librte_kvargs -I../lib/librte_kvargs -Ilib/librte_telemetry/../librte_metrics -I../lib/librte_telemetry/../librte_metrics -Ilib/librte_telemetry -I../lib/librte_telemetry -Ilib/librte_net -I../lib/librte_net -Ilib/librte_mbuf -I../lib/librte_mbuf -Ilib/librte_mempool -I../lib/librte_mempool -Ilib/librte_ring -I../lib/librte_ring -Ilib/librte_meter -I../lib/librte_meter -Idrivers/bus/pci -I../drivers/bus/pci -I../drivers/bus/pci/linux -Ilib/librte_pci -I../lib/librte_pci -Idrivers/bus/vdev -I../drivers/bus/vdev -Xclang -fcolor-diagnostics -pipe -D_FILE_OFFSET_BITS=64 -Wall -Winvalid-pch -Werror -O2 -g -include rte_config.h -Wextra -Wcast-qual -Wdeprecated -Wformat-nonliteral -Wformat-security -Wmissing-declarations -Wmissing-prototypes -Wnested-externs -Wold-style-definition -Wpointer-arith -Wsign-compare -Wstrict-prototypes -Wundef -Wwrite-strings -Wno-address-of-packed-member -Wno-missing-field-initializers -Wno-pointer-to-int-cast -D_GNU_SOURCE -m32 -fPIC -march=native -DALLOW_EXPERIMENTAL_API -DALLOW_INTERNAL_API -mavx512f -mavx512bw -mavx512vl -DCC_AVX512_SUPPORT -DVHOST_CLANG_UNROLL_PRAGMA -MD -MQ 'drivers/a715181@@tmp_rte_pmd_virtio at sta/net_virtio_virtio_rxtx_packed_avx.c.o' -MF 'drivers/a715181@@tmp_rte_pmd_virtio at sta/net_virtio_virtio_rxtx_packed_avx.c.o.d' -o 'drivers/a715181@@tmp_rte_pmd_virtio at sta/net_virtio_virtio_rxtx_packed_avx.c.o' -c ../drivers/net/virtio/virtio_rxtx_packed_avx.c
../drivers/net/virtio/virtio_rxtx_packed_avx.c:368:19: error: implicit declaration of function '_mm512_maskz_set1_epi64' is invalid in C99 [-Werror,-Wimplicit-function-declaration]
        __m512i v_mask = _mm512_maskz_set1_epi64(0xaa, PACKED_FLAGS_MASK);
                         ^
../drivers/net/virtio/virtio_rxtx_packed_avx.c:368:19: error: this function declaration is not a prototype [-Werror,-Wstrict-prototypes]
../drivers/net/virtio/virtio_rxtx_packed_avx.c:368:10: error: initializing '__m512i' (vector of 8 'long long' values) with an expression of incompatible type 'int'
        __m512i v_mask = _mm512_maskz_set1_epi64(0xaa, PACKED_FLAGS_MASK);
                ^        ~~~~~~~~~~~~~~~~~~~~~~~~~~~~~~~~~~~~~~~~~~~~~~~~
../drivers/net/virtio/virtio_rxtx_packed_avx.c:376:15: error: assigning to '__m512i' (vector of 8 'long long' values) from incompatible type 'int'
                v_used_flag = _mm512_maskz_set1_epi64(0xaa, PACKED_FLAGS_MASK);
                            ^ ~~~~~~~~~~~~~~~~~~~~~~~~~~~~~~~~~~~~~~~~~~~~~~~~
4 errors generated.
--
[1337/1943] Generating rte_pmd_vhost.sym_chk with a meson_exe.py custom command.
[1338/1943] Compiling C object 'drivers/a715181@@tmp_rte_pmd_virtio at sta/net_virtio_virtio_user_ethdev.c.o'.
[1339/1943] Compiling C object 'drivers/a715181@@tmp_rte_pmd_virtio at sta/net_virtio_virtio_rxtx.c.o'.
ninja: build stopped: subcommand failed.
meson  --werror -Dexamples=all --buildtype=debugoptimized --default-library=shared /root/UB1804-32_K4.15.0_GCC7.3.0/i686-native-linuxapp-gcc/24f13610eb684d6f8723171e16a4c9bf/dpdk/devtools/.. ./build-clang-shared
The Meson build system
Version: 0.50.0
--
[1360/2134] Compiling C object 'drivers/a715181@@rte_pmd_vhost at sta/meson-generated_.._rte_pmd_vhost.pmd.c.o'.
[1361/2134] Compiling C object 'drivers/a715181@@rte_pmd_vhost at sha/meson-generated_.._rte_pmd_vhost.pmd.c.o'.
[1362/2134] Compiling C object 'drivers/a715181@@tmp_rte_pmd_virtio at sta/net_virtio_virtio_rxtx_packed_avx.c.o'.
FAILED: drivers/a715181@@tmp_rte_pmd_virtio at sta/net_virtio_virtio_rxtx_packed_avx.c.o 
clang -Idrivers/a715181@@tmp_rte_pmd_virtio at sta -Idrivers -I../drivers -Idrivers/net/virtio -I../drivers/net/virtio -Ilib/librte_ethdev -I../lib/librte_ethdev -I. -I../ -Iconfig -I../config -Ilib/librte_eal/include -I../lib/librte_eal/include -Ilib/librte_eal/linux/include -I../lib/librte_eal/linux/include -Ilib/librte_eal/x86/include -I../lib/librte_eal/x86/include -Ilib/librte_eal/common -I../lib/librte_eal/common -Ilib/librte_eal -I../lib/librte_eal -Ilib/librte_kvargs -I../lib/librte_kvargs -Ilib/librte_telemetry/../librte_metrics -I../lib/librte_telemetry/../librte_metrics -Ilib/librte_telemetry -I../lib/librte_telemetry -Ilib/librte_net -I../lib/librte_net -Ilib/librte_mbuf -I../lib/librte_mbuf -Ilib/librte_mempool -I../lib/librte_mempool -Ilib/librte_ring -I../lib/librte_ring -Ilib/librte_meter -I../lib/librte_meter -Idrivers/bus/pci -I../drivers/bus/pci -I../drivers/bus/pci/linux -Ilib/librte_pci -I../lib/librte_pci -Idrivers/bus/vdev -I../drivers/bus/vdev -Xclang -fcolor-diagnostics -pipe -D_FILE_OFFSET_BITS=64 -Wall -Winvalid-pch -Werror -O2 -g -include rte_config.h -Wextra -Wcast-qual -Wdeprecated -Wformat-nonliteral -Wformat-security -Wmissing-declarations -Wmissing-prototypes -Wnested-externs -Wold-style-definition -Wpointer-arith -Wsign-compare -Wstrict-prototypes -Wundef -Wwrite-strings -Wno-address-of-packed-member -Wno-missing-field-initializers -Wno-pointer-to-int-cast -D_GNU_SOURCE -m32 -fPIC -march=native -DALLOW_EXPERIMENTAL_API -DALLOW_INTERNAL_API -mavx512f -mavx512bw -mavx512vl -DCC_AVX512_SUPPORT -DVHOST_CLANG_UNROLL_PRAGMA -MD -MQ 'drivers/a715181@@tmp_rte_pmd_virtio at sta/net_virtio_virtio_rxtx_packed_avx.c.o' -MF 'drivers/a715181@@tmp_rte_pmd_virtio at sta/net_virtio_virtio_rxtx_packed_avx.c.o.d' -o 'drivers/a715181@@tmp_rte_pmd_virtio at sta/net_virtio_virtio_rxtx_packed_avx.c.o' -c ../drivers/net/virtio/virtio_rxtx_packed_avx.c
../drivers/net/virtio/virtio_rxtx_packed_avx.c:368:19: error: implicit declaration of function '_mm512_maskz_set1_epi64' is invalid in C99 [-Werror,-Wimplicit-function-declaration]
        __m512i v_mask = _mm512_maskz_set1_epi64(0xaa, PACKED_FLAGS_MASK);
                         ^
../drivers/net/virtio/virtio_rxtx_packed_avx.c:368:19: error: this function declaration is not a prototype [-Werror,-Wstrict-prototypes]
../drivers/net/virtio/virtio_rxtx_packed_avx.c:368:10: error: initializing '__m512i' (vector of 8 'long long' values) with an expression of incompatible type 'int'
        __m512i v_mask = _mm512_maskz_set1_epi64(0xaa, PACKED_FLAGS_MASK);
                ^        ~~~~~~~~~~~~~~~~~~~~~~~~~~~~~~~~~~~~~~~~~~~~~~~~
../drivers/net/virtio/virtio_rxtx_packed_avx.c:376:15: error: assigning to '__m512i' (vector of 8 'long long' values) from incompatible type 'int'
                v_used_flag = _mm512_maskz_set1_epi64(0xaa, PACKED_FLAGS_MASK);
                            ^ ~~~~~~~~~~~~~~~~~~~~~~~~~~~~~~~~~~~~~~~~~~~~~~~~
4 errors generated.
--
[1371/2134] Compiling C object 'drivers/a715181@@tmp_rte_pmd_virtio at sta/net_virtio_virtio_ethdev.c.o'.
[1372/2134] Compiling C object 'drivers/a715181@@tmp_rte_pmd_virtio at sta/net_virtio_virtio_user_ethdev.c.o'.
[1373/2134] Compiling C object 'drivers/a715181@@tmp_rte_pmd_virtio at sta/net_virtio_virtio_rxtx.c.o'.
ninja: build stopped: subcommand failed.
meson  --werror -Dexamples=all --buildtype=debugoptimized -Dlibdir=lib -Dmachine=nehalem --default-library=shared /root/UB1804-32_K4.15.0_GCC7.3.0/i686-native-linuxapp-gcc/24f13610eb684d6f8723171e16a4c9bf/dpdk/devtools/.. ./build-x86-default
The Meson build system
Version: 0.50.0

*Makefile Build Failed #1:
OS: FC32-64
Target: x86_64-native-linuxapp-gcc
  CC test_atomic.o
  CC test_barrier.o
  CC parameters.o
collect2: error: ld returned 1 exit status
make[5]: *** [/root/FC32-64_K5.6.0_GCC10.0.1/x86_64-native-linuxapp-gcc/24f13610eb684d6f8723171e16a4c9bf/dpdk/mk/rte.app.mk:454: testsad] Error 1
make[4]: *** [/root/FC32-64_K5.6.0_GCC10.0.1/x86_64-native-linuxapp-gcc/24f13610eb684d6f8723171e16a4c9bf/dpdk/mk/rte.subdir.mk:37: test-sad] Error 2
make[4]: *** Waiting for unfinished jobs....
  CC cmdline.o
collect2: error: ld returned 1 exit status
make[5]: *** [/root/FC32-64_K5.6.0_GCC10.0.1/x86_64-native-linuxapp-gcc/24f13610eb684d6f8723171e16a4c9bf/dpdk/mk/rte.app.mk:454: testacl] Error 1
make[4]: *** [/root/FC32-64_K5.6.0_GCC10.0.1/x86_64-native-linuxapp-gcc/24f13610eb684d6f8723171e16a4c9bf/dpdk/mk/rte.subdir.mk:37: test-acl] Error 2
  CC cmdline_flow.o
  CC pipeline_stub.o
collect2: error: ld returned 1 exit status
make[5]: *** [/root/FC32-64_K5.6.0_GCC10.0.1/x86_64-native-linuxapp-gcc/24f13610eb684d6f8723171e16a4c9bf/dpdk/mk/rte.app.mk:454: cmdline_test] Error 1
make[4]: *** [/root/FC32-64_K5.6.0_GCC10.0.1/x86_64-native-linuxapp-gcc/24f13610eb684d6f8723171e16a4c9bf/dpdk/mk/rte.subdir.mk:37: test-cmdline] Error 2
  CC cmdline_mtr.o
  CC test_malloc.o
collect2: error: ld returned 1 exit status
make[5]: *** [/root/FC32-64_K5.6.0_GCC10.0.1/x86_64-native-linuxapp-gcc/24f13610eb684d6f8723171e16a4c9bf/dpdk/mk/rte.app.mk:454: dpdk-procinfo] Error 1
make[4]: *** [/root/FC32-64_K5.6.0_GCC10.0.1/x86_64-native-linuxapp-gcc/24f13610eb684d6f8723171e16a4c9bf/dpdk/mk/rte.subdir.mk:37: proc-info] Error 2
  CC test_cycles.o
collect2: error: ld returned 1 exit status
make[5]: *** [/root/FC32-64_K5.6.0_GCC10.0.1/x86_64-native-linuxapp-gcc/24f13610eb684d6f8723171e16a4c9bf/dpdk/mk/rte.app.mk:454: dpdk-pdump] Error 1
make[4]: *** [/root/FC32-64_K5.6.0_GCC10.0.1/x86_64-native-linuxapp-gcc/24f13610eb684d6f8723171e16a4c9bf/dpdk/mk/rte.subdir.mk:37: pdump] Error 2
  CC test_mcslock.o
  CC test_spinlock.o
  CC pipeline_hash.o
--
  CC test_memzone.o
  CC pipeline_lpm_ipv6.o
  CC pipeline_acl.o
collect2: error: ld returned 1 exit status
make[5]: *** [/root/FC32-64_K5.6.0_GCC10.0.1/x86_64-native-linuxapp-gcc/24f13610eb684d6f8723171e16a4c9bf/dpdk/mk/rte.app.mk:454: testfib] Error 1
make[4]: *** [/root/FC32-64_K5.6.0_GCC10.0.1/x86_64-native-linuxapp-gcc/24f13610eb684d6f8723171e16a4c9bf/dpdk/mk/rte.subdir.mk:37: test-fib] Error 2
  CC test_bitmap.o
  CC test_reciprocal_division.o
  CC macfwd.o
--
  CC macswap.o
  CC flowgen.o
  CC rxonly.o
collect2: error: ld returned 1 exit status
make[5]: *** [/root/FC32-64_K5.6.0_GCC10.0.1/x86_64-native-linuxapp-gcc/24f13610eb684d6f8723171e16a4c9bf/dpdk/mk/rte.app.mk:454: testpipeline] Error 1
make[4]: *** [/root/FC32-64_K5.6.0_GCC10.0.1/x86_64-native-linuxapp-gcc/24f13610eb684d6f8723171e16a4c9bf/dpdk/mk/rte.subdir.mk:37: test-pipeline] Error 2
  CC txonly.o
  CC csumonly.o
  CC icmpecho.o
--
  CC test_timer_racecond.o
  CC test_timer_secondary.o
  CC test_mempool.o
collect2: error: ld returned 1 exit status
make[5]: *** [/root/FC32-64_K5.6.0_GCC10.0.1/x86_64-native-linuxapp-gcc/24f13610eb684d6f8723171e16a4c9bf/dpdk/mk/rte.app.mk:454: testbbdev] Error 1
make[4]: *** [/root/FC32-64_K5.6.0_GCC10.0.1/x86_64-native-linuxapp-gcc/24f13610eb684d6f8723171e16a4c9bf/dpdk/mk/rte.subdir.mk:37: test-bbdev] Error 2
  CC test_mempool_perf.o
  CC test_mbuf.o
  CC test_logs.o
--
  CC test_fib6.o
  CC test_fib_perf.o
  CC test_fib6_perf.o
collect2: error: ld returned 1 exit status
make[5]: *** [/root/FC32-64_K5.6.0_GCC10.0.1/x86_64-native-linuxapp-gcc/24f13610eb684d6f8723171e16a4c9bf/dpdk/mk/rte.app.mk:454: testpmd] Error 1
  CC test_lpm.o
make[4]: *** [/root/FC32-64_K5.6.0_GCC10.0.1/x86_64-native-linuxapp-gcc/24f13610eb684d6f8723171e16a4c9bf/dpdk/mk/rte.subdir.mk:37: test-pmd] Error 2
  CC test_lpm_perf.o
  CC test_lpm6.o
  CC test_lpm6_perf.o
--
/usr/bin/ld: /root/FC32-64_K5.6.0_GCC10.0.1/x86_64-native-linuxapp-gcc/24f13610eb684d6f8723171e16a4c9bf/dpdk/x86_64-native-linuxapp-gcc/lib/librte_pmd_bnxt.a(tf_tbl.o):(.bss+0x12): multiple definition of `p101'; /root/FC32-64_K5.6.0_GCC10.0.1/x86_64-native-linuxapp-gcc/24f13610eb684d6f8723171e16a4c9bf/dpdk/x86_64-native-linuxapp-gcc/lib/librte_pmd_bnxt.a(tf_msg.o):(.bss+0x12): first defined here
/usr/bin/ld: /root/FC32-64_K5.6.0_GCC10.0.1/x86_64-native-linuxapp-gcc/24f13610eb684d6f8723171e16a4c9bf/dpdk/x86_64-native-linuxapp-gcc/lib/librte_pmd_dpaa_sec.a(dpaa_sec.o):(.bss+0x4): multiple definition of `rta_sec_era'; /root/FC32-64_K5.6.0_GCC10.0.1/x86_64-native-linuxapp-gcc/24f13610eb684d6f8723171e16a4c9bf/dpdk/x86_64-native-linuxapp-gcc/lib/librte_pmd_dpaa2_sec.a(dpaa2_sec_dpseci.o):(.data+0xe0): first defined here
/usr/bin/ld: /root/FC32-64_K5.6.0_GCC10.0.1/x86_64-native-linuxapp-gcc/24f13610eb684d6f8723171e16a4c9bf/dpdk/x86_64-native-linuxapp-gcc/lib/librte_pmd_caam_jr.a(caam_jr.o):(.bss+0x0): multiple definition of `rta_sec_era'; /root/FC32-64_K5.6.0_GCC10.0.1/x86_64-native-linuxapp-gcc/24f13610eb684d6f8723171e16a4c9bf/dpdk/x86_64-native-linuxapp-gcc/lib/librte_pmd_dpaa2_sec.a(dpaa2_sec_dpseci.o):(.data+0xe0): first defined here
collect2: error: ld returned 1 exit status
make[5]: *** [/root/FC32-64_K5.6.0_GCC10.0.1/x86_64-native-linuxapp-gcc/24f13610eb684d6f8723171e16a4c9bf/dpdk/mk/rte.app.mk:454: test] Error 1
make[4]: *** [/root/FC32-64_K5.6.0_GCC10.0.1/x86_64-native-linuxapp-gcc/24f13610eb684d6f8723171e16a4c9bf/dpdk/mk/rte.subdir.mk:37: test] Error 2
make[3]: *** [/root/FC32-64_K5.6.0_GCC10.0.1/x86_64-native-linuxapp-gcc/24f13610eb684d6f8723171e16a4c9bf/dpdk/mk/rte.sdkbuild.mk:48: app] Error 2
make[2]: *** [/root/FC32-64_K5.6.0_GCC10.0.1/x86_64-native-linuxapp-gcc/24f13610eb684d6f8723171e16a4c9bf/dpdk/mk/rte.sdkroot.mk:99: all] Error 2
make[1]: *** [/root/FC32-64_K5.6.0_GCC10.0.1/x86_64-native-linuxapp-gcc/24f13610eb684d6f8723171e16a4c9bf/dpdk/mk/rte.sdkinstall.mk:61: pre_install] Error 2
make: *** [/root/FC32-64_K5.6.0_GCC10.0.1/x86_64-native-linuxapp-gcc/24f13610eb684d6f8723171e16a4c9bf/dpdk/mk/rte.sdkroot.mk:77: install] Error 2


*Makefile Build Failed #2:
OS: UB2004-64
Target: x86_64-native-linuxapp-gcc
  CC test_prefetch.o
  CC runtime.o
  CC test_byteorder.o
collect2: error: ld returned 1 exit status
make[5]: *** [/root/UB2004-64_K5.4.0_GCC9.3.0/x86_64-native-linuxapp-gcc/24f13610eb684d6f8723171e16a4c9bf/dpdk/mk/rte.app.mk:454: testacl] Error 1
make[4]: *** [/root/UB2004-64_K5.4.0_GCC9.3.0/x86_64-native-linuxapp-gcc/24f13610eb684d6f8723171e16a4c9bf/dpdk/mk/rte.subdir.mk:37: test-acl] Error 2
make[4]: *** Waiting for unfinished jobs....
  CC test_per_lcore.o
  CC test_atomic.o
--
/usr/bin/ld: /root/UB2004-64_K5.4.0_GCC9.3.0/x86_64-native-linuxapp-gcc/24f13610eb684d6f8723171e16a4c9bf/dpdk/x86_64-native-linuxapp-gcc/lib/librte_pmd_bnxt.a(tf_tbl.o):(.bss+0x10): multiple definition of `p219'; /root/UB2004-64_K5.4.0_GCC9.3.0/x86_64-native-linuxapp-gcc/24f13610eb684d6f8723171e16a4c9bf/dpdk/x86_64-native-linuxapp-gcc/lib/librte_pmd_bnxt.a(tf_msg.o):(.bss+0x10): first defined here
/usr/bin/ld: /root/UB2004-64_K5.4.0_GCC9.3.0/x86_64-native-linuxapp-gcc/24f13610eb684d6f8723171e16a4c9bf/dpdk/x86_64-native-linuxapp-gcc/lib/librte_pmd_bnxt.a(tf_tbl.o):(.bss+0x11): multiple definition of `p114'; /root/UB2004-64_K5.4.0_GCC9.3.0/x86_64-native-linuxapp-gcc/24f13610eb684d6f8723171e16a4c9bf/dpdk/x86_64-native-linuxapp-gcc/lib/librte_pmd_bnxt.a(tf_msg.o):(.bss+0x11): first defined here
/usr/bin/ld: /root/UB2004-64_K5.4.0_GCC9.3.0/x86_64-native-linuxapp-gcc/24f13610eb684d6f8723171e16a4c9bf/dpdk/x86_64-native-linuxapp-gcc/lib/librte_pmd_bnxt.a(tf_tbl.o):(.bss+0x12): multiple definition of `p101'; /root/UB2004-64_K5.4.0_GCC9.3.0/x86_64-native-linuxapp-gcc/24f13610eb684d6f8723171e16a4c9bf/dpdk/x86_64-native-linuxapp-gcc/lib/librte_pmd_bnxt.a(tf_msg.o):(.bss+0x12): first defined here
collect2: error: ld returned 1 exit status
make[5]: *** [/root/UB2004-64_K5.4.0_GCC9.3.0/x86_64-native-linuxapp-gcc/24f13610eb684d6f8723171e16a4c9bf/dpdk/mk/rte.app.mk:454: dpdk-pdump] Error 1
make[4]: *** [/root/UB2004-64_K5.4.0_GCC9.3.0/x86_64-native-linuxapp-gcc/24f13610eb684d6f8723171e16a4c9bf/dpdk/mk/rte.subdir.mk:37: pdump] Error 2
  CC test_malloc.o
/usr/bin/ld: /root/UB2004-64_K5.4.0_GCC9.3.0/x86_64-native-linuxapp-gcc/24f13610eb684d6f8723171e16a4c9bf/dpdk/x86_64-native-linuxapp-gcc/lib/librte_pmd_dpaa_sec.a(dpaa_sec.o):(.bss+0x4): multiple definition of `rta_sec_era'; /root/UB2004-64_K5.4.0_GCC9.3.0/x86_64-native-linuxapp-gcc/24f13610eb684d6f8723171e16a4c9bf/dpdk/x86_64-native-linuxapp-gcc/lib/librte_pmd_dpaa2_sec.a(dpaa2_sec_dpseci.o):(.data+0x0): first defined here
/usr/bin/ld: /root/UB2004-64_K5.4.0_GCC9.3.0/x86_64-native-linuxapp-gcc/24f13610eb684d6f8723171e16a4c9bf/dpdk/x86_64-native-linuxapp-gcc/lib/librte_pmd_caam_jr.a(caam_jr.o):(.bss+0x0): multiple definition of `rta_sec_era'; /root/UB2004-64_K5.4.0_GCC9.3.0/x86_64-native-linuxapp-gcc/24f13610eb684d6f8723171e16a4c9bf/dpdk/x86_64-native-linuxapp-gcc/lib/librte_pmd_dpaa2_sec.a(dpaa2_sec_dpseci.o):(.data+0x0): first defined here
  CC test_cycles.o
collect2: error: ld returned 1 exit status
make[5]: *** [/root/UB2004-64_K5.4.0_GCC9.3.0/x86_64-native-linuxapp-gcc/24f13610eb684d6f8723171e16a4c9bf/dpdk/mk/rte.app.mk:454: cmdline_test] Error 1
make[4]: *** [/root/UB2004-64_K5.4.0_GCC9.3.0/x86_64-native-linuxapp-gcc/24f13610eb684d6f8723171e16a4c9bf/dpdk/mk/rte.subdir.mk:37: test-cmdline] Error 2
  CC test_mcslock.o
  CC test_spinlock.o
collect2: error: ld returned 1 exit status
make[5]: *** [/root/UB2004-64_K5.4.0_GCC9.3.0/x86_64-native-linuxapp-gcc/24f13610eb684d6f8723171e16a4c9bf/dpdk/mk/rte.app.mk:454: testsad] Error 1
make[4]: *** [/root/UB2004-64_K5.4.0_GCC9.3.0/x86_64-native-linuxapp-gcc/24f13610eb684d6f8723171e16a4c9bf/dpdk/mk/rte.subdir.mk:37: test-sad] Error 2
  CC test_ticketlock.o
  CC test_bbdev_vector.o
  CC pipeline_stub.o
  CC test_memory.o
  CC test_memzone.o
  CC test_bitmap.o
collect2: error: ld returned 1 exit status
make[5]: *** [/root/UB2004-64_K5.4.0_GCC9.3.0/x86_64-native-linuxapp-gcc/24f13610eb684d6f8723171e16a4c9bf/dpdk/mk/rte.app.mk:454: dpdk-procinfo] Error 1
make[4]: *** [/root/UB2004-64_K5.4.0_GCC9.3.0/x86_64-native-linuxapp-gcc/24f13610eb684d6f8723171e16a4c9bf/dpdk/mk/rte.subdir.mk:37: proc-info] Error 2
  CC pipeline_hash.o
  CC test_reciprocal_division.o
  CC test_reciprocal_division_perf.o
--
  CC test_ring_mpmc_stress.o
  CC test_ring_hts_stress.o
  CC test_ring_perf.o
collect2: error: ld returned 1 exit status
make[5]: *** [/root/UB2004-64_K5.4.0_GCC9.3.0/x86_64-native-linuxapp-gcc/24f13610eb684d6f8723171e16a4c9bf/dpdk/mk/rte.app.mk:454: testfib] Error 1
make[4]: *** [/root/UB2004-64_K5.4.0_GCC9.3.0/x86_64-native-linuxapp-gcc/24f13610eb684d6f8723171e16a4c9bf/dpdk/mk/rte.subdir.mk:37: test-fib] Error 2
  CC cmdline.o
  CC pipeline_lpm_ipv6.o
  CC pipeline_acl.o
--
  CC test_table.o
  CC config.o
  CC test_table_pipeline.o
collect2: error: ld returned 1 exit status
make[5]: *** [/root/UB2004-64_K5.4.0_GCC9.3.0/x86_64-native-linuxapp-gcc/24f13610eb684d6f8723171e16a4c9bf/dpdk/mk/rte.app.mk:454: testpipeline] Error 1
make[4]: *** [/root/UB2004-64_K5.4.0_GCC9.3.0/x86_64-native-linuxapp-gcc/24f13610eb684d6f8723171e16a4c9bf/dpdk/mk/rte.subdir.mk:37: test-pipeline] Error 2
  CC iofwd.o
  CC test_table_tables.o
  CC macfwd.o
--
  CC test_mempool.o
  CC test_mempool_perf.o
  CC bpf_cmd.o
collect2: error: ld returned 1 exit status
make[5]: *** [/root/UB2004-64_K5.4.0_GCC9.3.0/x86_64-native-linuxapp-gcc/24f13610eb684d6f8723171e16a4c9bf/dpdk/mk/rte.app.mk:454: testbbdev] Error 1
make[4]: *** [/root/UB2004-64_K5.4.0_GCC9.3.0/x86_64-native-linuxapp-gcc/24f13610eb684d6f8723171e16a4c9bf/dpdk/mk/rte.subdir.mk:37: test-bbdev] Error 2
  CC util.o
  CC test_mbuf.o
  CC test_logs.o
--
  CC test_trace_register.o
  CC test_trace_perf.o
  CC test_service_cores.o
collect2: error: ld returned 1 exit status
  CC sample_packet_forward.o
make[5]: *** [/root/UB2004-64_K5.4.0_GCC9.3.0/x86_64-native-linuxapp-gcc/24f13610eb684d6f8723171e16a4c9bf/dpdk/mk/rte.app.mk:454: testpmd] Error 1
make[4]: *** [/root/UB2004-64_K5.4.0_GCC9.3.0/x86_64-native-linuxapp-gcc/24f13610eb684d6f8723171e16a4c9bf/dpdk/mk/rte.subdir.mk:37: test-pmd] Error 2
  CC test_bitratestats.o
  CC test_latencystats.o
  CC test_pdump.o
--
/usr/bin/ld: /root/UB2004-64_K5.4.0_GCC9.3.0/x86_64-native-linuxapp-gcc/24f13610eb684d6f8723171e16a4c9bf/dpdk/x86_64-native-linuxapp-gcc/lib/librte_pmd_bnxt.a(tf_tbl.o):(.bss+0x12): multiple definition of `p101'; /root/UB2004-64_K5.4.0_GCC9.3.0/x86_64-native-linuxapp-gcc/24f13610eb684d6f8723171e16a4c9bf/dpdk/x86_64-native-linuxapp-gcc/lib/librte_pmd_bnxt.a(tf_msg.o):(.bss+0x12): first defined here
/usr/bin/ld: /root/UB2004-64_K5.4.0_GCC9.3.0/x86_64-native-linuxapp-gcc/24f13610eb684d6f8723171e16a4c9bf/dpdk/x86_64-native-linuxapp-gcc/lib/librte_pmd_dpaa_sec.a(dpaa_sec.o):(.bss+0x4): multiple definition of `rta_sec_era'; /root/UB2004-64_K5.4.0_GCC9.3.0/x86_64-native-linuxapp-gcc/24f13610eb684d6f8723171e16a4c9bf/dpdk/x86_64-native-linuxapp-gcc/lib/librte_pmd_dpaa2_sec.a(dpaa2_sec_dpseci.o):(.data+0x0): first defined here
/usr/bin/ld: /root/UB2004-64_K5.4.0_GCC9.3.0/x86_64-native-linuxapp-gcc/24f13610eb684d6f8723171e16a4c9bf/dpdk/x86_64-native-linuxapp-gcc/lib/librte_pmd_caam_jr.a(caam_jr.o):(.bss+0x0): multiple definition of `rta_sec_era'; /root/UB2004-64_K5.4.0_GCC9.3.0/x86_64-native-linuxapp-gcc/24f13610eb684d6f8723171e16a4c9bf/dpdk/x86_64-native-linuxapp-gcc/lib/librte_pmd_dpaa2_sec.a(dpaa2_sec_dpseci.o):(.data+0x0): first defined here
collect2: error: ld returned 1 exit status
make[5]: *** [/root/UB2004-64_K5.4.0_GCC9.3.0/x86_64-native-linuxapp-gcc/24f13610eb684d6f8723171e16a4c9bf/dpdk/mk/rte.app.mk:454: test] Error 1
make[4]: *** [/root/UB2004-64_K5.4.0_GCC9.3.0/x86_64-native-linuxapp-gcc/24f13610eb684d6f8723171e16a4c9bf/dpdk/mk/rte.subdir.mk:37: test] Error 2
make[3]: *** [/root/UB2004-64_K5.4.0_GCC9.3.0/x86_64-native-linuxapp-gcc/24f13610eb684d6f8723171e16a4c9bf/dpdk/mk/rte.sdkbuild.mk:48: app] Error 2
make[2]: *** [/root/UB2004-64_K5.4.0_GCC9.3.0/x86_64-native-linuxapp-gcc/24f13610eb684d6f8723171e16a4c9bf/dpdk/mk/rte.sdkroot.mk:99: all] Error 2
make[1]: *** [/root/UB2004-64_K5.4.0_GCC9.3.0/x86_64-native-linuxapp-gcc/24f13610eb684d6f8723171e16a4c9bf/dpdk/mk/rte.sdkinstall.mk:61: pre_install] Error 2
make: *** [/root/UB2004-64_K5.4.0_GCC9.3.0/x86_64-native-linuxapp-gcc/24f13610eb684d6f8723171e16a4c9bf/dpdk/mk/rte.sdkroot.mk:77: install] Error 2
DPDK STV team


More information about the test-report mailing list