[dpdk-test-report] |FAILURE| pw(73027) [RFC, 8/8] net/iavf: fix gtpu ip udp issue

sys_stv at intel.com sys_stv at intel.com
Tue Jul 7 04:26:04 CEST 2020


Test-Label: Intel-compilation
Test-Status: FAILURE
http://dpdk.org/patch/73027

_Compilation issues_

Submitter: Gordon at dpdk.org, Noonan at dpdk.org, gordon.noonan at intel.com
Date: 2020-07-03 10:28:29
Reply_mail: 20200703102829.52581-9-gordon.noonan at intel.com

DPDK git baseline: Repo:dpdk, CommitID: f6d7f405760610e9c61994c846fe59b3516591aa


Meson build Summary: 8 Builds Done, 7 Successful, 1 Failures, 0 Blocked

Makefile build Summary: 20 Builds Done, 19 Successful, 1 Failures, 0 Blocked

                +==============================================+===========+==========+
                |                   Makefile                   |   Meson   | Document |
+----------------+------+-------+------+------------+-----------+-----------+----------+
| os             | gcc  | clang | icc  | gcc+shared | gcc+debug | gcc/clang | pdf/html |
+----------------+------+-------+------+------------+-----------+-----------+----------+
| CENTOS82-64    | pass | pass  | pass | pass       | pass      | pass      |          |
| RHEL82-64      | pass |       |      |            |           |           |          |
| UB1804-64      | pass |       |      |            |           |           |          |
| FC32-64        | pass | pass  |      |            |           | pass      |          |
| CENTOS77-64    | pass |       |      |            |           |           |          |
| UB2004-64      | pass | pass  | pass |            |           | pass      | pass     |
| WIN10-64       |      |       |      |            |           | pass      |          |
| UB2004-32      | FAIL |       |      |            |           |           |          |
| UB1804-32      |      |       |      |            |           | FAIL      |          |
| FreeBSD1201-64 | pass | pass  |      | pass       | pass      | pass      |          |
| SUSE15-64      | pass | pass  |      |            |           | pass      |          |
+----------------+------+-------+------+------------+-----------+-----------+----------+
Test environment and configuration as below:

** Makefile build **


OS: CENTOS82-64
	Kernel Version: 4.18.0-193.el8.x86_64
	CPU info: Intel(R) Xeon(R) Platinum 8280M CPU @ 2.70GHz
	GCC Version: gcc (GCC) 8.3.1 20191121 (Red Hat 8.3.1-5)
	Clang Version: 9.0.1 (Red Hat 9.0.1-2.module_el8.2.0+309+0c7b6b03)
	x86_64-native-linuxapp-gcc
	x86_64-native-linuxapp-clang
	x86_64-native-linuxapp-icc
	x86_64-native-linuxapp-gcc+shared
	x86_64-native-linuxapp-gcc+debug


OS: RHEL82-64
	Kernel Version: 4.18.0-193.el8.x86_64
	CPU info: Intel(R) Xeon(R) Platinum 8280M CPU @ 2.70GHz
	GCC Version: gcc (GCC) 8.3.1 20191121 (Red Hat 8.3.1-5)
	Clang Version: 8.0.1 (Red Hat 8.0.1-1.module_el8.1.0+215+a01033fb)
	x86_64-native-linuxapp-gcc


OS: UB1804-64
	Kernel Version: 4.15.0-29-generic
	CPU info: Intel(R) Xeon(R) Platinum 8180 CPU @ 2.50GHz
	GCC Version: gcc (Ubuntu 7.5.0-3ubuntu1~18.04) 7.5.0
	Clang Version: 6.0.0-1ubuntu2 (tags/RELEASE_600/final)
	x86_64-native-linuxapp-gcc


OS: FC32-64
	Kernel Version: 5.6.0-0.rc7.git0.2.fc32.x86_64
	CPU info: Intel(R) Xeon(R) Platinum 8280M CPU @ 2.70GHz
	GCC Version: gcc (GCC) 10.0.1 20200311 (Red Hat 10.0.1-0.9)
	Clang Version: 10.0.0 (Fedora 10.0.0-0.3.rc4.fc32)
	x86_64-native-linuxapp-gcc
	x86_64-native-linuxapp-clang


OS: CENTOS77-64
	Kernel Version: 3.10.0-1062.9.1.el7.x86_64
	CPU info: Intel(R) Xeon(R) Platinum 8280M CPU @ 2.70GHz
	GCC Version: gcc (GCC) 4.8.5 20150623 (Red Hat 4.8.5-39)
	Clang Version: 3.4.2 (tags/RELEASE_34/dot2-final)
	x86_64-native-linuxapp-gcc


OS: UB2004-64
	Kernel Version: 5.4.0-26-generic
	CPU info: Intel(R) Xeon(R) Platinum 8180 CPU @ 2.50GHz
	GCC Version: gcc (Ubuntu 10-20200416-0ubuntu1) 10.0.1 20200416 (experimental) [master revision 3c3f12e2a76:dcee354ce56:44b326839d864fc10c459916abcc97f35a9ac3de]
	Clang Version: 10.0.0-4ubuntu1
	x86_64-native-linuxapp-clang
	x86_64-native-linuxapp-gcc
	x86_64-native-linuxapp-icc


OS: UB2004-32
	Kernel Version: 5.4.0-26-generic
	CPU info: Intel(R) Xeon(R) Platinum 8180 CPU @ 2.50GHz
	GCC Version: gcc (Ubuntu 9.3.0-10ubuntu2) 9.3.0
	Clang Version: 10.0.0-4ubuntu1
	i686-native-linuxapp-gcc


OS: FreeBSD1201-64
	Kernel Version: 12.1-RELEASE
	CPU info: Intel(R) Xeon(R) CPU E5-2699 v3 @ 2.30GHz (2294.74-MHz K8-class CPU)
	GCC Version: gcc (FreeBSD Ports Collection) 9.2.0
	Clang Version: 8.0.1 (tags/RELEASE_801/final 366581) (based on LLVM 8.0.1)
	x86_64-native-bsdapp-gcc
	x86_64-native-bsdapp-clang
	x86_64-native-bsdapp-gcc+shared
	x86_64-native-bsdapp-gcc+debug


OS: SUSE15-64
	Kernel Version: 4.12.14-lp150.11-default
	CPU info: Intel(R) Xeon(R) CPU E5-2699 v4 @ 2.20GHz
	GCC Version: gcc (SUSE Linux) 7.3.1 20180323 [gcc-7-branch revision 258812]
	Clang Version: 5.0.1 (tags/RELEASE_501/final 312548)
	x86_64-native-linuxapp-clang
	x86_64-native-linuxapp-gcc

** Meson build **


OS: CENTOS82-64
	Kernel Version: 4.18.0-193.el8.x86_64
	CPU info: Intel(R) Xeon(R) CPU E5-2699 v4 @ 2.20GHz
	GCC Version: gcc (GCC) 8.3.1 20191121 (Red Hat 8.3.1-5)
	Clang Version: 9.0.1 (Red Hat 9.0.1-2.module_el8.2.0+309+0c7b6b03)
	./build-gcc-static
	./build-gcc-shared
	./build-clang-static
	./build-clang-shared
	./build-x86-default


OS: UB2004-64
	Kernel Version: 5.4.0-26-generic
	CPU info: Intel(R) Xeon(R) Platinum 8180 CPU @ 2.50GHz
	GCC Version: gcc (Ubuntu 9.3.0-10ubuntu2) 9.3.0
	Clang Version: 10.0.0-4ubuntu1
	x86_64-native-linuxapp-doc
	./build-gcc-static
	./build-gcc-shared
	./build-clang-static
	./build-clang-shared
	./build-x86-default


OS: FC32-64
	Kernel Version: 5.6.0-0.rc7.git0.2.fc32.x86_64
	CPU info: Intel(R) Xeon(R) CPU E5-2699 v4 @ 2.20GHz
	GCC Version: gcc (GCC) 10.0.1 20200311 (Red Hat 10.0.1-0.9)
	Clang Version: 10.0.0 (Fedora 10.0.0-0.3.rc4.fc32)
	./build-gcc-static
	./build-gcc-shared
	./build-clang-static
	./build-clang-shared
	./build-x86-default


OS: WIN10-64
	Kernel Version: N/A
	CPU info: N/A
	GCC Version: N/A
	Clang Version: Clang 8.0.0
	x86_64-windows-clang


OS: UB1804-32
	Kernel Version: 4.15.0-20-generic
	CPU info: Intel(R) Xeon(R) CPU E5-2699 v4 @ 2.20GHz
	GCC Version: gcc (Ubuntu 7.5.0-3ubuntu1~18.04) 7.5.0
	Clang Version: 6.0.0-1ubuntu2 (tags/RELEASE_600/final)
	./build-gcc-static
	./build-gcc-shared
	./build-clang-static
	./build-clang-shared
	./build-x86-default


OS: FreeBSD1201-64
	Kernel Version: 12.1-RELEASE
	CPU info: Intel(R) Xeon(R) CPU E5-2699 v4 @ 2.20GHz (2194.97-MHz K8-class CPU)
	GCC Version: gcc (FreeBSD Ports Collection) 9.2.0
	Clang Version: 8.0.1 (tags/RELEASE_801/final 366581) (based on LLVM 8.0.1)
	./build-gcc-static
	./build-gcc-shared
	./build-clang-static
	./build-clang-shared
	./build-x86-default


OS: SUSE15-64
	Kernel Version: 4.12.14-lp150.12.82-default
	CPU info: Intel(R) Xeon(R) CPU E5-2699 v4 @ 2.20GHz
	GCC Version: gcc (SUSE Linux) 7.4.1 20190905 [gcc-7-branch revision 275407]
	Clang Version: 5.0.1 (tags/RELEASE_501/final 312548)
	./build-gcc-static
	./build-gcc-shared
	./build-clang-static
	./build-clang-shared
	./build-x86-default



*Meson Build Failed #1:
OS: UB1804-32
Target:./build-gcc-static
FAILED: drivers/a715181@@tmp_rte_common_iavf at sta/common_iavf_iavf_common.c.o 
gcc -Idrivers/a715181@@tmp_rte_common_iavf at sta -Idrivers -I../drivers -Idrivers/common/iavf -I../drivers/common/iavf -I. -I../ -Iconfig -I../config -Ilib/librte_eal/include -I../lib/librte_eal/include -Ilib/librte_eal/linux/include -I../lib/librte_eal/linux/include -Ilib/librte_eal/x86/include -I../lib/librte_eal/x86/include -Ilib/librte_eal/common -I../lib/librte_eal/common -Ilib/librte_eal -I../lib/librte_eal -Ilib/librte_kvargs -I../lib/librte_kvargs -Ilib/librte_telemetry/../librte_metrics -I../lib/librte_telemetry/../librte_metrics -Ilib/librte_telemetry -I../lib/librte_telemetry -fdiagnostics-color=always -pipe -D_FILE_OFFSET_BITS=64 -Wall -Winvalid-pch -Werror -O2 -g -include rte_config.h -Wextra -Wcast-qual -Wdeprecated -Wformat-nonliteral -Wformat-security -Wmissing-declarations -Wmissing-prototypes -Wnested-externs -Wold-style-definition -Wpointer-arith -Wsign-compare -Wstrict-prototypes -Wundef -Wwrite-strings -Wno-missing-field-initializers -Wno-pointer-to-int-cast -D_GNU_SOURCE -m32 -fPIC -march=native -DALLOW_EXPERIMENTAL_API -DALLOW_INTERNAL_API -Wno-format-truncation -Wno-pointer-to-int-cast -MD -MQ 'drivers/a715181@@tmp_rte_common_iavf at sta/common_iavf_iavf_common.c.o' -MF 'drivers/a715181@@tmp_rte_common_iavf at sta/common_iavf_iavf_common.c.o.d' -o 'drivers/a715181@@tmp_rte_common_iavf at sta/common_iavf_iavf_common.c.o' -c ../drivers/common/iavf/iavf_common.c
In file included from ../drivers/common/iavf/iavf_prototype.h:10:0,
                 from ../drivers/common/iavf/iavf_common.c:7:
../drivers/common/iavf/virtchnl.h:155:36: error: division by zero [-Werror=div-by-zero]
  { virtchnl_static_assert_##X = (n)/((sizeof(struct X) == (n)) ? 1 : 0) }
                                    ^
../drivers/common/iavf/virtchnl.h:458:1: note: in expansion of macro ‘VIRTCHNL_CHECK_STRUCT_LEN’
 VIRTCHNL_CHECK_STRUCT_LEN(32, virtchnl_large_irq_map_info);
 ^~~~~~~~~~~~~~~~~~~~~~~~~
../drivers/common/iavf/virtchnl.h:458:31: error: enumerator value for ‘virtchnl_static_assert_virtchnl_large_irq_map_info’ is not an integer constant
 VIRTCHNL_CHECK_STRUCT_LEN(32, virtchnl_large_irq_map_info);
                               ^
../drivers/common/iavf/virtchnl.h:155:53: note: in definition of macro ‘VIRTCHNL_CHECK_STRUCT_LEN’
  { virtchnl_static_assert_##X = (n)/((sizeof(struct X) == (n)) ? 1 : 0) }
                                                     ^
../drivers/common/iavf/virtchnl.h:155:36: error: division by zero [-Werror=div-by-zero]
  { virtchnl_static_assert_##X = (n)/((sizeof(struct X) == (n)) ? 1 : 0) }
                                    ^
../drivers/common/iavf/virtchnl.h:488:1: note: in expansion of macro ‘VIRTCHNL_CHECK_STRUCT_LEN’
 VIRTCHNL_CHECK_STRUCT_LEN(24, virtchnl_large_queue_select);
 ^~~~~~~~~~~~~~~~~~~~~~~~~
../drivers/common/iavf/virtchnl.h:488:31: error: enumerator value for ‘virtchnl_static_assert_virtchnl_large_queue_select’ is not an integer constant
 VIRTCHNL_CHECK_STRUCT_LEN(24, virtchnl_large_queue_select);
                               ^
../drivers/common/iavf/virtchnl.h:155:53: note: in definition of macro ‘VIRTCHNL_CHECK_STRUCT_LEN’
  { virtchnl_static_assert_##X = (n)/((sizeof(struct X) == (n)) ? 1 : 0) }
                                                     ^
cc1: all warnings being treated as errors
[545/2107] Compiling C object 'drivers/a715181@@tmp_rte_common_octeontx at sta/common_octeontx_octeontx_mbox.c.o'.
[546/2107] Compiling C object 'drivers/a715181@@tmp_rte_common_iavf at sta/common_iavf_iavf_adminq.c.o'.
FAILED: drivers/a715181@@tmp_rte_common_iavf at sta/common_iavf_iavf_adminq.c.o 
gcc -Idrivers/a715181@@tmp_rte_common_iavf at sta -Idrivers -I../drivers -Idrivers/common/iavf -I../drivers/common/iavf -I. -I../ -Iconfig -I../config -Ilib/librte_eal/include -I../lib/librte_eal/include -Ilib/librte_eal/linux/include -I../lib/librte_eal/linux/include -Ilib/librte_eal/x86/include -I../lib/librte_eal/x86/include -Ilib/librte_eal/common -I../lib/librte_eal/common -Ilib/librte_eal -I../lib/librte_eal -Ilib/librte_kvargs -I../lib/librte_kvargs -Ilib/librte_telemetry/../librte_metrics -I../lib/librte_telemetry/../librte_metrics -Ilib/librte_telemetry -I../lib/librte_telemetry -fdiagnostics-color=always -pipe -D_FILE_OFFSET_BITS=64 -Wall -Winvalid-pch -Werror -O2 -g -include rte_config.h -Wextra -Wcast-qual -Wdeprecated -Wformat-nonliteral -Wformat-security -Wmissing-declarations -Wmissing-prototypes -Wnested-externs -Wold-style-definition -Wpointer-arith -Wsign-compare -Wstrict-prototypes -Wundef -Wwrite-strings -Wno-missing-field-initializers -Wno-pointer-to-int-cast -D_GNU_SOURCE -m32 -fPIC -march=native -DALLOW_EXPERIMENTAL_API -DALLOW_INTERNAL_API -Wno-format-truncation -Wno-pointer-to-int-cast -MD -MQ 'drivers/a715181@@tmp_rte_common_iavf at sta/common_iavf_iavf_adminq.c.o' -MF 'drivers/a715181@@tmp_rte_common_iavf at sta/common_iavf_iavf_adminq.c.o.d' -o 'drivers/a715181@@tmp_rte_common_iavf at sta/common_iavf_iavf_adminq.c.o' -c ../drivers/common/iavf/iavf_adminq.c
In file included from ../drivers/common/iavf/iavf_prototype.h:10:0,
                 from ../drivers/common/iavf/iavf_adminq.c:9:
../drivers/common/iavf/virtchnl.h:155:36: error: division by zero [-Werror=div-by-zero]
  { virtchnl_static_assert_##X = (n)/((sizeof(struct X) == (n)) ? 1 : 0) }
                                    ^
../drivers/common/iavf/virtchnl.h:458:1: note: in expansion of macro ‘VIRTCHNL_CHECK_STRUCT_LEN’
 VIRTCHNL_CHECK_STRUCT_LEN(32, virtchnl_large_irq_map_info);
 ^~~~~~~~~~~~~~~~~~~~~~~~~
../drivers/common/iavf/virtchnl.h:458:31: error: enumerator value for ‘virtchnl_static_assert_virtchnl_large_irq_map_info’ is not an integer constant
 VIRTCHNL_CHECK_STRUCT_LEN(32, virtchnl_large_irq_map_info);
                               ^
../drivers/common/iavf/virtchnl.h:155:53: note: in definition of macro ‘VIRTCHNL_CHECK_STRUCT_LEN’
  { virtchnl_static_assert_##X = (n)/((sizeof(struct X) == (n)) ? 1 : 0) }
                                                     ^
../drivers/common/iavf/virtchnl.h:155:36: error: division by zero [-Werror=div-by-zero]
  { virtchnl_static_assert_##X = (n)/((sizeof(struct X) == (n)) ? 1 : 0) }
                                    ^
../drivers/common/iavf/virtchnl.h:488:1: note: in expansion of macro ‘VIRTCHNL_CHECK_STRUCT_LEN’
 VIRTCHNL_CHECK_STRUCT_LEN(24, virtchnl_large_queue_select);
 ^~~~~~~~~~~~~~~~~~~~~~~~~
../drivers/common/iavf/virtchnl.h:488:31: error: enumerator value for ‘virtchnl_static_assert_virtchnl_large_queue_select’ is not an integer constant
 VIRTCHNL_CHECK_STRUCT_LEN(24, virtchnl_large_queue_select);
                               ^
../drivers/common/iavf/virtchnl.h:155:53: note: in definition of macro ‘VIRTCHNL_CHECK_STRUCT_LEN’
  { virtchnl_static_assert_##X = (n)/((sizeof(struct X) == (n)) ? 1 : 0) }
                                                     ^
cc1: all warnings being treated as errors
[547/2107] Compiling C object 'drivers/a715181@@tmp_rte_common_iavf at sta/common_iavf_iavf_impl.c.o'.
FAILED: drivers/a715181@@tmp_rte_common_iavf at sta/common_iavf_iavf_impl.c.o 
gcc -Idrivers/a715181@@tmp_rte_common_iavf at sta -Idrivers -I../drivers -Idrivers/common/iavf -I../drivers/common/iavf -I. -I../ -Iconfig -I../config -Ilib/librte_eal/include -I../lib/librte_eal/include -Ilib/librte_eal/linux/include -I../lib/librte_eal/linux/include -Ilib/librte_eal/x86/include -I../lib/librte_eal/x86/include -Ilib/librte_eal/common -I../lib/librte_eal/common -Ilib/librte_eal -I../lib/librte_eal -Ilib/librte_kvargs -I../lib/librte_kvargs -Ilib/librte_telemetry/../librte_metrics -I../lib/librte_telemetry/../librte_metrics -Ilib/librte_telemetry -I../lib/librte_telemetry -fdiagnostics-color=always -pipe -D_FILE_OFFSET_BITS=64 -Wall -Winvalid-pch -Werror -O2 -g -include rte_config.h -Wextra -Wcast-qual -Wdeprecated -Wformat-nonliteral -Wformat-security -Wmissing-declarations -Wmissing-prototypes -Wnested-externs -Wold-style-definition -Wpointer-arith -Wsign-compare -Wstrict-prototypes -Wundef -Wwrite-strings -Wno-missing-field-initializers -Wno-pointer-to-int-cast -D_GNU_SOURCE -m32 -fPIC -march=native -DALLOW_EXPERIMENTAL_API -DALLOW_INTERNAL_API -Wno-format-truncation -Wno-pointer-to-int-cast -MD -MQ 'drivers/a715181@@tmp_rte_common_iavf at sta/common_iavf_iavf_impl.c.o' -MF 'drivers/a715181@@tmp_rte_common_iavf at sta/common_iavf_iavf_impl.c.o.d' -o 'drivers/a715181@@tmp_rte_common_iavf at sta/common_iavf_iavf_impl.c.o' -c ../drivers/common/iavf/iavf_impl.c
In file included from ../drivers/common/iavf/iavf_prototype.h:10:0,
                 from ../drivers/common/iavf/iavf_impl.c:14:
../drivers/common/iavf/virtchnl.h:155:36: error: division by zero [-Werror=div-by-zero]
  { virtchnl_static_assert_##X = (n)/((sizeof(struct X) == (n)) ? 1 : 0) }
                                    ^
../drivers/common/iavf/virtchnl.h:458:1: note: in expansion of macro ‘VIRTCHNL_CHECK_STRUCT_LEN’
 VIRTCHNL_CHECK_STRUCT_LEN(32, virtchnl_large_irq_map_info);
 ^~~~~~~~~~~~~~~~~~~~~~~~~
../drivers/common/iavf/virtchnl.h:458:31: error: enumerator value for ‘virtchnl_static_assert_virtchnl_large_irq_map_info’ is not an integer constant
 VIRTCHNL_CHECK_STRUCT_LEN(32, virtchnl_large_irq_map_info);
                               ^
../drivers/common/iavf/virtchnl.h:155:53: note: in definition of macro ‘VIRTCHNL_CHECK_STRUCT_LEN’
  { virtchnl_static_assert_##X = (n)/((sizeof(struct X) == (n)) ? 1 : 0) }
                                                     ^
../drivers/common/iavf/virtchnl.h:155:36: error: division by zero [-Werror=div-by-zero]
  { virtchnl_static_assert_##X = (n)/((sizeof(struct X) == (n)) ? 1 : 0) }
                                    ^
../drivers/common/iavf/virtchnl.h:488:1: note: in expansion of macro ‘VIRTCHNL_CHECK_STRUCT_LEN’
 VIRTCHNL_CHECK_STRUCT_LEN(24, virtchnl_large_queue_select);
 ^~~~~~~~~~~~~~~~~~~~~~~~~
../drivers/common/iavf/virtchnl.h:488:31: error: enumerator value for ‘virtchnl_static_assert_virtchnl_large_queue_select’ is not an integer constant
 VIRTCHNL_CHECK_STRUCT_LEN(24, virtchnl_large_queue_select);
                               ^
../drivers/common/iavf/virtchnl.h:155:53: note: in definition of macro ‘VIRTCHNL_CHECK_STRUCT_LEN’
  { virtchnl_static_assert_##X = (n)/((sizeof(struct X) == (n)) ? 1 : 0) }
                                                     ^
cc1: all warnings being treated as errors
[548/2107] Generating rte_common_cpt.sym_chk with a meson_exe.py custom command.
[549/2107] Generating vhost.sym_chk with a meson_exe.py custom command.
[550/2107] Generating graph.sym_chk with a meson_exe.py custom command.
[551/2107] Compiling C object 'lib/76b5a35@@rte_node at sta/librte_node_ip4_rewrite.c.o'.
[552/2107] Compiling C object 'drivers/a715181@@tmp_rte_common_octeontx2 at sta/common_octeontx2_otx2_sec_idev.c.o'.
[553/2107] Generating rte_common_dpaax.sym_chk with a meson_exe.py custom command.
[554/2107] Compiling C object 'drivers/a715181@@tmp_rte_common_octeontx2 at sta/common_octeontx2_otx2_dev.c.o'.
[555/2107] Compiling C object 'lib/76b5a35@@rte_pipeline at sta/librte_pipeline_rte_table_action.c.o'.
ninja: build stopped: subcommand failed



*Makefile Build Failed #1:
OS: UB2004-32
Target: i686-native-linuxapp-gcc
/root/UB2004-32_K4.15.0_GCC9.3.0/i686-native-linuxapp-gcc/bf764bbcb51347b282ab0b317d4923ad/dpdk/drivers/common/iavf/virtchnl.h:458:1: note: in expansion of macro ‘VIRTCHNL_CHECK_STRUCT_LEN’
  458 | VIRTCHNL_CHECK_STRUCT_LEN(32, virtchnl_large_irq_map_info);
      | ^~~~~~~~~~~~~~~~~~~~~~~~~
/root/UB2004-32_K4.15.0_GCC9.3.0/i686-native-linuxapp-gcc/bf764bbcb51347b282ab0b317d4923ad/dpdk/drivers/common/iavf/virtchnl.h:458:31: error: enumerator value for ‘virtchnl_static_assert_virtchnl_large_irq_map_info’ is not an integer constant
  458 | VIRTCHNL_CHECK_STRUCT_LEN(32, virtchnl_large_irq_map_info);
      |                               ^~~~~~~~~~~~~~~~~~~~~~~~~~~
/root/UB2004-32_K4.15.0_GCC9.3.0/i686-native-linuxapp-gcc/bf764bbcb51347b282ab0b317d4923ad/dpdk/drivers/common/iavf/virtchnl.h:155:53: note: in definition of macro ‘VIRTCHNL_CHECK_STRUCT_LEN’
--
/root/UB2004-32_K4.15.0_GCC9.3.0/i686-native-linuxapp-gcc/bf764bbcb51347b282ab0b317d4923ad/dpdk/drivers/common/iavf/virtchnl.h:488:1: note: in expansion of macro ‘VIRTCHNL_CHECK_STRUCT_LEN’
  488 | VIRTCHNL_CHECK_STRUCT_LEN(24, virtchnl_large_queue_select);
      | ^~~~~~~~~~~~~~~~~~~~~~~~~
/root/UB2004-32_K4.15.0_GCC9.3.0/i686-native-linuxapp-gcc/bf764bbcb51347b282ab0b317d4923ad/dpdk/drivers/common/iavf/virtchnl.h:488:31: error: enumerator value for ‘virtchnl_static_assert_virtchnl_large_queue_select’ is not an integer constant
  488 | VIRTCHNL_CHECK_STRUCT_LEN(24, virtchnl_large_queue_select);
      |                               ^~~~~~~~~~~~~~~~~~~~~~~~~~~
/root/UB2004-32_K4.15.0_GCC9.3.0/i686-native-linuxapp-gcc/bf764bbcb51347b282ab0b317d4923ad/dpdk/drivers/common/iavf/virtchnl.h:155:53: note: in definition of macro ‘VIRTCHNL_CHECK_STRUCT_LEN’
--
      |                                                     ^
  AR librte_common_octeontx.a
  INSTALL-LIB librte_common_octeontx.a
make[6]: *** [/root/UB2004-32_K4.15.0_GCC9.3.0/i686-native-linuxapp-gcc/bf764bbcb51347b282ab0b317d4923ad/dpdk/mk/internal/rte.compile-pre.mk:116: iavf_adminq.o] Error 1
make[6]: *** Waiting for unfinished jobs....
  CC dpaa_of.o
  CC caamflib.o
--
/root/UB2004-32_K4.15.0_GCC9.3.0/i686-native-linuxapp-gcc/bf764bbcb51347b282ab0b317d4923ad/dpdk/drivers/common/iavf/virtchnl.h:458:1: note: in expansion of macro ‘VIRTCHNL_CHECK_STRUCT_LEN’
  458 | VIRTCHNL_CHECK_STRUCT_LEN(32, virtchnl_large_irq_map_info);
      | ^~~~~~~~~~~~~~~~~~~~~~~~~
/root/UB2004-32_K4.15.0_GCC9.3.0/i686-native-linuxapp-gcc/bf764bbcb51347b282ab0b317d4923ad/dpdk/drivers/common/iavf/virtchnl.h:458:31: error: enumerator value for ‘virtchnl_static_assert_virtchnl_large_irq_map_info’ is not an integer constant
  458 | VIRTCHNL_CHECK_STRUCT_LEN(32, virtchnl_large_irq_map_info);
      |                               ^~~~~~~~~~~~~~~~~~~~~~~~~~~
/root/UB2004-32_K4.15.0_GCC9.3.0/i686-native-linuxapp-gcc/bf764bbcb51347b282ab0b317d4923ad/dpdk/drivers/common/iavf/virtchnl.h:155:53: note: in definition of macro ‘VIRTCHNL_CHECK_STRUCT_LEN’
--
/root/UB2004-32_K4.15.0_GCC9.3.0/i686-native-linuxapp-gcc/bf764bbcb51347b282ab0b317d4923ad/dpdk/drivers/common/iavf/virtchnl.h:488:1: note: in expansion of macro ‘VIRTCHNL_CHECK_STRUCT_LEN’
  488 | VIRTCHNL_CHECK_STRUCT_LEN(24, virtchnl_large_queue_select);
      | ^~~~~~~~~~~~~~~~~~~~~~~~~
/root/UB2004-32_K4.15.0_GCC9.3.0/i686-native-linuxapp-gcc/bf764bbcb51347b282ab0b317d4923ad/dpdk/drivers/common/iavf/virtchnl.h:488:31: error: enumerator value for ‘virtchnl_static_assert_virtchnl_large_queue_select’ is not an integer constant
  488 | VIRTCHNL_CHECK_STRUCT_LEN(24, virtchnl_large_queue_select);
      |                               ^~~~~~~~~~~~~~~~~~~~~~~~~~~
/root/UB2004-32_K4.15.0_GCC9.3.0/i686-native-linuxapp-gcc/bf764bbcb51347b282ab0b317d4923ad/dpdk/drivers/common/iavf/virtchnl.h:155:53: note: in definition of macro ‘VIRTCHNL_CHECK_STRUCT_LEN’
  155 |  { virtchnl_static_assert_##X = (n)/((sizeof(struct X) == (n)) ? 1 : 0) }
      |                                                     ^
make[6]: *** [/root/UB2004-32_K4.15.0_GCC9.3.0/i686-native-linuxapp-gcc/bf764bbcb51347b282ab0b317d4923ad/dpdk/mk/internal/rte.compile-pre.mk:116: iavf_common.o] Error 1
In file included from /root/UB2004-32_K4.15.0_GCC9.3.0/i686-native-linuxapp-gcc/bf764bbcb51347b282ab0b317d4923ad/dpdk/drivers/common/iavf/iavf_prototype.h:10,
                 from /root/UB2004-32_K4.15.0_GCC9.3.0/i686-native-linuxapp-gcc/bf764bbcb51347b282ab0b317d4923ad/dpdk/drivers/common/iavf/iavf_impl.c:14:
/root/UB2004-32_K4.15.0_GCC9.3.0/i686-native-linuxapp-gcc/bf764bbcb51347b282ab0b317d4923ad/dpdk/drivers/common/iavf/virtchnl.h:155:36: warning: division by zero [-Wdiv-by-zero]
--
/root/UB2004-32_K4.15.0_GCC9.3.0/i686-native-linuxapp-gcc/bf764bbcb51347b282ab0b317d4923ad/dpdk/drivers/common/iavf/virtchnl.h:458:1: note: in expansion of macro ‘VIRTCHNL_CHECK_STRUCT_LEN’
  458 | VIRTCHNL_CHECK_STRUCT_LEN(32, virtchnl_large_irq_map_info);
      | ^~~~~~~~~~~~~~~~~~~~~~~~~
/root/UB2004-32_K4.15.0_GCC9.3.0/i686-native-linuxapp-gcc/bf764bbcb51347b282ab0b317d4923ad/dpdk/drivers/common/iavf/virtchnl.h:458:31: error: enumerator value for ‘virtchnl_static_assert_virtchnl_large_irq_map_info’ is not an integer constant
  458 | VIRTCHNL_CHECK_STRUCT_LEN(32, virtchnl_large_irq_map_info);
      |                               ^~~~~~~~~~~~~~~~~~~~~~~~~~~
/root/UB2004-32_K4.15.0_GCC9.3.0/i686-native-linuxapp-gcc/bf764bbcb51347b282ab0b317d4923ad/dpdk/drivers/common/iavf/virtchnl.h:155:53: note: in definition of macro ‘VIRTCHNL_CHECK_STRUCT_LEN’
--
/root/UB2004-32_K4.15.0_GCC9.3.0/i686-native-linuxapp-gcc/bf764bbcb51347b282ab0b317d4923ad/dpdk/drivers/common/iavf/virtchnl.h:488:1: note: in expansion of macro ‘VIRTCHNL_CHECK_STRUCT_LEN’
  488 | VIRTCHNL_CHECK_STRUCT_LEN(24, virtchnl_large_queue_select);
      | ^~~~~~~~~~~~~~~~~~~~~~~~~
/root/UB2004-32_K4.15.0_GCC9.3.0/i686-native-linuxapp-gcc/bf764bbcb51347b282ab0b317d4923ad/dpdk/drivers/common/iavf/virtchnl.h:488:31: error: enumerator value for ‘virtchnl_static_assert_virtchnl_large_queue_select’ is not an integer constant
  488 | VIRTCHNL_CHECK_STRUCT_LEN(24, virtchnl_large_queue_select);
      |                               ^~~~~~~~~~~~~~~~~~~~~~~~~~~
/root/UB2004-32_K4.15.0_GCC9.3.0/i686-native-linuxapp-gcc/bf764bbcb51347b282ab0b317d4923ad/dpdk/drivers/common/iavf/virtchnl.h:155:53: note: in definition of macro ‘VIRTCHNL_CHECK_STRUCT_LEN’
  155 |  { virtchnl_static_assert_##X = (n)/((sizeof(struct X) == (n)) ? 1 : 0) }
      |                                                     ^
make[6]: *** [/root/UB2004-32_K4.15.0_GCC9.3.0/i686-native-linuxapp-gcc/bf764bbcb51347b282ab0b317d4923ad/dpdk/mk/internal/rte.compile-pre.mk:116: iavf_impl.o] Error 1
make[5]: *** [/root/UB2004-32_K4.15.0_GCC9.3.0/i686-native-linuxapp-gcc/bf764bbcb51347b282ab0b317d4923ad/dpdk/mk/rte.subdir.mk:35: iavf] Error 2
make[5]: *** Waiting for unfinished jobs....
  AR librte_common_octeontx2.a
  INSTALL-LIB librte_common_octeontx2.a
  AR librte_common_dpaax.a
  INSTALL-LIB librte_common_dpaax.a
make[4]: *** [/root/UB2004-32_K4.15.0_GCC9.3.0/i686-native-linuxapp-gcc/bf764bbcb51347b282ab0b317d4923ad/dpdk/mk/rte.subdir.mk:37: common] Error 2
make[3]: *** [/root/UB2004-32_K4.15.0_GCC9.3.0/i686-native-linuxapp-gcc/bf764bbcb51347b282ab0b317d4923ad/dpdk/mk/rte.sdkbuild.mk:53: drivers] Error 2
make[2]: *** [/root/UB2004-32_K4.15.0_GCC9.3.0/i686-native-linuxapp-gcc/bf764bbcb51347b282ab0b317d4923ad/dpdk/mk/rte.sdkroot.mk:115: all] Error 2
make[1]: *** [/root/UB2004-32_K4.15.0_GCC9.3.0/i686-native-linuxapp-gcc/bf764bbcb51347b282ab0b317d4923ad/dpdk/mk/rte.sdkinstall.mk:61: pre_install] Error 2
make: *** [/root/UB2004-32_K4.15.0_GCC9.3.0/i686-native-linuxapp-gcc/bf764bbcb51347b282ab0b317d4923ad/dpdk/mk/rte.sdkroot.mk:92: install] Error 2
DPDK STV team


More information about the test-report mailing list