[dpdk-test-report] |FAILURE| pw(73338) [v6, 25/25] examples/vm_power_*: new link status print format

sys_stv at intel.com sys_stv at intel.com
Wed Jul 8 03:02:43 CEST 2020


Test-Label: Intel-compilation
Test-Status: FAILURE
http://dpdk.org/patch/73338

_Compilation issues_

Submitter: Ivan Dyukov <i.dyukov at samsung.com>
Date: 2020-07-06 20:37:39
Reply_mail: 20200706203743.29416-26-i.dyukov at samsung.com

DPDK git baseline: Repo:dpdk, CommitID: fea5a82f5643901f8259bb1250acf53d6be4b9cb


Meson build Summary: 8 Builds Done, 2 Successful, 6 Failures, 0 Blocked

Makefile build Summary: 20 Builds Done, 20 Successful, 0 Failures, 0 Blocked

                +==============================================+===========+==========+
                |                   Makefile                   |   Meson   | Document |
+----------------+------+-------+------+------------+-----------+-----------+----------+
| os             | gcc  | clang | icc  | gcc+shared | gcc+debug | gcc/clang | pdf/html |
+----------------+------+-------+------+------------+-----------+-----------+----------+
| CENTOS82-64    | pass | pass  | pass | pass       | pass      | FAIL      |          |
| RHEL82-64      | pass |       |      |            |           |           |          |
| UB1804-64      | pass |       |      |            |           |           |          |
| FC32-64        | pass | pass  |      |            |           | FAIL      |          |
| CENTOS77-64    | pass |       |      |            |           |           |          |
| UB2004-64      | pass | pass  | pass |            |           | FAIL      | pass     |
| WIN10-64       |      |       |      |            |           | pass      |          |
| UB2004-32      | pass |       |      |            |           |           |          |
| UB1804-32      |      |       |      |            |           | FAIL      |          |
| FreeBSD1201-64 | pass | pass  |      | pass       | pass      | FAIL      |          |
| SUSE15-64      | pass | pass  |      |            |           | FAIL      |          |
+----------------+------+-------+------+------------+-----------+-----------+----------+
Test environment and configuration as below:

** Makefile build **


OS: CENTOS82-64
	Kernel Version: 4.18.0-193.el8.x86_64
	CPU info: Intel(R) Xeon(R) Platinum 8280M CPU @ 2.70GHz
	GCC Version: gcc (GCC) 8.3.1 20191121 (Red Hat 8.3.1-5)
	Clang Version: 9.0.1 (Red Hat 9.0.1-2.module_el8.2.0+309+0c7b6b03)
	x86_64-native-linuxapp-gcc
	x86_64-native-linuxapp-clang
	x86_64-native-linuxapp-icc
	x86_64-native-linuxapp-gcc+shared
	x86_64-native-linuxapp-gcc+debug


OS: RHEL82-64
	Kernel Version: 4.18.0-193.el8.x86_64
	CPU info: Intel(R) Xeon(R) Platinum 8280M CPU @ 2.70GHz
	GCC Version: gcc (GCC) 8.3.1 20191121 (Red Hat 8.3.1-5)
	Clang Version: 8.0.1 (Red Hat 8.0.1-1.module_el8.1.0+215+a01033fb)
	x86_64-native-linuxapp-gcc


OS: UB1804-64
	Kernel Version: 4.15.0-29-generic
	CPU info: Intel(R) Xeon(R) Platinum 8180 CPU @ 2.50GHz
	GCC Version: gcc (Ubuntu 7.5.0-3ubuntu1~18.04) 7.5.0
	Clang Version: 6.0.0-1ubuntu2 (tags/RELEASE_600/final)
	x86_64-native-linuxapp-gcc


OS: FC32-64
	Kernel Version: 5.6.0-0.rc7.git0.2.fc32.x86_64
	CPU info: Intel(R) Xeon(R) Platinum 8280M CPU @ 2.70GHz
	GCC Version: gcc (GCC) 10.0.1 20200311 (Red Hat 10.0.1-0.9)
	Clang Version: 10.0.0 (Fedora 10.0.0-0.3.rc4.fc32)
	x86_64-native-linuxapp-gcc
	x86_64-native-linuxapp-clang


OS: CENTOS77-64
	Kernel Version: 3.10.0-1062.9.1.el7.x86_64
	CPU info: Intel(R) Xeon(R) Platinum 8280M CPU @ 2.70GHz
	GCC Version: gcc (GCC) 4.8.5 20150623 (Red Hat 4.8.5-39)
	Clang Version: 3.4.2 (tags/RELEASE_34/dot2-final)
	x86_64-native-linuxapp-gcc


OS: UB2004-64
	Kernel Version: 5.4.0-26-generic
	CPU info: Intel(R) Xeon(R) Platinum 8180 CPU @ 2.50GHz
	GCC Version: gcc (Ubuntu 10-20200416-0ubuntu1) 10.0.1 20200416 (experimental) [master revision 3c3f12e2a76:dcee354ce56:44b326839d864fc10c459916abcc97f35a9ac3de]
	Clang Version: 10.0.0-4ubuntu1
	x86_64-native-linuxapp-clang
	x86_64-native-linuxapp-gcc
	x86_64-native-linuxapp-icc


OS: UB2004-32
	Kernel Version: 5.4.0-26-generic
	CPU info: Intel(R) Xeon(R) Platinum 8180 CPU @ 2.50GHz
	GCC Version: gcc (Ubuntu 9.3.0-10ubuntu2) 9.3.0
	Clang Version: 10.0.0-4ubuntu1
	i686-native-linuxapp-gcc


OS: FreeBSD1201-64
	Kernel Version: 12.1-RELEASE
	CPU info: Intel(R) Xeon(R) CPU E5-2699 v3 @ 2.30GHz (2294.74-MHz K8-class CPU)
	GCC Version: gcc (FreeBSD Ports Collection) 9.2.0
	Clang Version: 8.0.1 (tags/RELEASE_801/final 366581) (based on LLVM 8.0.1)
	x86_64-native-bsdapp-gcc
	x86_64-native-bsdapp-clang
	x86_64-native-bsdapp-gcc+shared
	x86_64-native-bsdapp-gcc+debug


OS: SUSE15-64
	Kernel Version: 4.12.14-lp150.11-default
	CPU info: Intel(R) Xeon(R) CPU E5-2699 v4 @ 2.20GHz
	GCC Version: gcc (SUSE Linux) 7.3.1 20180323 [gcc-7-branch revision 258812]
	Clang Version: 5.0.1 (tags/RELEASE_501/final 312548)
	x86_64-native-linuxapp-clang
	x86_64-native-linuxapp-gcc

** Meson build **


OS: CENTOS82-64
	Kernel Version: 4.18.0-193.el8.x86_64
	CPU info: Intel(R) Xeon(R) CPU E5-2699 v4 @ 2.20GHz
	GCC Version: gcc (GCC) 8.3.1 20191121 (Red Hat 8.3.1-5)
	Clang Version: 9.0.1 (Red Hat 9.0.1-2.module_el8.2.0+309+0c7b6b03)
	./build-gcc-static
	./build-gcc-shared
	./build-clang-static
	./build-clang-shared
	./build-x86-default


OS: UB2004-64
	Kernel Version: 5.4.0-26-generic
	CPU info: Intel(R) Xeon(R) Platinum 8180 CPU @ 2.50GHz
	GCC Version: gcc (Ubuntu 9.3.0-10ubuntu2) 9.3.0
	Clang Version: 10.0.0-4ubuntu1
	x86_64-native-linuxapp-doc
	./build-gcc-static
	./build-gcc-shared
	./build-clang-static
	./build-clang-shared
	./build-x86-default


OS: FC32-64
	Kernel Version: 5.6.0-0.rc7.git0.2.fc32.x86_64
	CPU info: Intel(R) Xeon(R) CPU E5-2699 v4 @ 2.20GHz
	GCC Version: gcc (GCC) 10.0.1 20200311 (Red Hat 10.0.1-0.9)
	Clang Version: 10.0.0 (Fedora 10.0.0-0.3.rc4.fc32)
	./build-gcc-static
	./build-gcc-shared
	./build-clang-static
	./build-clang-shared
	./build-x86-default


OS: WIN10-64
	Kernel Version: N/A
	CPU info: N/A
	GCC Version: N/A
	Clang Version: Clang 8.0.0
	x86_64-windows-clang


OS: UB1804-32
	Kernel Version: 4.15.0-20-generic
	CPU info: Intel(R) Xeon(R) CPU E5-2699 v4 @ 2.20GHz
	GCC Version: gcc (Ubuntu 7.5.0-3ubuntu1~18.04) 7.5.0
	Clang Version: 6.0.0-1ubuntu2 (tags/RELEASE_600/final)
	./build-gcc-static
	./build-gcc-shared
	./build-clang-static
	./build-clang-shared
	./build-x86-default


OS: FreeBSD1201-64
	Kernel Version: 12.1-RELEASE
	CPU info: Intel(R) Xeon(R) CPU E5-2699 v4 @ 2.20GHz (2194.97-MHz K8-class CPU)
	GCC Version: gcc (FreeBSD Ports Collection) 9.2.0
	Clang Version: 8.0.1 (tags/RELEASE_801/final 366581) (based on LLVM 8.0.1)
	./build-gcc-static
	./build-gcc-shared
	./build-clang-static
	./build-clang-shared
	./build-x86-default


OS: SUSE15-64
	Kernel Version: 4.12.14-lp150.12.82-default
	CPU info: Intel(R) Xeon(R) CPU E5-2699 v4 @ 2.20GHz
	GCC Version: gcc (SUSE Linux) 7.4.1 20190905 [gcc-7-branch revision 275407]
	Clang Version: 5.0.1 (tags/RELEASE_501/final 312548)
	./build-gcc-static
	./build-gcc-shared
	./build-clang-static
	./build-clang-shared
	./build-x86-default



*Meson Build Failed #1:
OS: CENTOS82-64
Target:./build-gcc-static
Message: drivers/baseband/fpga_5gnr_fec: Defining dependency "pmd_bbdev_fpga_5gnr_fec"
Library execinfo found: NO

app/test/meson.build:203:30: ERROR: Expecting rbracket got true.
        ['ethdev_link_status' true],
        ^_____________________^

A full log can be found at /root/CENTOS82-64_K4.18.0_GCC8.3.1/x86_64-native-linuxapp-gcc/23a183dd70cf4b43b846f63c48ee3682/dpdk/build-gcc-static/meson-logs/meson-log.txt
ninja -C ./build-gcc-static
ninja: Entering directory `./build-gcc-static'
ninja: error: loading 'build.ninja': No such file or directory
meson  -Dexamples=all --buildtype=debugoptimized --werror --default-library=shared /root/CENTOS82-64_K4.18.0_GCC8.3.1/x86_64-native-linuxapp-gcc/23a183dd70cf4b43b846f63c48ee3682/dpdk/devtools/.. ./build-gcc-shared
The Meson build system
Version: 0.52.1
--
Message: drivers/baseband/fpga_5gnr_fec: Defining dependency "pmd_bbdev_fpga_5gnr_fec"
Library execinfo found: NO

app/test/meson.build:203:30: ERROR: Expecting rbracket got true.
        ['ethdev_link_status' true],
        ^_____________________^

A full log can be found at /root/CENTOS82-64_K4.18.0_GCC8.3.1/x86_64-native-linuxapp-gcc/23a183dd70cf4b43b846f63c48ee3682/dpdk/build-gcc-shared/meson-logs/meson-log.txt
ninja -C ./build-gcc-shared
ninja: Entering directory `./build-gcc-shared'
ninja: error: loading 'build.ninja': No such file or directory
meson  -Dexamples=l3fwd --buildtype=debugoptimized --werror --default-library=static /root/CENTOS82-64_K4.18.0_GCC8.3.1/x86_64-native-linuxapp-gcc/23a183dd70cf4b43b846f63c48ee3682/dpdk/devtools/.. ./build-clang-static
The Meson build system
Version: 0.52.1
--
Message: drivers/baseband/fpga_5gnr_fec: Defining dependency "pmd_bbdev_fpga_5gnr_fec"
Library execinfo found: NO

app/test/meson.build:203:30: ERROR: Expecting rbracket got true.
        ['ethdev_link_status' true],
        ^_____________________^

A full log can be found at /root/CENTOS82-64_K4.18.0_GCC8.3.1/x86_64-native-linuxapp-gcc/23a183dd70cf4b43b846f63c48ee3682/dpdk/build-clang-static/meson-logs/meson-log.txt
ninja -C ./build-clang-static
ninja: Entering directory `./build-clang-static'
ninja: error: loading 'build.ninja': No such file or directory
meson  -Dexamples=all --buildtype=debugoptimized --werror --default-library=shared /root/CENTOS82-64_K4.18.0_GCC8.3.1/x86_64-native-linuxapp-gcc/23a183dd70cf4b43b846f63c48ee3682/dpdk/devtools/.. ./build-clang-shared
The Meson build system
Version: 0.52.1
--
Message: drivers/baseband/fpga_5gnr_fec: Defining dependency "pmd_bbdev_fpga_5gnr_fec"
Library execinfo found: NO

app/test/meson.build:203:30: ERROR: Expecting rbracket got true.
        ['ethdev_link_status' true],
        ^_____________________^

A full log can be found at /root/CENTOS82-64_K4.18.0_GCC8.3.1/x86_64-native-linuxapp-gcc/23a183dd70cf4b43b846f63c48ee3682/dpdk/build-clang-shared/meson-logs/meson-log.txt
ninja -C ./build-clang-shared
ninja: Entering directory `./build-clang-shared'
ninja: error: loading 'build.ninja': No such file or directory
meson  -Dexamples=all --buildtype=debugoptimized --werror -Dlibdir=lib -Dmachine=nehalem --default-library=shared /root/CENTOS82-64_K4.18.0_GCC8.3.1/x86_64-native-linuxapp-gcc/23a183dd70cf4b43b846f63c48ee3682/dpdk/devtools/.. ./build-x86-default
The Meson build system
Version: 0.52.1
--
Message: drivers/baseband/fpga_5gnr_fec: Defining dependency "pmd_bbdev_fpga_5gnr_fec"
Library execinfo found: NO

app/test/meson.build:203:30: ERROR: Expecting rbracket got true.
        ['ethdev_link_status' true],
        ^_____________________^

A full log can be found at /root/CENTOS82-64_K4.18.0_GCC8.3.1/x86_64-native-linuxapp-gcc/23a183dd70cf4b43b846f63c48ee3682/dpdk/build-x86-default/meson-logs/meson-log.txt
ninja -C ./build-x86-default
ninja: Entering directory `./build-x86-default'
ninja: error: loading 'build.ninja': No such file or directory
DESTDIR=/root/CENTOS82-64_K4.18.0_GCC8.3.1/x86_64-native-linuxapp-gcc/23a183dd70cf4b43b846f63c48ee3682/dpdk/build-x86-default/install ninja -C /root/CENTOS82-64_K4.18.0_GCC8.3.1/x86_64-native-linuxapp-gcc/23a183dd70cf4b43b846f63c48ee3682/dpdk/build-x86-default install >/dev/null
ninja: error: loading 'build.ninja': No such file or directory
find: ‘/root/CENTOS82-64_K4.18.0_GCC8.3.1/x86_64-native-linuxapp-gcc/23a183dd70cf4b43b846f63c48ee3682/dpdk/build-x86-default/install’: No such file or directory
dirname: missing operand
Try 'dirname --help' for more information.


*Meson Build Failed #2:
OS: FC32-64
Target:./build-gcc-static
Message: drivers/baseband/fpga_5gnr_fec: Defining dependency "pmd_bbdev_fpga_5gnr_fec"
Library execinfo found: NO

app/test/meson.build:203:30: ERROR: Expecting rbracket got true.
        ['ethdev_link_status' true],
        ^_____________________^

A full log can be found at /root/FC32-64_K5.6.0_GCC10.0.1/x86_64-native-linuxapp-gcc/23a183dd70cf4b43b846f63c48ee3682/dpdk/build-gcc-static/meson-logs/meson-log.txt
ninja -C ./build-gcc-static
ninja: Entering directory `./build-gcc-static'
ninja: error: loading 'build.ninja': No such file or directory
meson  -Dexamples=all --buildtype=debugoptimized --werror --default-library=shared /root/FC32-64_K5.6.0_GCC10.0.1/x86_64-native-linuxapp-gcc/23a183dd70cf4b43b846f63c48ee3682/dpdk/devtools/.. ./build-gcc-shared
The Meson build system
Version: 0.52.1
--
Message: drivers/baseband/fpga_5gnr_fec: Defining dependency "pmd_bbdev_fpga_5gnr_fec"
Library execinfo found: NO

app/test/meson.build:203:30: ERROR: Expecting rbracket got true.
        ['ethdev_link_status' true],
        ^_____________________^

A full log can be found at /root/FC32-64_K5.6.0_GCC10.0.1/x86_64-native-linuxapp-gcc/23a183dd70cf4b43b846f63c48ee3682/dpdk/build-gcc-shared/meson-logs/meson-log.txt
ninja -C ./build-gcc-shared
ninja: Entering directory `./build-gcc-shared'
ninja: error: loading 'build.ninja': No such file or directory
meson  -Dexamples=l3fwd --buildtype=debugoptimized --werror --default-library=static /root/FC32-64_K5.6.0_GCC10.0.1/x86_64-native-linuxapp-gcc/23a183dd70cf4b43b846f63c48ee3682/dpdk/devtools/.. ./build-clang-static
The Meson build system
Version: 0.52.1
--
Message: drivers/baseband/fpga_5gnr_fec: Defining dependency "pmd_bbdev_fpga_5gnr_fec"
Library execinfo found: NO

app/test/meson.build:203:30: ERROR: Expecting rbracket got true.
        ['ethdev_link_status' true],
        ^_____________________^

A full log can be found at /root/FC32-64_K5.6.0_GCC10.0.1/x86_64-native-linuxapp-gcc/23a183dd70cf4b43b846f63c48ee3682/dpdk/build-clang-static/meson-logs/meson-log.txt
ninja -C ./build-clang-static
ninja: Entering directory `./build-clang-static'
ninja: error: loading 'build.ninja': No such file or directory
meson  -Dexamples=all --buildtype=debugoptimized --werror --default-library=shared /root/FC32-64_K5.6.0_GCC10.0.1/x86_64-native-linuxapp-gcc/23a183dd70cf4b43b846f63c48ee3682/dpdk/devtools/.. ./build-clang-shared
The Meson build system
Version: 0.52.1
--
Message: drivers/baseband/fpga_5gnr_fec: Defining dependency "pmd_bbdev_fpga_5gnr_fec"
Library execinfo found: NO

app/test/meson.build:203:30: ERROR: Expecting rbracket got true.
        ['ethdev_link_status' true],
        ^_____________________^

A full log can be found at /root/FC32-64_K5.6.0_GCC10.0.1/x86_64-native-linuxapp-gcc/23a183dd70cf4b43b846f63c48ee3682/dpdk/build-clang-shared/meson-logs/meson-log.txt
ninja -C ./build-clang-shared
ninja: Entering directory `./build-clang-shared'
ninja: error: loading 'build.ninja': No such file or directory
meson  -Dexamples=all --buildtype=debugoptimized --werror -Dlibdir=lib -Dmachine=nehalem --default-library=shared /root/FC32-64_K5.6.0_GCC10.0.1/x86_64-native-linuxapp-gcc/23a183dd70cf4b43b846f63c48ee3682/dpdk/devtools/.. ./build-x86-default
The Meson build system
Version: 0.52.1
--
Message: drivers/baseband/fpga_5gnr_fec: Defining dependency "pmd_bbdev_fpga_5gnr_fec"
Library execinfo found: NO

app/test/meson.build:203:30: ERROR: Expecting rbracket got true.
        ['ethdev_link_status' true],
        ^_____________________^

A full log can be found at /root/FC32-64_K5.6.0_GCC10.0.1/x86_64-native-linuxapp-gcc/23a183dd70cf4b43b846f63c48ee3682/dpdk/build-x86-default/meson-logs/meson-log.txt
ninja -C ./build-x86-default
ninja: Entering directory `./build-x86-default'
ninja: error: loading 'build.ninja': No such file or directory
DESTDIR=/root/FC32-64_K5.6.0_GCC10.0.1/x86_64-native-linuxapp-gcc/23a183dd70cf4b43b846f63c48ee3682/dpdk/build-x86-default/install ninja -C /root/FC32-64_K5.6.0_GCC10.0.1/x86_64-native-linuxapp-gcc/23a183dd70cf4b43b846f63c48ee3682/dpdk/build-x86-default install >/dev/null
ninja: error: loading 'build.ninja': No such file or directory
find: ‘/root/FC32-64_K5.6.0_GCC10.0.1/x86_64-native-linuxapp-gcc/23a183dd70cf4b43b846f63c48ee3682/dpdk/build-x86-default/install’: No such file or directory
dirname: missing operand
Try 'dirname --help' for more information.


*Meson Build Failed #3:
OS: FreeBSD1201-64
Target:./build-gcc-static
Message: drivers/baseband/fpga_5gnr_fec: Defining dependency "pmd_bbdev_fpga_5gnr_fec"
Library execinfo found: YES

app/test/meson.build:203:30: ERROR: Expecting rbracket got true.
        ['ethdev_link_status' true],
        ^_____________________^

A full log can be found at /root/FreeBSD1201-64_K12.1_GCC9.2.0/x86_64-native-bsdapp-gcc/23a183dd70cf4b43b846f63c48ee3682/dpdk/build-gcc-static/meson-logs/meson-log.txt
ninja -C ./build-gcc-static
ninja: Entering directory `./build-gcc-static'
ninja: error: loading 'build.ninja': No such file or directory
meson  -Dexamples=all --buildtype=debugoptimized --werror --default-library=shared /root/FreeBSD1201-64_K12.1_GCC9.2.0/x86_64-native-bsdapp-gcc/23a183dd70cf4b43b846f63c48ee3682/dpdk/devtools/.. ./build-gcc-shared
The Meson build system
Version: 0.54.0
--
Message: drivers/baseband/fpga_5gnr_fec: Defining dependency "pmd_bbdev_fpga_5gnr_fec"
Library execinfo found: YES

app/test/meson.build:203:30: ERROR: Expecting rbracket got true.
        ['ethdev_link_status' true],
        ^_____________________^

A full log can be found at /root/FreeBSD1201-64_K12.1_GCC9.2.0/x86_64-native-bsdapp-gcc/23a183dd70cf4b43b846f63c48ee3682/dpdk/build-gcc-shared/meson-logs/meson-log.txt
ninja -C ./build-gcc-shared
ninja: Entering directory `./build-gcc-shared'
ninja: error: loading 'build.ninja': No such file or directory
meson  -Dexamples=l3fwd --buildtype=debugoptimized --werror --default-library=static /root/FreeBSD1201-64_K12.1_GCC9.2.0/x86_64-native-bsdapp-gcc/23a183dd70cf4b43b846f63c48ee3682/dpdk/devtools/.. ./build-clang-static
The Meson build system
Version: 0.54.0
--
Message: drivers/baseband/fpga_5gnr_fec: Defining dependency "pmd_bbdev_fpga_5gnr_fec"
Library execinfo found: YES

app/test/meson.build:203:30: ERROR: Expecting rbracket got true.
        ['ethdev_link_status' true],
        ^_____________________^

A full log can be found at /root/FreeBSD1201-64_K12.1_GCC9.2.0/x86_64-native-bsdapp-gcc/23a183dd70cf4b43b846f63c48ee3682/dpdk/build-clang-static/meson-logs/meson-log.txt
ninja -C ./build-clang-static
ninja: Entering directory `./build-clang-static'
ninja: error: loading 'build.ninja': No such file or directory
meson  -Dexamples=all --buildtype=debugoptimized --werror --default-library=shared /root/FreeBSD1201-64_K12.1_GCC9.2.0/x86_64-native-bsdapp-gcc/23a183dd70cf4b43b846f63c48ee3682/dpdk/devtools/.. ./build-clang-shared
The Meson build system
Version: 0.54.0
--
Message: drivers/baseband/fpga_5gnr_fec: Defining dependency "pmd_bbdev_fpga_5gnr_fec"
Library execinfo found: YES

app/test/meson.build:203:30: ERROR: Expecting rbracket got true.
        ['ethdev_link_status' true],
        ^_____________________^

A full log can be found at /root/FreeBSD1201-64_K12.1_GCC9.2.0/x86_64-native-bsdapp-gcc/23a183dd70cf4b43b846f63c48ee3682/dpdk/build-clang-shared/meson-logs/meson-log.txt
ninja -C ./build-clang-shared
ninja: Entering directory `./build-clang-shared'
ninja: error: loading 'build.ninja': No such file or directory
meson  -Dexamples=all --buildtype=debugoptimized --werror -Dlibdir=lib -Dmachine=nehalem --default-library=shared /root/FreeBSD1201-64_K12.1_GCC9.2.0/x86_64-native-bsdapp-gcc/23a183dd70cf4b43b846f63c48ee3682/dpdk/devtools/.. ./build-x86-default
The Meson build system
Version: 0.54.0
--
Message: drivers/baseband/fpga_5gnr_fec: Defining dependency "pmd_bbdev_fpga_5gnr_fec"
Library execinfo found: YES

app/test/meson.build:203:30: ERROR: Expecting rbracket got true.
        ['ethdev_link_status' true],
        ^_____________________^

A full log can be found at /root/FreeBSD1201-64_K12.1_GCC9.2.0/x86_64-native-bsdapp-gcc/23a183dd70cf4b43b846f63c48ee3682/dpdk/build-x86-default/meson-logs/meson-log.txt
ninja -C ./build-x86-default
ninja: Entering directory `./build-x86-default'
ninja: error: loading 'build.ninja': No such file or directory
DESTDIR=/root/FreeBSD1201-64_K12.1_GCC9.2.0/x86_64-native-bsdapp-gcc/23a183dd70cf4b43b846f63c48ee3682/dpdk/build-x86-default/install ninja -C /root/FreeBSD1201-64_K12.1_GCC9.2.0/x86_64-native-bsdapp-gcc/23a183dd70cf4b43b846f63c48ee3682/dpdk/build-x86-default install >/dev/null
ninja: error: loading 'build.ninja': No such file or directory
find: /root/FreeBSD1201-64_K12.1_GCC9.2.0/x86_64-native-bsdapp-gcc/23a183dd70cf4b43b846f63c48ee3682/dpdk/build-x86-default/install: No such file or directory
usage: dirname string [...]


*Meson Build Failed #4:
OS: SUSE15-64
Target:./build-gcc-static
Message: drivers/baseband/fpga_5gnr_fec: Defining dependency "pmd_bbdev_fpga_5gnr_fec"
Library execinfo found: NO

app/test/meson.build:203:30: ERROR: Expecting rbracket got true.
        ['ethdev_link_status' true],
        ^_____________________^

A full log can be found at /root/SUSE15-64_K4.12.14_GCC7.3.1/x86_64-native-linuxapp-gcc/23a183dd70cf4b43b846f63c48ee3682/dpdk/build-gcc-static/meson-logs/meson-log.txt
ninja -C ./build-gcc-static
ninja: Entering directory `./build-gcc-static'
ninja: error: loading 'build.ninja': No such file or directory
meson  -Dexamples=all --buildtype=debugoptimized --werror --default-library=shared /root/SUSE15-64_K4.12.14_GCC7.3.1/x86_64-native-linuxapp-gcc/23a183dd70cf4b43b846f63c48ee3682/dpdk/devtools/.. ./build-gcc-shared
The Meson build system
Version: 0.50.1
--
Message: drivers/baseband/fpga_5gnr_fec: Defining dependency "pmd_bbdev_fpga_5gnr_fec"
Library execinfo found: NO

app/test/meson.build:203:30: ERROR: Expecting rbracket got true.
        ['ethdev_link_status' true],
        ^_____________________^

A full log can be found at /root/SUSE15-64_K4.12.14_GCC7.3.1/x86_64-native-linuxapp-gcc/23a183dd70cf4b43b846f63c48ee3682/dpdk/build-gcc-shared/meson-logs/meson-log.txt
ninja -C ./build-gcc-shared
ninja: Entering directory `./build-gcc-shared'
ninja: error: loading 'build.ninja': No such file or directory
meson  -Dexamples=l3fwd --buildtype=debugoptimized --werror --default-library=static /root/SUSE15-64_K4.12.14_GCC7.3.1/x86_64-native-linuxapp-gcc/23a183dd70cf4b43b846f63c48ee3682/dpdk/devtools/.. ./build-clang-static
The Meson build system
Version: 0.50.1
--
Message: drivers/baseband/fpga_5gnr_fec: Defining dependency "pmd_bbdev_fpga_5gnr_fec"
Library execinfo found: NO

app/test/meson.build:203:30: ERROR: Expecting rbracket got true.
        ['ethdev_link_status' true],
        ^_____________________^

A full log can be found at /root/SUSE15-64_K4.12.14_GCC7.3.1/x86_64-native-linuxapp-gcc/23a183dd70cf4b43b846f63c48ee3682/dpdk/build-clang-static/meson-logs/meson-log.txt
ninja -C ./build-clang-static
ninja: Entering directory `./build-clang-static'
ninja: error: loading 'build.ninja': No such file or directory
meson  -Dexamples=all --buildtype=debugoptimized --werror --default-library=shared /root/SUSE15-64_K4.12.14_GCC7.3.1/x86_64-native-linuxapp-gcc/23a183dd70cf4b43b846f63c48ee3682/dpdk/devtools/.. ./build-clang-shared
The Meson build system
Version: 0.50.1
--
Message: drivers/baseband/fpga_5gnr_fec: Defining dependency "pmd_bbdev_fpga_5gnr_fec"
Library execinfo found: NO

app/test/meson.build:203:30: ERROR: Expecting rbracket got true.
        ['ethdev_link_status' true],
        ^_____________________^

A full log can be found at /root/SUSE15-64_K4.12.14_GCC7.3.1/x86_64-native-linuxapp-gcc/23a183dd70cf4b43b846f63c48ee3682/dpdk/build-clang-shared/meson-logs/meson-log.txt
ninja -C ./build-clang-shared
ninja: Entering directory `./build-clang-shared'
ninja: error: loading 'build.ninja': No such file or directory
meson  -Dexamples=all --buildtype=debugoptimized --werror -Dlibdir=lib -Dmachine=nehalem --default-library=shared /root/SUSE15-64_K4.12.14_GCC7.3.1/x86_64-native-linuxapp-gcc/23a183dd70cf4b43b846f63c48ee3682/dpdk/devtools/.. ./build-x86-default
The Meson build system
Version: 0.50.1
--
Message: drivers/baseband/fpga_5gnr_fec: Defining dependency "pmd_bbdev_fpga_5gnr_fec"
Library execinfo found: NO

app/test/meson.build:203:30: ERROR: Expecting rbracket got true.
        ['ethdev_link_status' true],
        ^_____________________^

A full log can be found at /root/SUSE15-64_K4.12.14_GCC7.3.1/x86_64-native-linuxapp-gcc/23a183dd70cf4b43b846f63c48ee3682/dpdk/build-x86-default/meson-logs/meson-log.txt
ninja -C ./build-x86-default
ninja: Entering directory `./build-x86-default'
ninja: error: loading 'build.ninja': No such file or directory
DESTDIR=/root/SUSE15-64_K4.12.14_GCC7.3.1/x86_64-native-linuxapp-gcc/23a183dd70cf4b43b846f63c48ee3682/dpdk/build-x86-default/install ninja -C /root/SUSE15-64_K4.12.14_GCC7.3.1/x86_64-native-linuxapp-gcc/23a183dd70cf4b43b846f63c48ee3682/dpdk/build-x86-default install >/dev/null
ninja: error: loading 'build.ninja': No such file or directory
find: ‘/root/SUSE15-64_K4.12.14_GCC7.3.1/x86_64-native-linuxapp-gcc/23a183dd70cf4b43b846f63c48ee3682/dpdk/build-x86-default/install’: No such file or directory
dirname: missing operand
Try 'dirname --help' for more information.


*Meson Build Failed #5:
OS: UB1804-32
Target:./build-gcc-static
Message: drivers/baseband/fpga_5gnr_fec: Defining dependency "pmd_bbdev_fpga_5gnr_fec"
Library execinfo found: NO

app/test/meson.build:203:30: ERROR: Expecting rbracket got true.
        ['ethdev_link_status' true],
        ^_____________________^

A full log can be found at /root/UB1804-32_K4.15.0_GCC7.3.0/i686-native-linuxapp-gcc/23a183dd70cf4b43b846f63c48ee3682/dpdk/build-gcc-static/meson-logs/meson-log.txt
ninja -C ./build-gcc-static
ninja: Entering directory `./build-gcc-static'
ninja: error: loading 'build.ninja': No such file or directory
meson  -Dexamples=all --buildtype=debugoptimized --werror --default-library=shared /root/UB1804-32_K4.15.0_GCC7.3.0/i686-native-linuxapp-gcc/23a183dd70cf4b43b846f63c48ee3682/dpdk/devtools/.. ./build-gcc-shared
The Meson build system
Version: 0.50.0
--
Message: drivers/baseband/fpga_5gnr_fec: Defining dependency "pmd_bbdev_fpga_5gnr_fec"
Library execinfo found: NO

app/test/meson.build:203:30: ERROR: Expecting rbracket got true.
        ['ethdev_link_status' true],
        ^_____________________^

A full log can be found at /root/UB1804-32_K4.15.0_GCC7.3.0/i686-native-linuxapp-gcc/23a183dd70cf4b43b846f63c48ee3682/dpdk/build-gcc-shared/meson-logs/meson-log.txt
ninja -C ./build-gcc-shared
ninja: Entering directory `./build-gcc-shared'
ninja: error: loading 'build.ninja': No such file or directory
meson  -Dexamples=l3fwd --buildtype=debugoptimized --werror --default-library=static /root/UB1804-32_K4.15.0_GCC7.3.0/i686-native-linuxapp-gcc/23a183dd70cf4b43b846f63c48ee3682/dpdk/devtools/.. ./build-clang-static
The Meson build system
Version: 0.50.0
--
Message: drivers/baseband/fpga_5gnr_fec: Defining dependency "pmd_bbdev_fpga_5gnr_fec"
Library execinfo found: NO

app/test/meson.build:203:30: ERROR: Expecting rbracket got true.
        ['ethdev_link_status' true],
        ^_____________________^

A full log can be found at /root/UB1804-32_K4.15.0_GCC7.3.0/i686-native-linuxapp-gcc/23a183dd70cf4b43b846f63c48ee3682/dpdk/build-clang-static/meson-logs/meson-log.txt
ninja -C ./build-clang-static
ninja: Entering directory `./build-clang-static'
ninja: error: loading 'build.ninja': No such file or directory
meson  -Dexamples=all --buildtype=debugoptimized --werror --default-library=shared /root/UB1804-32_K4.15.0_GCC7.3.0/i686-native-linuxapp-gcc/23a183dd70cf4b43b846f63c48ee3682/dpdk/devtools/.. ./build-clang-shared
The Meson build system
Version: 0.50.0
--
Message: drivers/baseband/fpga_5gnr_fec: Defining dependency "pmd_bbdev_fpga_5gnr_fec"
Library execinfo found: NO

app/test/meson.build:203:30: ERROR: Expecting rbracket got true.
        ['ethdev_link_status' true],
        ^_____________________^

A full log can be found at /root/UB1804-32_K4.15.0_GCC7.3.0/i686-native-linuxapp-gcc/23a183dd70cf4b43b846f63c48ee3682/dpdk/build-clang-shared/meson-logs/meson-log.txt
ninja -C ./build-clang-shared
ninja: Entering directory `./build-clang-shared'
ninja: error: loading 'build.ninja': No such file or directory
meson  -Dexamples=all --buildtype=debugoptimized --werror -Dlibdir=lib -Dmachine=nehalem --default-library=shared /root/UB1804-32_K4.15.0_GCC7.3.0/i686-native-linuxapp-gcc/23a183dd70cf4b43b846f63c48ee3682/dpdk/devtools/.. ./build-x86-default
The Meson build system
Version: 0.50.0
--
Message: drivers/baseband/fpga_5gnr_fec: Defining dependency "pmd_bbdev_fpga_5gnr_fec"
Library execinfo found: NO

app/test/meson.build:203:30: ERROR: Expecting rbracket got true.
        ['ethdev_link_status' true],
        ^_____________________^

A full log can be found at /root/UB1804-32_K4.15.0_GCC7.3.0/i686-native-linuxapp-gcc/23a183dd70cf4b43b846f63c48ee3682/dpdk/build-x86-default/meson-logs/meson-log.txt
ninja -C ./build-x86-default
ninja: Entering directory `./build-x86-default'
ninja: error: loading 'build.ninja': No such file or directory
DESTDIR=/root/UB1804-32_K4.15.0_GCC7.3.0/i686-native-linuxapp-gcc/23a183dd70cf4b43b846f63c48ee3682/dpdk/build-x86-default/install ninja -C /root/UB1804-32_K4.15.0_GCC7.3.0/i686-native-linuxapp-gcc/23a183dd70cf4b43b846f63c48ee3682/dpdk/build-x86-default install >/dev/null
ninja: error: loading 'build.ninja': No such file or directory
find: ‘/root/UB1804-32_K4.15.0_GCC7.3.0/i686-native-linuxapp-gcc/23a183dd70cf4b43b846f63c48ee3682/dpdk/build-x86-default/install’: No such file or directory
dirname: missing operand
Try 'dirname --help' for more information.


*Meson Build Failed #6:
OS: UB2004-64
Target:./build-gcc-static
Message: drivers/baseband/fpga_5gnr_fec: Defining dependency "pmd_bbdev_fpga_5gnr_fec"
Library execinfo found: NO

app/test/meson.build:203:30: ERROR: Expecting rbracket got true.
        ['ethdev_link_status' true],
        ^_____________________^

A full log can be found at /root/UB2004-64_K5.4.0_GCC9.3.0/x86_64-native-linuxapp-gcc/23a183dd70cf4b43b846f63c48ee3682/dpdk/build-gcc-static/meson-logs/meson-log.txt
ninja -C ./build-gcc-static
ninja: Entering directory `./build-gcc-static'
ninja: error: loading 'build.ninja': No such file or directory
meson  -Dexamples=all --buildtype=debugoptimized --werror --default-library=shared /root/UB2004-64_K5.4.0_GCC9.3.0/x86_64-native-linuxapp-gcc/23a183dd70cf4b43b846f63c48ee3682/dpdk/devtools/.. ./build-gcc-shared
The Meson build system
Version: 0.52.1
--
Message: drivers/baseband/fpga_5gnr_fec: Defining dependency "pmd_bbdev_fpga_5gnr_fec"
Library execinfo found: NO

app/test/meson.build:203:30: ERROR: Expecting rbracket got true.
        ['ethdev_link_status' true],
        ^_____________________^

A full log can be found at /root/UB2004-64_K5.4.0_GCC9.3.0/x86_64-native-linuxapp-gcc/23a183dd70cf4b43b846f63c48ee3682/dpdk/build-gcc-shared/meson-logs/meson-log.txt
ninja -C ./build-gcc-shared
ninja: Entering directory `./build-gcc-shared'
ninja: error: loading 'build.ninja': No such file or directory
meson  -Dexamples=l3fwd --buildtype=debugoptimized --werror --default-library=static /root/UB2004-64_K5.4.0_GCC9.3.0/x86_64-native-linuxapp-gcc/23a183dd70cf4b43b846f63c48ee3682/dpdk/devtools/.. ./build-clang-static
The Meson build system
Version: 0.52.1
--
Message: drivers/baseband/fpga_5gnr_fec: Defining dependency "pmd_bbdev_fpga_5gnr_fec"
Library execinfo found: NO

app/test/meson.build:203:30: ERROR: Expecting rbracket got true.
        ['ethdev_link_status' true],
        ^_____________________^

A full log can be found at /root/UB2004-64_K5.4.0_GCC9.3.0/x86_64-native-linuxapp-gcc/23a183dd70cf4b43b846f63c48ee3682/dpdk/build-clang-static/meson-logs/meson-log.txt
ninja -C ./build-clang-static
ninja: Entering directory `./build-clang-static'
ninja: error: loading 'build.ninja': No such file or directory
meson  -Dexamples=all --buildtype=debugoptimized --werror --default-library=shared /root/UB2004-64_K5.4.0_GCC9.3.0/x86_64-native-linuxapp-gcc/23a183dd70cf4b43b846f63c48ee3682/dpdk/devtools/.. ./build-clang-shared
The Meson build system
Version: 0.52.1
--
Message: drivers/baseband/fpga_5gnr_fec: Defining dependency "pmd_bbdev_fpga_5gnr_fec"
Library execinfo found: NO

app/test/meson.build:203:30: ERROR: Expecting rbracket got true.
        ['ethdev_link_status' true],
        ^_____________________^

A full log can be found at /root/UB2004-64_K5.4.0_GCC9.3.0/x86_64-native-linuxapp-gcc/23a183dd70cf4b43b846f63c48ee3682/dpdk/build-clang-shared/meson-logs/meson-log.txt
ninja -C ./build-clang-shared
ninja: Entering directory `./build-clang-shared'
ninja: error: loading 'build.ninja': No such file or directory
meson  -Dexamples=all --buildtype=debugoptimized --werror -Dlibdir=lib -Dmachine=nehalem --default-library=shared /root/UB2004-64_K5.4.0_GCC9.3.0/x86_64-native-linuxapp-gcc/23a183dd70cf4b43b846f63c48ee3682/dpdk/devtools/.. ./build-x86-default
The Meson build system
Version: 0.52.1
--
Message: drivers/baseband/fpga_5gnr_fec: Defining dependency "pmd_bbdev_fpga_5gnr_fec"
Library execinfo found: NO

app/test/meson.build:203:30: ERROR: Expecting rbracket got true.
        ['ethdev_link_status' true],
        ^_____________________^

A full log can be found at /root/UB2004-64_K5.4.0_GCC9.3.0/x86_64-native-linuxapp-gcc/23a183dd70cf4b43b846f63c48ee3682/dpdk/build-x86-default/meson-logs/meson-log.txt
ninja -C ./build-x86-default
ninja: Entering directory `./build-x86-default'
ninja: error: loading 'build.ninja': No such file or directory
DESTDIR=/root/UB2004-64_K5.4.0_GCC9.3.0/x86_64-native-linuxapp-gcc/23a183dd70cf4b43b846f63c48ee3682/dpdk/build-x86-default/install ninja -C /root/UB2004-64_K5.4.0_GCC9.3.0/x86_64-native-linuxapp-gcc/23a183dd70cf4b43b846f63c48ee3682/dpdk/build-x86-default install >/dev/null
ninja: error: loading 'build.ninja': No such file or directory
find: ‘/root/UB2004-64_K5.4.0_GCC9.3.0/x86_64-native-linuxapp-gcc/23a183dd70cf4b43b846f63c48ee3682/dpdk/build-x86-default/install’: No such file or directory
dirname: missing operand
Try 'dirname --help' for more information.
DPDK STV team


More information about the test-report mailing list