[dpdk-test-report] |FAILURE| pw(73467) [v3, 3/4] net/qede: add infrastructure for debug data collection

sys_stv at intel.com sys_stv at intel.com
Wed Jul 8 19:10:41 CEST 2020


Test-Label: Intel-compilation
Test-Status: FAILURE
http://dpdk.org/patch/73467

_Compilation issues_

Submitter: Rasesh Mody <rmody at marvell.com>
Date: 2020-07-07 20:18:43
Reply_mail: 20200707201844.16111-4-rmody at marvell.com

DPDK git baseline: Repo:dpdk-next-net-mrvl, CommitID: 7b3f702cc5a95d2c5c4ac36b8cc14127736038e3


Meson build Summary: 8 Builds Done, 2 Successful, 6 Failures, 0 Blocked

Makefile build Summary: 20 Builds Done, 20 Successful, 0 Failures, 0 Blocked

                +==============================================+===========+==========+
                |                   Makefile                   |   Meson   | Document |
+----------------+------+-------+------+------------+-----------+-----------+----------+
| os             | gcc  | clang | icc  | gcc+shared | gcc+debug | gcc/clang | pdf/html |
+----------------+------+-------+------+------------+-----------+-----------+----------+
| CENTOS82-64    | pass | pass  | pass | pass       | pass      | FAIL      |          |
| RHEL82-64      | pass |       |      |            |           |           |          |
| UB1804-64      | pass |       |      |            |           |           |          |
| FC32-64        | pass | pass  |      |            |           | FAIL      |          |
| CENTOS77-64    | pass |       |      |            |           |           |          |
| UB2004-64      | pass | pass  | pass |            |           | FAIL      | pass     |
| WIN10-64       |      |       |      |            |           | pass      |          |
| UB2004-32      | pass |       |      |            |           |           |          |
| UB1804-32      |      |       |      |            |           | FAIL      |          |
| FreeBSD1201-64 | pass | pass  |      | pass       | pass      | FAIL      |          |
| SUSE15-64      | pass | pass  |      |            |           | FAIL      |          |
+----------------+------+-------+------+------------+-----------+-----------+----------+
Test environment and configuration as below:

** Makefile build **


OS: CENTOS82-64
	Kernel Version: 4.18.0-193.el8.x86_64
	CPU info: Intel(R) Xeon(R) Platinum 8280M CPU @ 2.70GHz
	GCC Version: gcc (GCC) 8.3.1 20191121 (Red Hat 8.3.1-5)
	Clang Version: 9.0.1 (Red Hat 9.0.1-2.module_el8.2.0+309+0c7b6b03)
	x86_64-native-linuxapp-gcc
	x86_64-native-linuxapp-clang
	x86_64-native-linuxapp-icc
	x86_64-native-linuxapp-gcc+shared
	x86_64-native-linuxapp-gcc+debug


OS: RHEL82-64
	Kernel Version: 4.18.0-193.el8.x86_64
	CPU info: Intel(R) Xeon(R) Platinum 8280M CPU @ 2.70GHz
	GCC Version: gcc (GCC) 8.3.1 20191121 (Red Hat 8.3.1-5)
	Clang Version: 8.0.1 (Red Hat 8.0.1-1.module_el8.1.0+215+a01033fb)
	x86_64-native-linuxapp-gcc


OS: UB1804-64
	Kernel Version: 4.15.0-29-generic
	CPU info: Intel(R) Xeon(R) Platinum 8180 CPU @ 2.50GHz
	GCC Version: gcc (Ubuntu 7.5.0-3ubuntu1~18.04) 7.5.0
	Clang Version: 6.0.0-1ubuntu2 (tags/RELEASE_600/final)
	x86_64-native-linuxapp-gcc


OS: FC32-64
	Kernel Version: 5.6.0-0.rc7.git0.2.fc32.x86_64
	CPU info: Intel(R) Xeon(R) Platinum 8280M CPU @ 2.70GHz
	GCC Version: gcc (GCC) 10.0.1 20200311 (Red Hat 10.0.1-0.9)
	Clang Version: 10.0.0 (Fedora 10.0.0-0.3.rc4.fc32)
	x86_64-native-linuxapp-gcc
	x86_64-native-linuxapp-clang


OS: CENTOS77-64
	Kernel Version: 3.10.0-1062.9.1.el7.x86_64
	CPU info: Intel(R) Xeon(R) Platinum 8280M CPU @ 2.70GHz
	GCC Version: gcc (GCC) 4.8.5 20150623 (Red Hat 4.8.5-39)
	Clang Version: 3.4.2 (tags/RELEASE_34/dot2-final)
	x86_64-native-linuxapp-gcc


OS: UB2004-64
	Kernel Version: 5.4.0-26-generic
	CPU info: Intel(R) Xeon(R) Platinum 8180 CPU @ 2.50GHz
	GCC Version: gcc (Ubuntu 10-20200416-0ubuntu1) 10.0.1 20200416 (experimental) [master revision 3c3f12e2a76:dcee354ce56:44b326839d864fc10c459916abcc97f35a9ac3de]
	Clang Version: 10.0.0-4ubuntu1
	x86_64-native-linuxapp-clang
	x86_64-native-linuxapp-gcc
	x86_64-native-linuxapp-icc


OS: UB2004-32
	Kernel Version: 5.4.0-26-generic
	CPU info: Intel(R) Xeon(R) Platinum 8180 CPU @ 2.50GHz
	GCC Version: gcc (Ubuntu 9.3.0-10ubuntu2) 9.3.0
	Clang Version: 10.0.0-4ubuntu1
	i686-native-linuxapp-gcc


OS: FreeBSD1201-64
	Kernel Version: 12.1-RELEASE
	CPU info: Intel(R) Xeon(R) CPU E5-2699 v3 @ 2.30GHz (2294.74-MHz K8-class CPU)
	GCC Version: gcc (FreeBSD Ports Collection) 9.2.0
	Clang Version: 8.0.1 (tags/RELEASE_801/final 366581) (based on LLVM 8.0.1)
	x86_64-native-bsdapp-gcc
	x86_64-native-bsdapp-clang
	x86_64-native-bsdapp-gcc+shared
	x86_64-native-bsdapp-gcc+debug


OS: SUSE15-64
	Kernel Version: 4.12.14-lp150.11-default
	CPU info: Intel(R) Xeon(R) CPU E5-2699 v4 @ 2.20GHz
	GCC Version: gcc (SUSE Linux) 7.3.1 20180323 [gcc-7-branch revision 258812]
	Clang Version: 5.0.1 (tags/RELEASE_501/final 312548)
	x86_64-native-linuxapp-clang
	x86_64-native-linuxapp-gcc

** Meson build **


OS: CENTOS82-64
	Kernel Version: 4.18.0-193.el8.x86_64
	CPU info: Intel(R) Xeon(R) CPU E5-2699 v4 @ 2.20GHz
	GCC Version: gcc (GCC) 8.3.1 20191121 (Red Hat 8.3.1-5)
	Clang Version: 9.0.1 (Red Hat 9.0.1-2.module_el8.2.0+309+0c7b6b03)
	./build-gcc-static
	./build-gcc-shared
	./build-clang-static
	./build-clang-shared
	./build-x86-default


OS: UB2004-64
	Kernel Version: 5.4.0-26-generic
	CPU info: Intel(R) Xeon(R) Platinum 8180 CPU @ 2.50GHz
	GCC Version: gcc (Ubuntu 9.3.0-10ubuntu2) 9.3.0
	Clang Version: 10.0.0-4ubuntu1
	x86_64-native-linuxapp-doc
	./build-gcc-static
	./build-gcc-shared
	./build-clang-static
	./build-clang-shared
	./build-x86-default


OS: FC32-64
	Kernel Version: 5.6.0-0.rc7.git0.2.fc32.x86_64
	CPU info: Intel(R) Xeon(R) CPU E5-2699 v4 @ 2.20GHz
	GCC Version: gcc (GCC) 10.0.1 20200311 (Red Hat 10.0.1-0.9)
	Clang Version: 10.0.0 (Fedora 10.0.0-0.3.rc4.fc32)
	./build-gcc-static
	./build-gcc-shared
	./build-clang-static
	./build-clang-shared
	./build-x86-default


OS: WIN10-64
	Kernel Version: N/A
	CPU info: N/A
	GCC Version: N/A
	Clang Version: Clang 8.0.0
	x86_64-windows-clang


OS: UB1804-32
	Kernel Version: 4.15.0-20-generic
	CPU info: Intel(R) Xeon(R) CPU E5-2699 v4 @ 2.20GHz
	GCC Version: gcc (Ubuntu 7.5.0-3ubuntu1~18.04) 7.5.0
	Clang Version: 6.0.0-1ubuntu2 (tags/RELEASE_600/final)
	./build-gcc-static
	./build-gcc-shared
	./build-clang-static
	./build-clang-shared
	./build-x86-default


OS: FreeBSD1201-64
	Kernel Version: 12.1-RELEASE
	CPU info: Intel(R) Xeon(R) CPU E5-2699 v4 @ 2.20GHz (2194.97-MHz K8-class CPU)
	GCC Version: gcc (FreeBSD Ports Collection) 9.2.0
	Clang Version: 8.0.1 (tags/RELEASE_801/final 366581) (based on LLVM 8.0.1)
	./build-gcc-static
	./build-gcc-shared
	./build-clang-static
	./build-clang-shared
	./build-x86-default


OS: SUSE15-64
	Kernel Version: 4.12.14-lp150.12.82-default
	CPU info: Intel(R) Xeon(R) CPU E5-2699 v4 @ 2.20GHz
	GCC Version: gcc (SUSE Linux) 7.4.1 20190905 [gcc-7-branch revision 275407]
	Clang Version: 5.0.1 (tags/RELEASE_501/final 312548)
	./build-gcc-static
	./build-gcc-shared
	./build-clang-static
	./build-clang-shared
	./build-x86-default



*Meson Build Failed #1:
OS: CENTOS82-64
Target:./build-gcc-static
FAILED: drivers/librte_pmd_qede.so.20.0.3 
gcc  -o drivers/librte_pmd_qede.so.20.0.3 'drivers/a715181@@rte_pmd_qede at sha/meson-generated_.._rte_pmd_qede.pmd.c.o' 'drivers/net/qede/base/f6110d5@@qede_base at sta/bcm_osal.c.o' 'drivers/net/qede/base/f6110d5@@qede_base at sta/ecore_cxt.c.o' 'drivers/net/qede/base/f6110d5@@qede_base at sta/ecore_dcbx.c.o' 'drivers/net/qede/base/f6110d5@@qede_base at sta/ecore_dev.c.o' 'drivers/net/qede/base/f6110d5@@qede_base at sta/ecore_hw.c.o' 'drivers/net/qede/base/f6110d5@@qede_base at sta/ecore_init_fw_funcs.c.o' 'drivers/net/qede/base/f6110d5@@qede_base at sta/ecore_init_ops.c.o' 'drivers/net/qede/base/f6110d5@@qede_base at sta/ecore_int.c.o' 'drivers/net/qede/base/f6110d5@@qede_base at sta/ecore_l2.c.o' 'drivers/net/qede/base/f6110d5@@qede_base at sta/ecore_mcp.c.o' 'drivers/net/qede/base/f6110d5@@qede_base at sta/ecore_sp_commands.c.o' 'drivers/net/qede/base/f6110d5@@qede_base at sta/ecore_spq.c.o' 'drivers/net/qede/base/f6110d5@@qede_base at sta/ecore_sriov.c.o' 'drivers/net/qede/base/f6110d5@@qede_base at sta/ecore_vf.c.o' 'drivers/a715181@@tmp_rte_pmd_qede at sta/net_qede_qede_ethdev.c.o' 'drivers/a715181@@tmp_rte_pmd_qede at sta/net_qede_qede_filter.c.o' 'drivers/a715181@@tmp_rte_pmd_qede at sta/net_qede_qede_main.c.o' 'drivers/a715181@@tmp_rte_pmd_qede at sta/net_qede_qede_rxtx.c.o' -Wl,--as-needed -Wl,--no-undefined -shared -fPIC -Wl,--start-group -Wl,-soname,librte_pmd_qede.so.20.0 -Wl,--no-as-needed -pthread -lm -ldl -lnuma lib/librte_ethdev.so.20.0.3 lib/librte_eal.so.20.0.3 lib/librte_kvargs.so.20.0.3 lib/librte_telemetry.so.20.0.3 lib/librte_net.so.20.0.3 lib/librte_mbuf.so.20.0.3 lib/librte_mempool.so.20.0.3 lib/librte_ring.so.20.0.3 lib/librte_meter.so.20.0.3 drivers/librte_bus_pci.so.20.0.3 lib/librte_pci.so.20.0.3 drivers/librte_bus_vdev.so.20.0.3 -Wl,--end-group -Wl,--version-script=/root/CENTOS82-64_K4.18.0_GCC8.3.1/x86_64-native-linuxapp-gcc/572faa18d0104128aa0f7b43283891a0/dpdk/drivers/net/qede/rte_pmd_qede_version.map '-Wl,-rpath,$ORIGIN/../lib:$ORIGIN/' -Wl,-rpath-link,/root/CENTOS82-64_K4.18.0_GCC8.3.1/x86_64-native-linuxapp-gcc/572faa18d0104128aa0f7b43283891a0/dpdk/build-gcc-static/lib -Wl,-rpath-link,/root/CENTOS82-64_K4.18.0_GCC8.3.1/x86_64-native-linuxapp-gcc/572faa18d0104128aa0f7b43283891a0/dpdk/build-gcc-static/drivers
drivers/net/qede/base/f6110d5@@qede_base at sta/bcm_osal.c.o: In function `qede_hw_err_handler':
/root/CENTOS82-64_K4.18.0_GCC8.3.1/x86_64-native-linuxapp-gcc/572faa18d0104128aa0f7b43283891a0/dpdk/build-gcc-static/../drivers/net/qede/base/bcm_osal.c:262: undefined reference to `qede_save_fw_dump'
drivers/net/qede/base/f6110d5@@qede_base at sta/ecore_dev.c.o: In function `ecore_resc_alloc':
/root/CENTOS82-64_K4.18.0_GCC8.3.1/x86_64-native-linuxapp-gcc/572faa18d0104128aa0f7b43283891a0/dpdk/build-gcc-static/../drivers/net/qede/base/ecore_dev.c:2516: undefined reference to `qed_dbg_alloc_user_data'
/root/CENTOS82-64_K4.18.0_GCC8.3.1/x86_64-native-linuxapp-gcc/572faa18d0104128aa0f7b43283891a0/dpdk/build-gcc-static/../drivers/net/qede/base/ecore_dev.c:2525: undefined reference to `qed_dbg_alloc_user_data'
drivers/a715181@@tmp_rte_pmd_qede at sta/net_qede_qede_ethdev.c.o:(.data.rel.ro+0x530): undefined reference to `qede_get_regs'
drivers/a715181@@tmp_rte_pmd_qede at sta/net_qede_qede_main.c.o: In function `qed_slowpath_start':
/root/CENTOS82-64_K4.18.0_GCC8.3.1/x86_64-native-linuxapp-gcc/572faa18d0104128aa0f7b43283891a0/dpdk/build-gcc-static/../drivers/net/qede/qede_main.c:285: undefined reference to `qed_dbg_pf_init'
drivers/a715181@@tmp_rte_pmd_qede at sta/net_qede_qede_main.c.o:(.data.rel.ro+0xa8): undefined reference to `qed_dbg_grc'
drivers/a715181@@tmp_rte_pmd_qede at sta/net_qede_qede_main.c.o:(.data.rel.ro+0xb0): undefined reference to `qed_dbg_grc_size'
drivers/a715181@@tmp_rte_pmd_qede at sta/net_qede_qede_main.c.o:(.data.rel.ro+0xb8): undefined reference to `qed_dbg_idle_chk'
drivers/a715181@@tmp_rte_pmd_qede at sta/net_qede_qede_main.c.o:(.data.rel.ro+0xc0): undefined reference to `qed_dbg_idle_chk_size'
drivers/a715181@@tmp_rte_pmd_qede at sta/net_qede_qede_main.c.o:(.data.rel.ro+0xc8): undefined reference to `qed_dbg_reg_fifo'
drivers/a715181@@tmp_rte_pmd_qede at sta/net_qede_qede_main.c.o:(.data.rel.ro+0xd0): undefined reference to `qed_dbg_reg_fifo_size'
drivers/a715181@@tmp_rte_pmd_qede at sta/net_qede_qede_main.c.o:(.data.rel.ro+0xd8): undefined reference to `qed_dbg_mcp_trace'
drivers/a715181@@tmp_rte_pmd_qede at sta/net_qede_qede_main.c.o:(.data.rel.ro+0xe0): undefined reference to `qed_dbg_mcp_trace_size'
drivers/a715181@@tmp_rte_pmd_qede at sta/net_qede_qede_main.c.o:(.data.rel.ro+0xe8): undefined reference to `qed_dbg_protection_override'
drivers/a715181@@tmp_rte_pmd_qede at sta/net_qede_qede_main.c.o:(.data.rel.ro+0xf0): undefined reference to `qed_dbg_protection_override_size'
drivers/a715181@@tmp_rte_pmd_qede at sta/net_qede_qede_main.c.o:(.data.rel.ro+0xf8): undefined reference to `qed_dbg_igu_fifo_size'
drivers/a715181@@tmp_rte_pmd_qede at sta/net_qede_qede_main.c.o:(.data.rel.ro+0x100): undefined reference to `qed_dbg_igu_fifo'
drivers/a715181@@tmp_rte_pmd_qede at sta/net_qede_qede_main.c.o:(.data.rel.ro+0x108): undefined reference to `qed_dbg_fw_asserts'
drivers/a715181@@tmp_rte_pmd_qede at sta/net_qede_qede_main.c.o:(.data.rel.ro+0x110): undefined reference to `qed_dbg_fw_asserts_size'
drivers/a715181@@tmp_rte_pmd_qede at sta/net_qede_qede_main.c.o:(.data.rel.ro+0x118): undefined reference to `qed_dbg_ilt'
drivers/a715181@@tmp_rte_pmd_qede at sta/net_qede_qede_main.c.o:(.data.rel.ro+0x120): undefined reference to `qed_dbg_ilt_size'
drivers/a715181@@tmp_rte_pmd_qede at sta/net_qede_qede_main.c.o:(.data.rel.ro+0x128): undefined reference to `qed_get_debug_engine'
drivers/a715181@@tmp_rte_pmd_qede at sta/net_qede_qede_main.c.o:(.data.rel.ro+0x130): undefined reference to `qed_set_debug_engine'
collect2: error: ld returned 1 exit status
[1540/2384] Compiling C object 'drivers/a715181@@tmp_rte_pmd_sfc at sta/net_sfc_sfc_ethdev.c.o'.
[1541/2384] Compiling C object 'drivers/a715181@@tmp_rte_pmd_sfc at sta/net_sfc_sfc_filter.c.o'.
[1542/2384] Compiling C object 'drivers/a715181@@tmp_rte_pmd_sfc at sta/net_sfc_sfc_tso.c.o'.
[1543/2384] Compiling C object 'drivers/a715181@@tmp_rte_pmd_sfc at sta/net_sfc_sfc_rx.c.o'.
[1544/2384] Compiling C object 'drivers/a715181@@tmp_rte_pmd_sfc at sta/net_sfc_sfc_tx.c.o'.
[1545/2384] Compiling C object 'drivers/a715181@@tmp_rte_pmd_sfc at sta/net_sfc_sfc_ef10_essb_rx.c.o'.
[1546/2384] Compiling C object 'drivers/a715181@@tmp_rte_pmd_sfc at sta/net_sfc_sfc_ef10_rx.c.o'.
[1547/2384] Compiling C object 'drivers/a715181@@tmp_rte_pmd_sfc at sta/net_sfc_sfc_flow.c.o'.
[1548/2384] Compiling C object 'drivers/a715181@@tmp_rte_pmd_octeontx2 at sta/net_octeontx2_otx2_rx.c.o'.
[1549/2384] Compiling C object 'drivers/a715181@@tmp_rte_pmd_sfc at sta/net_sfc_sfc_ef10_tx.c.o'.
[1550/2384] Compiling C object 'drivers/a715181@@tmp_rte_pmd_octeontx2 at sta/net_octeontx2_otx2_tx.c.o'.
ninja: build stopped: subcommand failed




*Meson Build Failed #2:
OS: FC32-64
Target:./build-gcc-static
FAILED: drivers/librte_pmd_qede.so.20.0.3 
gcc  -o drivers/librte_pmd_qede.so.20.0.3 'drivers/a715181@@rte_pmd_qede at sha/meson-generated_.._rte_pmd_qede.pmd.c.o' 'drivers/net/qede/base/f6110d5@@qede_base at sta/bcm_osal.c.o' 'drivers/net/qede/base/f6110d5@@qede_base at sta/ecore_cxt.c.o' 'drivers/net/qede/base/f6110d5@@qede_base at sta/ecore_dcbx.c.o' 'drivers/net/qede/base/f6110d5@@qede_base at sta/ecore_dev.c.o' 'drivers/net/qede/base/f6110d5@@qede_base at sta/ecore_hw.c.o' 'drivers/net/qede/base/f6110d5@@qede_base at sta/ecore_init_fw_funcs.c.o' 'drivers/net/qede/base/f6110d5@@qede_base at sta/ecore_init_ops.c.o' 'drivers/net/qede/base/f6110d5@@qede_base at sta/ecore_int.c.o' 'drivers/net/qede/base/f6110d5@@qede_base at sta/ecore_l2.c.o' 'drivers/net/qede/base/f6110d5@@qede_base at sta/ecore_mcp.c.o' 'drivers/net/qede/base/f6110d5@@qede_base at sta/ecore_sp_commands.c.o' 'drivers/net/qede/base/f6110d5@@qede_base at sta/ecore_spq.c.o' 'drivers/net/qede/base/f6110d5@@qede_base at sta/ecore_sriov.c.o' 'drivers/net/qede/base/f6110d5@@qede_base at sta/ecore_vf.c.o' 'drivers/a715181@@tmp_rte_pmd_qede at sta/net_qede_qede_ethdev.c.o' 'drivers/a715181@@tmp_rte_pmd_qede at sta/net_qede_qede_filter.c.o' 'drivers/a715181@@tmp_rte_pmd_qede at sta/net_qede_qede_main.c.o' 'drivers/a715181@@tmp_rte_pmd_qede at sta/net_qede_qede_rxtx.c.o' -Wl,--as-needed -Wl,--no-undefined -shared -fPIC -Wl,--start-group -Wl,-soname,librte_pmd_qede.so.20.0 -Wl,--no-as-needed -pthread -lm -ldl -lnuma lib/librte_ethdev.so.20.0.3 lib/librte_eal.so.20.0.3 lib/librte_kvargs.so.20.0.3 lib/librte_telemetry.so.20.0.3 lib/librte_net.so.20.0.3 lib/librte_mbuf.so.20.0.3 lib/librte_mempool.so.20.0.3 lib/librte_ring.so.20.0.3 lib/librte_meter.so.20.0.3 drivers/librte_bus_pci.so.20.0.3 lib/librte_pci.so.20.0.3 drivers/librte_bus_vdev.so.20.0.3 -Wl,--end-group -Wl,--version-script=/root/FC32-64_K5.6.0_GCC10.0.1/x86_64-native-linuxapp-gcc/572faa18d0104128aa0f7b43283891a0/dpdk/drivers/net/qede/rte_pmd_qede_version.map '-Wl,-rpath,$ORIGIN/../lib:$ORIGIN/' -Wl,-rpath-link,/root/FC32-64_K5.6.0_GCC10.0.1/x86_64-native-linuxapp-gcc/572faa18d0104128aa0f7b43283891a0/dpdk/build-gcc-static/lib -Wl,-rpath-link,/root/FC32-64_K5.6.0_GCC10.0.1/x86_64-native-linuxapp-gcc/572faa18d0104128aa0f7b43283891a0/dpdk/build-gcc-static/drivers
/usr/bin/ld: drivers/net/qede/base/f6110d5@@qede_base at sta/bcm_osal.c.o: in function `qede_hw_err_handler':
/root/FC32-64_K5.6.0_GCC10.0.1/x86_64-native-linuxapp-gcc/572faa18d0104128aa0f7b43283891a0/dpdk/build-gcc-static/../drivers/net/qede/base/bcm_osal.c:262: undefined reference to `qede_save_fw_dump'
/usr/bin/ld: drivers/net/qede/base/f6110d5@@qede_base at sta/ecore_dev.c.o: in function `ecore_resc_alloc':
/root/FC32-64_K5.6.0_GCC10.0.1/x86_64-native-linuxapp-gcc/572faa18d0104128aa0f7b43283891a0/dpdk/build-gcc-static/../drivers/net/qede/base/ecore_dev.c:2516: undefined reference to `qed_dbg_alloc_user_data'
/usr/bin/ld: /root/FC32-64_K5.6.0_GCC10.0.1/x86_64-native-linuxapp-gcc/572faa18d0104128aa0f7b43283891a0/dpdk/build-gcc-static/../drivers/net/qede/base/ecore_dev.c:2525: undefined reference to `qed_dbg_alloc_user_data'
/usr/bin/ld: drivers/a715181@@tmp_rte_pmd_qede at sta/net_qede_qede_ethdev.c.o:(.data.rel.ro+0x530): undefined reference to `qede_get_regs'
/usr/bin/ld: drivers/a715181@@tmp_rte_pmd_qede at sta/net_qede_qede_main.c.o: in function `qed_slowpath_start':
/root/FC32-64_K5.6.0_GCC10.0.1/x86_64-native-linuxapp-gcc/572faa18d0104128aa0f7b43283891a0/dpdk/build-gcc-static/../drivers/net/qede/qede_main.c:285: undefined reference to `qed_dbg_pf_init'
/usr/bin/ld: drivers/a715181@@tmp_rte_pmd_qede at sta/net_qede_qede_main.c.o:(.data.rel.ro+0xa8): undefined reference to `qed_dbg_grc'
/usr/bin/ld: drivers/a715181@@tmp_rte_pmd_qede at sta/net_qede_qede_main.c.o:(.data.rel.ro+0xb0): undefined reference to `qed_dbg_grc_size'
/usr/bin/ld: drivers/a715181@@tmp_rte_pmd_qede at sta/net_qede_qede_main.c.o:(.data.rel.ro+0xb8): undefined reference to `qed_dbg_idle_chk'
/usr/bin/ld: drivers/a715181@@tmp_rte_pmd_qede at sta/net_qede_qede_main.c.o:(.data.rel.ro+0xc0): undefined reference to `qed_dbg_idle_chk_size'
/usr/bin/ld: drivers/a715181@@tmp_rte_pmd_qede at sta/net_qede_qede_main.c.o:(.data.rel.ro+0xc8): undefined reference to `qed_dbg_reg_fifo'
/usr/bin/ld: drivers/a715181@@tmp_rte_pmd_qede at sta/net_qede_qede_main.c.o:(.data.rel.ro+0xd0): undefined reference to `qed_dbg_reg_fifo_size'
/usr/bin/ld: drivers/a715181@@tmp_rte_pmd_qede at sta/net_qede_qede_main.c.o:(.data.rel.ro+0xd8): undefined reference to `qed_dbg_mcp_trace'
/usr/bin/ld: drivers/a715181@@tmp_rte_pmd_qede at sta/net_qede_qede_main.c.o:(.data.rel.ro+0xe0): undefined reference to `qed_dbg_mcp_trace_size'
/usr/bin/ld: drivers/a715181@@tmp_rte_pmd_qede at sta/net_qede_qede_main.c.o:(.data.rel.ro+0xe8): undefined reference to `qed_dbg_protection_override'
/usr/bin/ld: drivers/a715181@@tmp_rte_pmd_qede at sta/net_qede_qede_main.c.o:(.data.rel.ro+0xf0): undefined reference to `qed_dbg_protection_override_size'
/usr/bin/ld: drivers/a715181@@tmp_rte_pmd_qede at sta/net_qede_qede_main.c.o:(.data.rel.ro+0xf8): undefined reference to `qed_dbg_igu_fifo_size'
/usr/bin/ld: drivers/a715181@@tmp_rte_pmd_qede at sta/net_qede_qede_main.c.o:(.data.rel.ro+0x100): undefined reference to `qed_dbg_igu_fifo'
/usr/bin/ld: drivers/a715181@@tmp_rte_pmd_qede at sta/net_qede_qede_main.c.o:(.data.rel.ro+0x108): undefined reference to `qed_dbg_fw_asserts'
/usr/bin/ld: drivers/a715181@@tmp_rte_pmd_qede at sta/net_qede_qede_main.c.o:(.data.rel.ro+0x110): undefined reference to `qed_dbg_fw_asserts_size'
/usr/bin/ld: drivers/a715181@@tmp_rte_pmd_qede at sta/net_qede_qede_main.c.o:(.data.rel.ro+0x118): undefined reference to `qed_dbg_ilt'
/usr/bin/ld: drivers/a715181@@tmp_rte_pmd_qede at sta/net_qede_qede_main.c.o:(.data.rel.ro+0x120): undefined reference to `qed_dbg_ilt_size'
/usr/bin/ld: drivers/a715181@@tmp_rte_pmd_qede at sta/net_qede_qede_main.c.o:(.data.rel.ro+0x128): undefined reference to `qed_get_debug_engine'
/usr/bin/ld: drivers/a715181@@tmp_rte_pmd_qede at sta/net_qede_qede_main.c.o:(.data.rel.ro+0x130): undefined reference to `qed_set_debug_engine'
collect2: error: ld returned 1 exit status
[1510/2385] Compiling C object 'drivers/net/sfc/base/59ea503@@sfc_base at sta/siena_phy.c.o'.
[1511/2385] Compiling C object 'drivers/net/sfc/base/59ea503@@sfc_base at sta/siena_sram.c.o'.
[1512/2385] Compiling C object 'drivers/net/sfc/base/59ea503@@sfc_base at sta/siena_vpd.c.o'.
[1513/2385] Compiling C object 'drivers/net/sfc/base/59ea503@@sfc_base at sta/siena_nvram.c.o'.
[1514/2385] Compiling C object 'drivers/net/sfc/base/59ea503@@sfc_base at sta/ef10_image.c.o'.
[1515/2385] Compiling C object 'drivers/net/sfc/base/59ea503@@sfc_base at sta/ef10_evb.c.o'.
[1516/2385] Compiling C object 'drivers/net/sfc/base/59ea503@@sfc_base at sta/ef10_intr.c.o'.
[1517/2385] Compiling C object 'drivers/net/sfc/base/59ea503@@sfc_base at sta/ef10_ev.c.o'.
[1518/2385] Compiling C object 'drivers/net/sfc/base/59ea503@@sfc_base at sta/ef10_filter.c.o'.
[1519/2385] Compiling C object 'drivers/a715181@@tmp_rte_pmd_octeontx2 at sta/net_octeontx2_otx2_rx.c.o'.
[1520/2385] Compiling C object 'drivers/a715181@@tmp_rte_pmd_octeontx2 at sta/net_octeontx2_otx2_tx.c.o'.
ninja: build stopped: subcommand failed




*Meson Build Failed #3:
OS: FreeBSD1201-64
Target:./build-gcc-static
FAILED: drivers/librte_pmd_qede.so.20.0.3 
gcc  -o drivers/librte_pmd_qede.so.20.0.3 'drivers/a715181@@rte_pmd_qede at sha/meson-generated_.._rte_pmd_qede.pmd.c.o' 'drivers/net/qede/base/f6110d5@@qede_base at sta/bcm_osal.c.o' 'drivers/net/qede/base/f6110d5@@qede_base at sta/ecore_cxt.c.o' 'drivers/net/qede/base/f6110d5@@qede_base at sta/ecore_dcbx.c.o' 'drivers/net/qede/base/f6110d5@@qede_base at sta/ecore_dev.c.o' 'drivers/net/qede/base/f6110d5@@qede_base at sta/ecore_hw.c.o' 'drivers/net/qede/base/f6110d5@@qede_base at sta/ecore_init_fw_funcs.c.o' 'drivers/net/qede/base/f6110d5@@qede_base at sta/ecore_init_ops.c.o' 'drivers/net/qede/base/f6110d5@@qede_base at sta/ecore_int.c.o' 'drivers/net/qede/base/f6110d5@@qede_base at sta/ecore_l2.c.o' 'drivers/net/qede/base/f6110d5@@qede_base at sta/ecore_mcp.c.o' 'drivers/net/qede/base/f6110d5@@qede_base at sta/ecore_sp_commands.c.o' 'drivers/net/qede/base/f6110d5@@qede_base at sta/ecore_spq.c.o' 'drivers/net/qede/base/f6110d5@@qede_base at sta/ecore_sriov.c.o' 'drivers/net/qede/base/f6110d5@@qede_base at sta/ecore_vf.c.o' 'drivers/a715181@@tmp_rte_pmd_qede at sta/net_qede_qede_ethdev.c.o' 'drivers/a715181@@tmp_rte_pmd_qede at sta/net_qede_qede_filter.c.o' 'drivers/a715181@@tmp_rte_pmd_qede at sta/net_qede_qede_main.c.o' 'drivers/a715181@@tmp_rte_pmd_qede at sta/net_qede_qede_rxtx.c.o' -Wl,--as-needed -Wl,--no-undefined -shared -fPIC -Wl,--start-group -Wl,-soname,librte_pmd_qede.so.20.0 -Wl,--no-as-needed -pthread -lm -lexecinfo lib/librte_ethdev.so.20.0.3 lib/librte_eal.so.20.0.3 lib/librte_kvargs.so.20.0.3 lib/librte_telemetry.so.20.0.3 lib/librte_net.so.20.0.3 lib/librte_mbuf.so.20.0.3 lib/librte_mempool.so.20.0.3 lib/librte_ring.so.20.0.3 lib/librte_meter.so.20.0.3 drivers/librte_bus_pci.so.20.0.3 lib/librte_pci.so.20.0.3 drivers/librte_bus_vdev.so.20.0.3 -Wl,--end-group -Wl,--version-script=/root/FreeBSD1201-64_K12.1_GCC9.2.0/x86_64-native-bsdapp-gcc/572faa18d0104128aa0f7b43283891a0/dpdk/drivers/net/qede/rte_pmd_qede_version.map '-Wl,-rpath,$ORIGIN/../lib:$ORIGIN/' -Wl,-rpath-link,/root/FreeBSD1201-64_K12.1_GCC9.2.0/x86_64-native-bsdapp-gcc/572faa18d0104128aa0f7b43283891a0/dpdk/build-gcc-static/lib -Wl,-rpath-link,/root/FreeBSD1201-64_K12.1_GCC9.2.0/x86_64-native-bsdapp-gcc/572faa18d0104128aa0f7b43283891a0/dpdk/build-gcc-static/drivers
/usr/local/bin/ld: drivers/net/qede/base/f6110d5@@qede_base at sta/bcm_osal.c.o: in function `qede_hw_err_handler':
/root/FreeBSD1201-64_K12.1_GCC9.2.0/x86_64-native-bsdapp-gcc/572faa18d0104128aa0f7b43283891a0/dpdk/build-gcc-static/../drivers/net/qede/base/bcm_osal.c:262: undefined reference to `qede_save_fw_dump'
/usr/local/bin/ld: drivers/net/qede/base/f6110d5@@qede_base at sta/ecore_dev.c.o: in function `ecore_resc_alloc':
/root/FreeBSD1201-64_K12.1_GCC9.2.0/x86_64-native-bsdapp-gcc/572faa18d0104128aa0f7b43283891a0/dpdk/build-gcc-static/../drivers/net/qede/base/ecore_dev.c:2516: undefined reference to `qed_dbg_alloc_user_data'
/usr/local/bin/ld: /root/FreeBSD1201-64_K12.1_GCC9.2.0/x86_64-native-bsdapp-gcc/572faa18d0104128aa0f7b43283891a0/dpdk/build-gcc-static/../drivers/net/qede/base/ecore_dev.c:2525: undefined reference to `qed_dbg_alloc_user_data'
/usr/local/bin/ld: drivers/a715181@@tmp_rte_pmd_qede at sta/net_qede_qede_ethdev.c.o:(.data.rel.ro+0x530): undefined reference to `qede_get_regs'
/usr/local/bin/ld: drivers/a715181@@tmp_rte_pmd_qede at sta/net_qede_qede_main.c.o: in function `qed_slowpath_start':
/root/FreeBSD1201-64_K12.1_GCC9.2.0/x86_64-native-bsdapp-gcc/572faa18d0104128aa0f7b43283891a0/dpdk/build-gcc-static/../drivers/net/qede/qede_main.c:285: undefined reference to `qed_dbg_pf_init'
/usr/local/bin/ld: drivers/a715181@@tmp_rte_pmd_qede at sta/net_qede_qede_main.c.o:(.data.rel.ro+0xa8): undefined reference to `qed_dbg_grc'
/usr/local/bin/ld: drivers/a715181@@tmp_rte_pmd_qede at sta/net_qede_qede_main.c.o:(.data.rel.ro+0xb0): undefined reference to `qed_dbg_grc_size'
/usr/local/bin/ld: drivers/a715181@@tmp_rte_pmd_qede at sta/net_qede_qede_main.c.o:(.data.rel.ro+0xb8): undefined reference to `qed_dbg_idle_chk'
/usr/local/bin/ld: drivers/a715181@@tmp_rte_pmd_qede at sta/net_qede_qede_main.c.o:(.data.rel.ro+0xc0): undefined reference to `qed_dbg_idle_chk_size'
/usr/local/bin/ld: drivers/a715181@@tmp_rte_pmd_qede at sta/net_qede_qede_main.c.o:(.data.rel.ro+0xc8): undefined reference to `qed_dbg_reg_fifo'
/usr/local/bin/ld: drivers/a715181@@tmp_rte_pmd_qede at sta/net_qede_qede_main.c.o:(.data.rel.ro+0xd0): undefined reference to `qed_dbg_reg_fifo_size'
/usr/local/bin/ld: drivers/a715181@@tmp_rte_pmd_qede at sta/net_qede_qede_main.c.o:(.data.rel.ro+0xd8): undefined reference to `qed_dbg_mcp_trace'
/usr/local/bin/ld: drivers/a715181@@tmp_rte_pmd_qede at sta/net_qede_qede_main.c.o:(.data.rel.ro+0xe0): undefined reference to `qed_dbg_mcp_trace_size'
/usr/local/bin/ld: drivers/a715181@@tmp_rte_pmd_qede at sta/net_qede_qede_main.c.o:(.data.rel.ro+0xe8): undefined reference to `qed_dbg_protection_override'
/usr/local/bin/ld: drivers/a715181@@tmp_rte_pmd_qede at sta/net_qede_qede_main.c.o:(.data.rel.ro+0xf0): undefined reference to `qed_dbg_protection_override_size'
/usr/local/bin/ld: drivers/a715181@@tmp_rte_pmd_qede at sta/net_qede_qede_main.c.o:(.data.rel.ro+0xf8): undefined reference to `qed_dbg_igu_fifo_size'
/usr/local/bin/ld: drivers/a715181@@tmp_rte_pmd_qede at sta/net_qede_qede_main.c.o:(.data.rel.ro+0x100): undefined reference to `qed_dbg_igu_fifo'
/usr/local/bin/ld: drivers/a715181@@tmp_rte_pmd_qede at sta/net_qede_qede_main.c.o:(.data.rel.ro+0x108): undefined reference to `qed_dbg_fw_asserts'
/usr/local/bin/ld: drivers/a715181@@tmp_rte_pmd_qede at sta/net_qede_qede_main.c.o:(.data.rel.ro+0x110): undefined reference to `qed_dbg_fw_asserts_size'
/usr/local/bin/ld: drivers/a715181@@tmp_rte_pmd_qede at sta/net_qede_qede_main.c.o:(.data.rel.ro+0x118): undefined reference to `qed_dbg_ilt'
/usr/local/bin/ld: drivers/a715181@@tmp_rte_pmd_qede at sta/net_qede_qede_main.c.o:(.data.rel.ro+0x120): undefined reference to `qed_dbg_ilt_size'
/usr/local/bin/ld: drivers/a715181@@tmp_rte_pmd_qede at sta/net_qede_qede_main.c.o:(.data.rel.ro+0x128): undefined reference to `qed_get_debug_engine'
/usr/local/bin/ld: drivers/a715181@@tmp_rte_pmd_qede at sta/net_qede_qede_main.c.o:(.data.rel.ro+0x130): undefined reference to `qed_set_debug_engine'
collect2: error: ld returned 1 exit status
[1192/1771] Compiling C object 'drivers/net/sfc/base/59ea503@@sfc_base at sta/ef10_proxy.c.o'
[1193/1771] Compiling C object 'drivers/net/sfc/base/59ea503@@sfc_base at sta/ef10_nic.c.o'
[1194/1771] Compiling C object 'drivers/net/sfc/base/59ea503@@sfc_base at sta/hunt_nic.c.o'
[1195/1771] Compiling C object 'drivers/net/sfc/base/59ea503@@sfc_base at sta/ef10_rx.c.o'
[1196/1771] Compiling C object 'drivers/net/sfc/base/59ea503@@sfc_base at sta/ef10_vpd.c.o'
[1197/1771] Compiling C object 'drivers/net/sfc/base/59ea503@@sfc_base at sta/medford_nic.c.o'
[1198/1771] Compiling C object 'drivers/net/sfc/base/59ea503@@sfc_base at sta/ef10_tx.c.o'
[1199/1771] Compiling C object 'drivers/a715181@@tmp_rte_pmd_octeontx2 at sta/net_octeontx2_otx2_rx.c.o'
[1200/1771] Compiling C object 'drivers/a715181@@tmp_rte_pmd_octeontx2 at sta/net_octeontx2_otx2_tx.c.o'
ninja: build stopped: subcommand failed




*Meson Build Failed #4:
OS: SUSE15-64
Target:./build-gcc-static
FAILED: drivers/librte_pmd_qede.so.20.0.3 
gcc  -o drivers/librte_pmd_qede.so.20.0.3 'drivers/a715181@@rte_pmd_qede at sha/meson-generated_.._rte_pmd_qede.pmd.c.o' 'drivers/net/qede/base/f6110d5@@qede_base at sta/bcm_osal.c.o' 'drivers/net/qede/base/f6110d5@@qede_base at sta/ecore_cxt.c.o' 'drivers/net/qede/base/f6110d5@@qede_base at sta/ecore_dcbx.c.o' 'drivers/net/qede/base/f6110d5@@qede_base at sta/ecore_dev.c.o' 'drivers/net/qede/base/f6110d5@@qede_base at sta/ecore_hw.c.o' 'drivers/net/qede/base/f6110d5@@qede_base at sta/ecore_init_fw_funcs.c.o' 'drivers/net/qede/base/f6110d5@@qede_base at sta/ecore_init_ops.c.o' 'drivers/net/qede/base/f6110d5@@qede_base at sta/ecore_int.c.o' 'drivers/net/qede/base/f6110d5@@qede_base at sta/ecore_l2.c.o' 'drivers/net/qede/base/f6110d5@@qede_base at sta/ecore_mcp.c.o' 'drivers/net/qede/base/f6110d5@@qede_base at sta/ecore_sp_commands.c.o' 'drivers/net/qede/base/f6110d5@@qede_base at sta/ecore_spq.c.o' 'drivers/net/qede/base/f6110d5@@qede_base at sta/ecore_sriov.c.o' 'drivers/net/qede/base/f6110d5@@qede_base at sta/ecore_vf.c.o' 'drivers/a715181@@tmp_rte_pmd_qede at sta/net_qede_qede_ethdev.c.o' 'drivers/a715181@@tmp_rte_pmd_qede at sta/net_qede_qede_filter.c.o' 'drivers/a715181@@tmp_rte_pmd_qede at sta/net_qede_qede_main.c.o' 'drivers/a715181@@tmp_rte_pmd_qede at sta/net_qede_qede_rxtx.c.o' -Wl,--no-undefined -Wl,--as-needed -shared -fPIC -Wl,--start-group -Wl,-soname,librte_pmd_qede.so.20.0 -Wl,--no-as-needed -pthread -lm -ldl -lnuma lib/librte_ethdev.so.20.0.3 lib/librte_eal.so.20.0.3 lib/librte_kvargs.so.20.0.3 lib/librte_telemetry.so.20.0.3 lib/librte_net.so.20.0.3 lib/librte_mbuf.so.20.0.3 lib/librte_mempool.so.20.0.3 lib/librte_ring.so.20.0.3 lib/librte_meter.so.20.0.3 drivers/librte_bus_pci.so.20.0.3 lib/librte_pci.so.20.0.3 drivers/librte_bus_vdev.so.20.0.3 -Wl,--end-group -Wl,--version-script=/root/SUSE15-64_K4.12.14_GCC7.3.1/x86_64-native-linuxapp-gcc/572faa18d0104128aa0f7b43283891a0/dpdk/drivers/net/qede/rte_pmd_qede_version.map '-Wl,-rpath,$ORIGIN/../lib:$ORIGIN/' -Wl,-rpath-link,/root/SUSE15-64_K4.12.14_GCC7.3.1/x86_64-native-linuxapp-gcc/572faa18d0104128aa0f7b43283891a0/dpdk/build-gcc-static/lib:/root/SUSE15-64_K4.12.14_GCC7.3.1/x86_64-native-linuxapp-gcc/572faa18d0104128aa0f7b43283891a0/dpdk/build-gcc-static/drivers 
/usr/lib64/gcc/x86_64-suse-linux/7/../../../../x86_64-suse-linux/bin/ld: drivers/net/qede/base/f6110d5@@qede_base at sta/ecore_dev.c.o: in function `ecore_resc_alloc':
/root/SUSE15-64_K4.12.14_GCC7.3.1/x86_64-native-linuxapp-gcc/572faa18d0104128aa0f7b43283891a0/dpdk/build-gcc-static/../drivers/net/qede/base/ecore_dev.c:2516: undefined reference to `qed_dbg_alloc_user_data'
/usr/lib64/gcc/x86_64-suse-linux/7/../../../../x86_64-suse-linux/bin/ld: /root/SUSE15-64_K4.12.14_GCC7.3.1/x86_64-native-linuxapp-gcc/572faa18d0104128aa0f7b43283891a0/dpdk/build-gcc-static/../drivers/net/qede/base/ecore_dev.c:2525: undefined reference to `qed_dbg_alloc_user_data'
/usr/lib64/gcc/x86_64-suse-linux/7/../../../../x86_64-suse-linux/bin/ld: drivers/a715181@@tmp_rte_pmd_qede at sta/net_qede_qede_ethdev.c.o:(.data.rel.ro+0x530): undefined reference to `qede_get_regs'
/usr/lib64/gcc/x86_64-suse-linux/7/../../../../x86_64-suse-linux/bin/ld: drivers/net/qede/base/f6110d5@@qede_base at sta/bcm_osal.c.o: in function `qede_hw_err_handler':
/root/SUSE15-64_K4.12.14_GCC7.3.1/x86_64-native-linuxapp-gcc/572faa18d0104128aa0f7b43283891a0/dpdk/build-gcc-static/../drivers/net/qede/base/bcm_osal.c:262: undefined reference to `qede_save_fw_dump'
/usr/lib64/gcc/x86_64-suse-linux/7/../../../../x86_64-suse-linux/bin/ld: drivers/a715181@@tmp_rte_pmd_qede at sta/net_qede_qede_main.c.o: in function `qed_slowpath_start':
/root/SUSE15-64_K4.12.14_GCC7.3.1/x86_64-native-linuxapp-gcc/572faa18d0104128aa0f7b43283891a0/dpdk/build-gcc-static/../drivers/net/qede/qede_main.c:285: undefined reference to `qed_dbg_pf_init'
/usr/lib64/gcc/x86_64-suse-linux/7/../../../../x86_64-suse-linux/bin/ld: drivers/a715181@@tmp_rte_pmd_qede at sta/net_qede_qede_main.c.o:(.data.rel.ro+0xa8): undefined reference to `qed_dbg_grc'
/usr/lib64/gcc/x86_64-suse-linux/7/../../../../x86_64-suse-linux/bin/ld: drivers/a715181@@tmp_rte_pmd_qede at sta/net_qede_qede_main.c.o:(.data.rel.ro+0xb0): undefined reference to `qed_dbg_grc_size'
/usr/lib64/gcc/x86_64-suse-linux/7/../../../../x86_64-suse-linux/bin/ld: drivers/a715181@@tmp_rte_pmd_qede at sta/net_qede_qede_main.c.o:(.data.rel.ro+0xb8): undefined reference to `qed_dbg_idle_chk'
/usr/lib64/gcc/x86_64-suse-linux/7/../../../../x86_64-suse-linux/bin/ld: drivers/a715181@@tmp_rte_pmd_qede at sta/net_qede_qede_main.c.o:(.data.rel.ro+0xc0): undefined reference to `qed_dbg_idle_chk_size'
/usr/lib64/gcc/x86_64-suse-linux/7/../../../../x86_64-suse-linux/bin/ld: drivers/a715181@@tmp_rte_pmd_qede at sta/net_qede_qede_main.c.o:(.data.rel.ro+0xc8): undefined reference to `qed_dbg_reg_fifo'
/usr/lib64/gcc/x86_64-suse-linux/7/../../../../x86_64-suse-linux/bin/ld: drivers/a715181@@tmp_rte_pmd_qede at sta/net_qede_qede_main.c.o:(.data.rel.ro+0xd0): undefined reference to `qed_dbg_reg_fifo_size'
/usr/lib64/gcc/x86_64-suse-linux/7/../../../../x86_64-suse-linux/bin/ld: drivers/a715181@@tmp_rte_pmd_qede at sta/net_qede_qede_main.c.o:(.data.rel.ro+0xd8): undefined reference to `qed_dbg_mcp_trace'
/usr/lib64/gcc/x86_64-suse-linux/7/../../../../x86_64-suse-linux/bin/ld: drivers/a715181@@tmp_rte_pmd_qede at sta/net_qede_qede_main.c.o:(.data.rel.ro+0xe0): undefined reference to `qed_dbg_mcp_trace_size'
/usr/lib64/gcc/x86_64-suse-linux/7/../../../../x86_64-suse-linux/bin/ld: drivers/a715181@@tmp_rte_pmd_qede at sta/net_qede_qede_main.c.o:(.data.rel.ro+0xe8): undefined reference to `qed_dbg_protection_override'
/usr/lib64/gcc/x86_64-suse-linux/7/../../../../x86_64-suse-linux/bin/ld: drivers/a715181@@tmp_rte_pmd_qede at sta/net_qede_qede_main.c.o:(.data.rel.ro+0xf0): undefined reference to `qed_dbg_protection_override_size'
/usr/lib64/gcc/x86_64-suse-linux/7/../../../../x86_64-suse-linux/bin/ld: drivers/a715181@@tmp_rte_pmd_qede at sta/net_qede_qede_main.c.o:(.data.rel.ro+0xf8): undefined reference to `qed_dbg_igu_fifo_size'
/usr/lib64/gcc/x86_64-suse-linux/7/../../../../x86_64-suse-linux/bin/ld: drivers/a715181@@tmp_rte_pmd_qede at sta/net_qede_qede_main.c.o:(.data.rel.ro+0x100): undefined reference to `qed_dbg_igu_fifo'
/usr/lib64/gcc/x86_64-suse-linux/7/../../../../x86_64-suse-linux/bin/ld: drivers/a715181@@tmp_rte_pmd_qede at sta/net_qede_qede_main.c.o:(.data.rel.ro+0x108): undefined reference to `qed_dbg_fw_asserts'
/usr/lib64/gcc/x86_64-suse-linux/7/../../../../x86_64-suse-linux/bin/ld: drivers/a715181@@tmp_rte_pmd_qede at sta/net_qede_qede_main.c.o:(.data.rel.ro+0x110): undefined reference to `qed_dbg_fw_asserts_size'
/usr/lib64/gcc/x86_64-suse-linux/7/../../../../x86_64-suse-linux/bin/ld: drivers/a715181@@tmp_rte_pmd_qede at sta/net_qede_qede_main.c.o:(.data.rel.ro+0x118): undefined reference to `qed_dbg_ilt'
/usr/lib64/gcc/x86_64-suse-linux/7/../../../../x86_64-suse-linux/bin/ld: drivers/a715181@@tmp_rte_pmd_qede at sta/net_qede_qede_main.c.o:(.data.rel.ro+0x120): undefined reference to `qed_dbg_ilt_size'
/usr/lib64/gcc/x86_64-suse-linux/7/../../../../x86_64-suse-linux/bin/ld: drivers/a715181@@tmp_rte_pmd_qede at sta/net_qede_qede_main.c.o:(.data.rel.ro+0x128): undefined reference to `qed_get_debug_engine'
/usr/lib64/gcc/x86_64-suse-linux/7/../../../../x86_64-suse-linux/bin/ld: drivers/a715181@@tmp_rte_pmd_qede at sta/net_qede_qede_main.c.o:(.data.rel.ro+0x130): undefined reference to `qed_set_debug_engine'
collect2: error: ld returned 1 exit status
[1517/2279] Compiling C object 'drivers/net/sfc/base/59ea503@@sfc_base at sta/hunt_nic.c.o'.
[1518/2279] Compiling C object 'drivers/net/sfc/base/59ea503@@sfc_base at sta/ef10_tx.c.o'.
[1519/2279] Compiling C object 'drivers/net/sfc/base/59ea503@@sfc_base at sta/medford2_nic.c.o'.
[1520/2279] Compiling C object 'drivers/net/sfc/base/59ea503@@sfc_base at sta/medford_nic.c.o'.
[1521/2279] Compiling C object 'drivers/net/sfc/base/59ea503@@sfc_base at sta/ef10_rx.c.o'.
[1522/2279] Compiling C object 'drivers/a715181@@tmp_rte_pmd_octeontx2 at sta/net_octeontx2_otx2_tx.c.o'.
[1523/2279] Compiling C object 'drivers/a715181@@tmp_rte_pmd_sfc at sta/net_sfc_sfc_intr.c.o'.
[1524/2279] Compiling C object 'drivers/a715181@@tmp_rte_pmd_sfc at sta/net_sfc_sfc_ev.c.o'.
[1525/2279] Compiling C object 'drivers/a715181@@tmp_rte_pmd_sfc at sta/net_sfc_sfc.c.o'.
ninja: build stopped: subcommand failed




*Meson Build Failed #5:
OS: UB1804-32
Target:./build-gcc-static
FAILED: drivers/librte_pmd_qede.so.20.0.3 
gcc  -o drivers/librte_pmd_qede.so.20.0.3 'drivers/a715181@@rte_pmd_qede at sha/meson-generated_.._rte_pmd_qede.pmd.c.o' 'drivers/net/qede/base/f6110d5@@qede_base at sta/bcm_osal.c.o' 'drivers/net/qede/base/f6110d5@@qede_base at sta/ecore_cxt.c.o' 'drivers/net/qede/base/f6110d5@@qede_base at sta/ecore_dcbx.c.o' 'drivers/net/qede/base/f6110d5@@qede_base at sta/ecore_dev.c.o' 'drivers/net/qede/base/f6110d5@@qede_base at sta/ecore_hw.c.o' 'drivers/net/qede/base/f6110d5@@qede_base at sta/ecore_init_fw_funcs.c.o' 'drivers/net/qede/base/f6110d5@@qede_base at sta/ecore_init_ops.c.o' 'drivers/net/qede/base/f6110d5@@qede_base at sta/ecore_int.c.o' 'drivers/net/qede/base/f6110d5@@qede_base at sta/ecore_l2.c.o' 'drivers/net/qede/base/f6110d5@@qede_base at sta/ecore_mcp.c.o' 'drivers/net/qede/base/f6110d5@@qede_base at sta/ecore_sp_commands.c.o' 'drivers/net/qede/base/f6110d5@@qede_base at sta/ecore_spq.c.o' 'drivers/net/qede/base/f6110d5@@qede_base at sta/ecore_sriov.c.o' 'drivers/net/qede/base/f6110d5@@qede_base at sta/ecore_vf.c.o' 'drivers/a715181@@tmp_rte_pmd_qede at sta/net_qede_qede_ethdev.c.o' 'drivers/a715181@@tmp_rte_pmd_qede at sta/net_qede_qede_filter.c.o' 'drivers/a715181@@tmp_rte_pmd_qede at sta/net_qede_qede_main.c.o' 'drivers/a715181@@tmp_rte_pmd_qede at sta/net_qede_qede_rxtx.c.o' -Wl,--no-undefined -Wl,--as-needed -shared -fPIC -Wl,--start-group -Wl,-soname,librte_pmd_qede.so.20.0 -Wl,--no-as-needed -pthread -lm -ldl -lnuma -m32 lib/librte_ethdev.so.20.0.3 lib/librte_eal.so.20.0.3 lib/librte_kvargs.so.20.0.3 lib/librte_telemetry.so.20.0.3 lib/librte_net.so.20.0.3 lib/librte_mbuf.so.20.0.3 lib/librte_mempool.so.20.0.3 lib/librte_ring.so.20.0.3 lib/librte_meter.so.20.0.3 drivers/librte_bus_pci.so.20.0.3 lib/librte_pci.so.20.0.3 drivers/librte_bus_vdev.so.20.0.3 -Wl,--end-group -Wl,--version-script=/root/UB1804-32_K4.15.0_GCC7.3.0/i686-native-linuxapp-gcc/572faa18d0104128aa0f7b43283891a0/dpdk/drivers/net/qede/rte_pmd_qede_version.map '-Wl,-rpath,$ORIGIN/../lib:$ORIGIN/' -Wl,-rpath-link,/root/UB1804-32_K4.15.0_GCC7.3.0/i686-native-linuxapp-gcc/572faa18d0104128aa0f7b43283891a0/dpdk/build-gcc-static/lib:/root/UB1804-32_K4.15.0_GCC7.3.0/i686-native-linuxapp-gcc/572faa18d0104128aa0f7b43283891a0/dpdk/build-gcc-static/drivers 
/usr/local/bin/ld: drivers/net/qede/base/f6110d5@@qede_base at sta/ecore_dev.c.o: in function `ecore_resc_alloc':
/root/UB1804-32_K4.15.0_GCC7.3.0/i686-native-linuxapp-gcc/572faa18d0104128aa0f7b43283891a0/dpdk/build-gcc-static/../drivers/net/qede/base/ecore_dev.c:2516: undefined reference to `qed_dbg_alloc_user_data'
/usr/local/bin/ld: /root/UB1804-32_K4.15.0_GCC7.3.0/i686-native-linuxapp-gcc/572faa18d0104128aa0f7b43283891a0/dpdk/build-gcc-static/../drivers/net/qede/base/ecore_dev.c:2525: undefined reference to `qed_dbg_alloc_user_data'
/usr/local/bin/ld: drivers/a715181@@tmp_rte_pmd_qede at sta/net_qede_qede_ethdev.c.o:(.data.rel.ro+0x298): undefined reference to `qede_get_regs'
/usr/local/bin/ld: drivers/net/qede/base/f6110d5@@qede_base at sta/bcm_osal.c.o: in function `qede_hw_err_handler':
/root/UB1804-32_K4.15.0_GCC7.3.0/i686-native-linuxapp-gcc/572faa18d0104128aa0f7b43283891a0/dpdk/build-gcc-static/../drivers/net/qede/base/bcm_osal.c:262: undefined reference to `qede_save_fw_dump'
/usr/local/bin/ld: drivers/a715181@@tmp_rte_pmd_qede at sta/net_qede_qede_main.c.o: in function `qed_slowpath_start':
/root/UB1804-32_K4.15.0_GCC7.3.0/i686-native-linuxapp-gcc/572faa18d0104128aa0f7b43283891a0/dpdk/build-gcc-static/../drivers/net/qede/qede_main.c:285: undefined reference to `qed_dbg_pf_init'
/usr/local/bin/ld: drivers/a715181@@tmp_rte_pmd_qede at sta/net_qede_qede_main.c.o:(.data.rel.ro+0x64): undefined reference to `qed_dbg_grc'
/usr/local/bin/ld: drivers/a715181@@tmp_rte_pmd_qede at sta/net_qede_qede_main.c.o:(.data.rel.ro+0x68): undefined reference to `qed_dbg_grc_size'
/usr/local/bin/ld: drivers/a715181@@tmp_rte_pmd_qede at sta/net_qede_qede_main.c.o:(.data.rel.ro+0x6c): undefined reference to `qed_dbg_idle_chk'
/usr/local/bin/ld: drivers/a715181@@tmp_rte_pmd_qede at sta/net_qede_qede_main.c.o:(.data.rel.ro+0x70): undefined reference to `qed_dbg_idle_chk_size'
/usr/local/bin/ld: drivers/a715181@@tmp_rte_pmd_qede at sta/net_qede_qede_main.c.o:(.data.rel.ro+0x74): undefined reference to `qed_dbg_reg_fifo'
/usr/local/bin/ld: drivers/a715181@@tmp_rte_pmd_qede at sta/net_qede_qede_main.c.o:(.data.rel.ro+0x78): undefined reference to `qed_dbg_reg_fifo_size'
/usr/local/bin/ld: drivers/a715181@@tmp_rte_pmd_qede at sta/net_qede_qede_main.c.o:(.data.rel.ro+0x7c): undefined reference to `qed_dbg_mcp_trace'
/usr/local/bin/ld: drivers/a715181@@tmp_rte_pmd_qede at sta/net_qede_qede_main.c.o:(.data.rel.ro+0x80): undefined reference to `qed_dbg_mcp_trace_size'
/usr/local/bin/ld: drivers/a715181@@tmp_rte_pmd_qede at sta/net_qede_qede_main.c.o:(.data.rel.ro+0x84): undefined reference to `qed_dbg_protection_override'
/usr/local/bin/ld: drivers/a715181@@tmp_rte_pmd_qede at sta/net_qede_qede_main.c.o:(.data.rel.ro+0x88): undefined reference to `qed_dbg_protection_override_size'
/usr/local/bin/ld: drivers/a715181@@tmp_rte_pmd_qede at sta/net_qede_qede_main.c.o:(.data.rel.ro+0x8c): undefined reference to `qed_dbg_igu_fifo_size'
/usr/local/bin/ld: drivers/a715181@@tmp_rte_pmd_qede at sta/net_qede_qede_main.c.o:(.data.rel.ro+0x90): undefined reference to `qed_dbg_igu_fifo'
/usr/local/bin/ld: drivers/a715181@@tmp_rte_pmd_qede at sta/net_qede_qede_main.c.o:(.data.rel.ro+0x94): undefined reference to `qed_dbg_fw_asserts'
/usr/local/bin/ld: drivers/a715181@@tmp_rte_pmd_qede at sta/net_qede_qede_main.c.o:(.data.rel.ro+0x98): undefined reference to `qed_dbg_fw_asserts_size'
/usr/local/bin/ld: drivers/a715181@@tmp_rte_pmd_qede at sta/net_qede_qede_main.c.o:(.data.rel.ro+0x9c): undefined reference to `qed_dbg_ilt'
/usr/local/bin/ld: drivers/a715181@@tmp_rte_pmd_qede at sta/net_qede_qede_main.c.o:(.data.rel.ro+0xa0): undefined reference to `qed_dbg_ilt_size'
/usr/local/bin/ld: drivers/a715181@@tmp_rte_pmd_qede at sta/net_qede_qede_main.c.o:(.data.rel.ro+0xa4): undefined reference to `qed_get_debug_engine'
/usr/local/bin/ld: drivers/a715181@@tmp_rte_pmd_qede at sta/net_qede_qede_main.c.o:(.data.rel.ro+0xa8): undefined reference to `qed_set_debug_engine'
collect2: error: ld returned 1 exit status
[1436/2125] Compiling C object 'drivers/a715181@@tmp_rte_pmd_thunderx at sta/net_thunderx_nicvf_rxtx.c.o'.
[1437/2125] Compiling C object 'drivers/a715181@@tmp_rte_pmd_vdev_netvsc at sta/net_vdev_netvsc_vdev_netvsc.c.o'.
[1438/2125] Compiling C object 'drivers/a715181@@tmp_rte_pmd_softnic at sta/net_softnic_rte_eth_softnic_cli.c.o'.
[1439/2125] Compiling C object 'drivers/a715181@@tmp_rte_pmd_tap at sta/net_tap_rte_eth_tap.c.o'.
[1440/2125] Compiling C object 'drivers/a715181@@tmp_rte_pmd_virtio at sta/net_virtio_virtio_user_vhost_kernel_tap.c.o'.
[1441/2125] Compiling C object 'drivers/a715181@@tmp_rte_pmd_vhost at sta/net_vhost_rte_eth_vhost.c.o'.
[1442/2125] Compiling C object 'drivers/net/virtio/20670f1@@virtio_avx512_lib at sta/virtio_rxtx_packed_avx.c.o'.
[1443/2125] Compiling C object 'drivers/a715181@@tmp_rte_pmd_virtio at sta/net_virtio_virtio_ethdev.c.o'.
[1444/2125] Compiling C object 'drivers/a715181@@tmp_rte_pmd_thunderx at sta/net_thunderx_nicvf_ethdev.c.o'.
[1445/2125] Compiling C object 'drivers/a715181@@tmp_rte_pmd_octeontx2 at sta/net_octeontx2_otx2_rx.c.o'.
[1446/2125] Compiling C object 'drivers/a715181@@tmp_rte_pmd_octeontx2 at sta/net_octeontx2_otx2_tx.c.o'.
ninja: build stopped: subcommand failed




*Meson Build Failed #6:
OS: UB2004-64
Target:./build-gcc-static
FAILED: drivers/librte_pmd_qede.so.20.0.3 
gcc  -o drivers/librte_pmd_qede.so.20.0.3 'drivers/a715181@@rte_pmd_qede at sha/meson-generated_.._rte_pmd_qede.pmd.c.o' 'drivers/net/qede/base/f6110d5@@qede_base at sta/bcm_osal.c.o' 'drivers/net/qede/base/f6110d5@@qede_base at sta/ecore_cxt.c.o' 'drivers/net/qede/base/f6110d5@@qede_base at sta/ecore_dcbx.c.o' 'drivers/net/qede/base/f6110d5@@qede_base at sta/ecore_dev.c.o' 'drivers/net/qede/base/f6110d5@@qede_base at sta/ecore_hw.c.o' 'drivers/net/qede/base/f6110d5@@qede_base at sta/ecore_init_fw_funcs.c.o' 'drivers/net/qede/base/f6110d5@@qede_base at sta/ecore_init_ops.c.o' 'drivers/net/qede/base/f6110d5@@qede_base at sta/ecore_int.c.o' 'drivers/net/qede/base/f6110d5@@qede_base at sta/ecore_l2.c.o' 'drivers/net/qede/base/f6110d5@@qede_base at sta/ecore_mcp.c.o' 'drivers/net/qede/base/f6110d5@@qede_base at sta/ecore_sp_commands.c.o' 'drivers/net/qede/base/f6110d5@@qede_base at sta/ecore_spq.c.o' 'drivers/net/qede/base/f6110d5@@qede_base at sta/ecore_sriov.c.o' 'drivers/net/qede/base/f6110d5@@qede_base at sta/ecore_vf.c.o' 'drivers/a715181@@tmp_rte_pmd_qede at sta/net_qede_qede_ethdev.c.o' 'drivers/a715181@@tmp_rte_pmd_qede at sta/net_qede_qede_filter.c.o' 'drivers/a715181@@tmp_rte_pmd_qede at sta/net_qede_qede_main.c.o' 'drivers/a715181@@tmp_rte_pmd_qede at sta/net_qede_qede_rxtx.c.o' -Wl,--as-needed -Wl,--no-undefined -shared -fPIC -Wl,--start-group -Wl,-soname,librte_pmd_qede.so.20.0 -Wl,--no-as-needed -pthread -lm -ldl -lnuma lib/librte_ethdev.so.20.0.3 lib/librte_eal.so.20.0.3 lib/librte_kvargs.so.20.0.3 lib/librte_telemetry.so.20.0.3 lib/librte_net.so.20.0.3 lib/librte_mbuf.so.20.0.3 lib/librte_mempool.so.20.0.3 lib/librte_ring.so.20.0.3 lib/librte_meter.so.20.0.3 drivers/librte_bus_pci.so.20.0.3 lib/librte_pci.so.20.0.3 drivers/librte_bus_vdev.so.20.0.3 -Wl,--end-group -Wl,--version-script=/root/UB2004-64_K5.4.0_GCC9.3.0/x86_64-native-linuxapp-gcc/572faa18d0104128aa0f7b43283891a0/dpdk/drivers/net/qede/rte_pmd_qede_version.map '-Wl,-rpath,$ORIGIN/../lib:$ORIGIN/' -Wl,-rpath-link,/root/UB2004-64_K5.4.0_GCC9.3.0/x86_64-native-linuxapp-gcc/572faa18d0104128aa0f7b43283891a0/dpdk/build-gcc-static/lib -Wl,-rpath-link,/root/UB2004-64_K5.4.0_GCC9.3.0/x86_64-native-linuxapp-gcc/572faa18d0104128aa0f7b43283891a0/dpdk/build-gcc-static/drivers
/usr/bin/ld: drivers/net/qede/base/f6110d5@@qede_base at sta/bcm_osal.c.o: in function `qede_hw_err_handler':
/root/UB2004-64_K5.4.0_GCC9.3.0/x86_64-native-linuxapp-gcc/572faa18d0104128aa0f7b43283891a0/dpdk/build-gcc-static/../drivers/net/qede/base/bcm_osal.c:262: undefined reference to `qede_save_fw_dump'
/usr/bin/ld: drivers/net/qede/base/f6110d5@@qede_base at sta/ecore_dev.c.o: in function `ecore_resc_alloc':
/root/UB2004-64_K5.4.0_GCC9.3.0/x86_64-native-linuxapp-gcc/572faa18d0104128aa0f7b43283891a0/dpdk/build-gcc-static/../drivers/net/qede/base/ecore_dev.c:2516: undefined reference to `qed_dbg_alloc_user_data'
/usr/bin/ld: /root/UB2004-64_K5.4.0_GCC9.3.0/x86_64-native-linuxapp-gcc/572faa18d0104128aa0f7b43283891a0/dpdk/build-gcc-static/../drivers/net/qede/base/ecore_dev.c:2525: undefined reference to `qed_dbg_alloc_user_data'
/usr/bin/ld: drivers/a715181@@tmp_rte_pmd_qede at sta/net_qede_qede_ethdev.c.o:(.data.rel.ro+0x530): undefined reference to `qede_get_regs'
/usr/bin/ld: drivers/a715181@@tmp_rte_pmd_qede at sta/net_qede_qede_main.c.o: in function `qed_slowpath_start':
/root/UB2004-64_K5.4.0_GCC9.3.0/x86_64-native-linuxapp-gcc/572faa18d0104128aa0f7b43283891a0/dpdk/build-gcc-static/../drivers/net/qede/qede_main.c:285: undefined reference to `qed_dbg_pf_init'
/usr/bin/ld: drivers/a715181@@tmp_rte_pmd_qede at sta/net_qede_qede_main.c.o:(.data.rel.ro+0xa8): undefined reference to `qed_dbg_grc'
/usr/bin/ld: drivers/a715181@@tmp_rte_pmd_qede at sta/net_qede_qede_main.c.o:(.data.rel.ro+0xb0): undefined reference to `qed_dbg_grc_size'
/usr/bin/ld: drivers/a715181@@tmp_rte_pmd_qede at sta/net_qede_qede_main.c.o:(.data.rel.ro+0xb8): undefined reference to `qed_dbg_idle_chk'
/usr/bin/ld: drivers/a715181@@tmp_rte_pmd_qede at sta/net_qede_qede_main.c.o:(.data.rel.ro+0xc0): undefined reference to `qed_dbg_idle_chk_size'
/usr/bin/ld: drivers/a715181@@tmp_rte_pmd_qede at sta/net_qede_qede_main.c.o:(.data.rel.ro+0xc8): undefined reference to `qed_dbg_reg_fifo'
/usr/bin/ld: drivers/a715181@@tmp_rte_pmd_qede at sta/net_qede_qede_main.c.o:(.data.rel.ro+0xd0): undefined reference to `qed_dbg_reg_fifo_size'
/usr/bin/ld: drivers/a715181@@tmp_rte_pmd_qede at sta/net_qede_qede_main.c.o:(.data.rel.ro+0xd8): undefined reference to `qed_dbg_mcp_trace'
/usr/bin/ld: drivers/a715181@@tmp_rte_pmd_qede at sta/net_qede_qede_main.c.o:(.data.rel.ro+0xe0): undefined reference to `qed_dbg_mcp_trace_size'
/usr/bin/ld: drivers/a715181@@tmp_rte_pmd_qede at sta/net_qede_qede_main.c.o:(.data.rel.ro+0xe8): undefined reference to `qed_dbg_protection_override'
/usr/bin/ld: drivers/a715181@@tmp_rte_pmd_qede at sta/net_qede_qede_main.c.o:(.data.rel.ro+0xf0): undefined reference to `qed_dbg_protection_override_size'
/usr/bin/ld: drivers/a715181@@tmp_rte_pmd_qede at sta/net_qede_qede_main.c.o:(.data.rel.ro+0xf8): undefined reference to `qed_dbg_igu_fifo_size'
/usr/bin/ld: drivers/a715181@@tmp_rte_pmd_qede at sta/net_qede_qede_main.c.o:(.data.rel.ro+0x100): undefined reference to `qed_dbg_igu_fifo'
/usr/bin/ld: drivers/a715181@@tmp_rte_pmd_qede at sta/net_qede_qede_main.c.o:(.data.rel.ro+0x108): undefined reference to `qed_dbg_fw_asserts'
/usr/bin/ld: drivers/a715181@@tmp_rte_pmd_qede at sta/net_qede_qede_main.c.o:(.data.rel.ro+0x110): undefined reference to `qed_dbg_fw_asserts_size'
/usr/bin/ld: drivers/a715181@@tmp_rte_pmd_qede at sta/net_qede_qede_main.c.o:(.data.rel.ro+0x118): undefined reference to `qed_dbg_ilt'
/usr/bin/ld: drivers/a715181@@tmp_rte_pmd_qede at sta/net_qede_qede_main.c.o:(.data.rel.ro+0x120): undefined reference to `qed_dbg_ilt_size'
/usr/bin/ld: drivers/a715181@@tmp_rte_pmd_qede at sta/net_qede_qede_main.c.o:(.data.rel.ro+0x128): undefined reference to `qed_get_debug_engine'
/usr/bin/ld: drivers/a715181@@tmp_rte_pmd_qede at sta/net_qede_qede_main.c.o:(.data.rel.ro+0x130): undefined reference to `qed_set_debug_engine'
collect2: error: ld returned 1 exit status
[1528/2375] Compiling C object 'drivers/net/sfc/base/59ea503@@sfc_base at sta/ef10_proxy.c.o'.
[1529/2375] Compiling C object 'drivers/net/sfc/base/59ea503@@sfc_base at sta/ef10_phy.c.o'.
[1530/2375] Compiling C object 'drivers/net/sfc/base/59ea503@@sfc_base at sta/ef10_nvram.c.o'.
[1531/2375] Compiling C object 'drivers/net/sfc/base/59ea503@@sfc_base at sta/ef10_mac.c.o'.
[1532/2375] Compiling C object 'drivers/net/sfc/base/59ea503@@sfc_base at sta/ef10_filter.c.o'.
[1533/2375] Compiling C object 'drivers/net/sfc/base/59ea503@@sfc_base at sta/ef10_nic.c.o'.
[1534/2375] Compiling C object 'drivers/net/sfc/base/59ea503@@sfc_base at sta/ef10_vpd.c.o'.
[1535/2375] Compiling C object 'drivers/net/sfc/base/59ea503@@sfc_base at sta/ef10_rx.c.o'.
[1536/2375] Compiling C object 'drivers/net/sfc/base/59ea503@@sfc_base at sta/ef10_tx.c.o'.
[1537/2375] Compiling C object 'drivers/a715181@@tmp_rte_pmd_octeontx2 at sta/net_octeontx2_otx2_tx.c.o'.
[1538/2375] Compiling C object 'drivers/a715181@@tmp_rte_pmd_octeontx2 at sta/net_octeontx2_otx2_rx.c.o'.
ninja: build stopped: subcommand failed


DPDK STV team


More information about the test-report mailing list