[dpdk-test-report] |FAILURE| pw(73685) [v7, 01/25] ethdev: allow unknown link speed

sys_stv at intel.com sys_stv at intel.com
Sat Jul 11 05:25:23 CEST 2020


Test-Label: Intel-compilation
Test-Status: FAILURE
http://dpdk.org/patch/73685

_Compilation issues_

Submitter: Ivan Dyukov <i.dyukov at samsung.com>
Date: 2020-07-10 07:01:59
Reply_mail: 20200710070226.6045-2-i.dyukov at samsung.com

DPDK git baseline: Repo:dpdk, CommitID: eff30b59cc2eadcd36e755818b62c87d0caa7e01


Meson build Summary: 8 Builds Done, 3 Successful, 5 Failures, 0 Blocked

Makefile build Summary: 20 Builds Done, 20 Successful, 0 Failures, 0 Blocked

                +==============================================+===========+==========+
                |                   Makefile                   |   Meson   | Document |
+----------------+------+-------+------+------------+-----------+-----------+----------+
| os             | gcc  | clang | icc  | gcc+shared | gcc+debug | gcc/clang | pdf/html |
+----------------+------+-------+------+------------+-----------+-----------+----------+
| CENTOS82-64    | pass | pass  | pass | pass       | pass      | FAIL      |          |
| RHEL82-64      | pass |       |      |            |           |           |          |
| UB1804-64      | pass |       |      |            |           |           |          |
| FC32-64        | pass | pass  |      |            |           | FAIL      |          |
| CENTOS77-64    | pass |       |      |            |           |           |          |
| UB2004-64      | pass | pass  | pass |            |           | FAIL      | pass     |
| WIN10-64       |      |       |      |            |           | pass      |          |
| UB2004-32      | pass |       |      |            |           |           |          |
| UB1804-32      |      |       |      |            |           | FAIL      |          |
| FreeBSD1201-64 | pass | pass  |      | pass       | pass      | pass      |          |
| SUSE15-64      | pass | pass  |      |            |           | FAIL      |          |
+----------------+------+-------+------+------------+-----------+-----------+----------+
Test environment and configuration as below:

** Makefile build **


OS: CENTOS82-64
	Kernel Version: 4.18.0-193.el8.x86_64
	CPU info: Intel(R) Xeon(R) Platinum 8280M CPU @ 2.70GHz
	GCC Version: gcc (GCC) 8.3.1 20191121 (Red Hat 8.3.1-5)
	Clang Version: 9.0.1 (Red Hat 9.0.1-2.module_el8.2.0+309+0c7b6b03)
	x86_64-native-linuxapp-gcc
	x86_64-native-linuxapp-clang
	x86_64-native-linuxapp-icc
	x86_64-native-linuxapp-gcc+shared
	x86_64-native-linuxapp-gcc+debug


OS: RHEL82-64
	Kernel Version: 4.18.0-193.el8.x86_64
	CPU info: Intel(R) Xeon(R) Platinum 8280M CPU @ 2.70GHz
	GCC Version: gcc (GCC) 8.3.1 20191121 (Red Hat 8.3.1-5)
	Clang Version: 8.0.1 (Red Hat 8.0.1-1.module_el8.1.0+215+a01033fb)
	x86_64-native-linuxapp-gcc


OS: UB1804-64
	Kernel Version: 4.15.0-29-generic
	CPU info: Intel(R) Xeon(R) Platinum 8180 CPU @ 2.50GHz
	GCC Version: gcc (Ubuntu 7.5.0-3ubuntu1~18.04) 7.5.0
	Clang Version: 6.0.0-1ubuntu2 (tags/RELEASE_600/final)
	x86_64-native-linuxapp-gcc


OS: FC32-64
	Kernel Version: 5.6.0-0.rc7.git0.2.fc32.x86_64
	CPU info: Intel(R) Xeon(R) Platinum 8280M CPU @ 2.70GHz
	GCC Version: gcc (GCC) 10.0.1 20200311 (Red Hat 10.0.1-0.9)
	Clang Version: 10.0.0 (Fedora 10.0.0-0.3.rc4.fc32)
	x86_64-native-linuxapp-gcc
	x86_64-native-linuxapp-clang


OS: CENTOS77-64
	Kernel Version: 3.10.0-1062.9.1.el7.x86_64
	CPU info: Intel(R) Xeon(R) Platinum 8280M CPU @ 2.70GHz
	GCC Version: gcc (GCC) 4.8.5 20150623 (Red Hat 4.8.5-39)
	Clang Version: 3.4.2 (tags/RELEASE_34/dot2-final)
	x86_64-native-linuxapp-gcc


OS: UB2004-64
	Kernel Version: 5.4.0-26-generic
	CPU info: Intel(R) Xeon(R) Platinum 8180 CPU @ 2.50GHz
	GCC Version: gcc (Ubuntu 10-20200416-0ubuntu1) 10.0.1 20200416 (experimental) [master revision 3c3f12e2a76:dcee354ce56:44b326839d864fc10c459916abcc97f35a9ac3de]
	Clang Version: 10.0.0-4ubuntu1
	x86_64-native-linuxapp-clang
	x86_64-native-linuxapp-gcc
	x86_64-native-linuxapp-icc


OS: UB2004-32
	Kernel Version: 5.4.0-26-generic
	CPU info: Intel(R) Xeon(R) Platinum 8180 CPU @ 2.50GHz
	GCC Version: gcc (Ubuntu 9.3.0-10ubuntu2) 9.3.0
	Clang Version: 10.0.0-4ubuntu1
	i686-native-linuxapp-gcc


OS: FreeBSD1201-64
	Kernel Version: 12.1-RELEASE
	CPU info: Intel(R) Xeon(R) CPU E5-2699 v3 @ 2.30GHz (2294.74-MHz K8-class CPU)
	GCC Version: gcc (FreeBSD Ports Collection) 9.2.0
	Clang Version: 8.0.1 (tags/RELEASE_801/final 366581) (based on LLVM 8.0.1)
	x86_64-native-bsdapp-gcc
	x86_64-native-bsdapp-clang
	x86_64-native-bsdapp-gcc+shared
	x86_64-native-bsdapp-gcc+debug


OS: SUSE15-64
	Kernel Version: 4.12.14-lp150.11-default
	CPU info: Intel(R) Xeon(R) CPU E5-2699 v4 @ 2.20GHz
	GCC Version: gcc (SUSE Linux) 7.3.1 20180323 [gcc-7-branch revision 258812]
	Clang Version: 5.0.1 (tags/RELEASE_501/final 312548)
	x86_64-native-linuxapp-clang
	x86_64-native-linuxapp-gcc

** Meson build **


OS: CENTOS82-64
	Kernel Version: 4.18.0-193.el8.x86_64
	CPU info: Intel(R) Xeon(R) CPU E5-2699 v4 @ 2.20GHz
	GCC Version: gcc (GCC) 8.3.1 20191121 (Red Hat 8.3.1-5)
	Clang Version: 9.0.1 (Red Hat 9.0.1-2.module_el8.2.0+309+0c7b6b03)
	./build-gcc-static
	./build-gcc-shared
	./build-clang-static
	./build-clang-shared
	./build-x86-default


OS: UB2004-64
	Kernel Version: 5.4.0-26-generic
	CPU info: Intel(R) Xeon(R) Platinum 8180 CPU @ 2.50GHz
	GCC Version: gcc (Ubuntu 9.3.0-10ubuntu2) 9.3.0
	Clang Version: 10.0.0-4ubuntu1
	x86_64-native-linuxapp-doc
	./build-gcc-static
	./build-gcc-shared
	./build-clang-static
	./build-clang-shared
	./build-x86-default


OS: FC32-64
	Kernel Version: 5.6.0-0.rc7.git0.2.fc32.x86_64
	CPU info: Intel(R) Xeon(R) CPU E5-2699 v4 @ 2.20GHz
	GCC Version: gcc (GCC) 10.0.1 20200311 (Red Hat 10.0.1-0.9)
	Clang Version: 10.0.0 (Fedora 10.0.0-0.3.rc4.fc32)
	./build-gcc-static
	./build-gcc-shared
	./build-clang-static
	./build-clang-shared
	./build-x86-default


OS: WIN10-64
	Kernel Version: N/A
	CPU info: N/A
	GCC Version: N/A
	Clang Version: Clang 8.0.0
	x86_64-windows-clang


OS: UB1804-32
	Kernel Version: 4.15.0-20-generic
	CPU info: Intel(R) Xeon(R) CPU E5-2699 v4 @ 2.20GHz
	GCC Version: gcc (Ubuntu 7.5.0-3ubuntu1~18.04) 7.5.0
	Clang Version: 6.0.0-1ubuntu2 (tags/RELEASE_600/final)
	./build-gcc-static
	./build-gcc-shared
	./build-clang-static
	./build-clang-shared
	./build-x86-default


OS: FreeBSD1201-64
	Kernel Version: 12.1-RELEASE
	CPU info: Intel(R) Xeon(R) CPU E5-2699 v4 @ 2.20GHz (2194.97-MHz K8-class CPU)
	GCC Version: gcc (FreeBSD Ports Collection) 9.2.0
	Clang Version: 8.0.1 (tags/RELEASE_801/final 366581) (based on LLVM 8.0.1)
	./build-gcc-static
	./build-gcc-shared
	./build-clang-static
	./build-clang-shared
	./build-x86-default


OS: SUSE15-64
	Kernel Version: 4.12.14-lp150.12.82-default
	CPU info: Intel(R) Xeon(R) CPU E5-2699 v4 @ 2.20GHz
	GCC Version: gcc (SUSE Linux) 7.4.1 20190905 [gcc-7-branch revision 275407]
	Clang Version: 5.0.1 (tags/RELEASE_501/final 312548)
	./build-gcc-static
	./build-gcc-shared
	./build-clang-static
	./build-clang-shared
	./build-x86-default



*Meson Build Failed #1:
OS: CENTOS82-64
Target:./build-gcc-static
FAILED: examples/c590b3c@@dpdk-ntb at exe/ntb_ntb_fwd.c.o 
gcc -Iexamples/c590b3c@@dpdk-ntb at exe -Iexamples -I../examples -Iexamples/ntb -I../examples/ntb -I. -I../ -Iconfig -I../config -Ilib/librte_eal/include -I../lib/librte_eal/include -Ilib/librte_eal/linux/include -I../lib/librte_eal/linux/include -Ilib/librte_eal/x86/include -I../lib/librte_eal/x86/include -Ilib/librte_eal/common -I../lib/librte_eal/common -Ilib/librte_eal -I../lib/librte_eal -Ilib/librte_kvargs -I../lib/librte_kvargs -Ilib/librte_telemetry/../librte_metrics -I../lib/librte_telemetry/../librte_metrics -Ilib/librte_telemetry -I../lib/librte_telemetry -Ilib/librte_mempool -I../lib/librte_mempool -Ilib/librte_ring -I../lib/librte_ring -Ilib/librte_net -I../lib/librte_net -Ilib/librte_mbuf -I../lib/librte_mbuf -Ilib/librte_ethdev -I../lib/librte_ethdev -Ilib/librte_meter -I../lib/librte_meter -Ilib/librte_cmdline -I../lib/librte_cmdline -Ilib/librte_rawdev -I../lib/librte_rawdev -Idrivers/raw/ntb -I../drivers/raw/ntb -Ilib/librte_pci -I../lib/librte_pci -Idrivers/bus/pci -I../drivers/bus/pci -I../drivers/bus/pci/linux -fdiagnostics-color=always -pipe -Wall -Winvalid-pch -Werror -O2 -g -include rte_config.h -Wextra -Wcast-qual -Wdeprecated -Wformat-nonliteral -Wformat-security -Wmissing-declarations -Wmissing-prototypes -Wnested-externs -Wold-style-definition -Wpointer-arith -Wsign-compare -Wstrict-prototypes -Wundef -Wwrite-strings -Wno-packed-not-aligned -Wno-missing-field-initializers -D_GNU_SOURCE -march=native -mno-avx512f -Wno-format-truncation -D_FILE_OFFSET_BITS=64 -DALLOW_EXPERIMENTAL_API -MD -MQ 'examples/c590b3c@@dpdk-ntb at exe/ntb_ntb_fwd.c.o' -MF 'examples/c590b3c@@dpdk-ntb at exe/ntb_ntb_fwd.c.o.d' -o 'examples/c590b3c@@dpdk-ntb at exe/ntb_ntb_fwd.c.o' -c ../examples/ntb/ntb_fwd.c
../examples/ntb/ntb_fwd.c: In function ‘start_pkt_fwd’:
../examples/ntb/ntb_fwd.c:752:11: error: passing argument 4 of ‘rte_eth_link_strf’ from incompatible pointer type [-Werror=incompatible-pointer-types]
           &link);
           ^~~~~
In file included from ../examples/ntb/ntb_fwd.c:17:
../lib/librte_ethdev/rte_ethdev.h:2350:31: note: expected ‘const struct rte_eth_link *’ but argument is of type ‘int (*)(const char *, const char *)’
    const struct rte_eth_link *eth_link);
    ~~~~~~~~~~~~~~~~~~~~~~~~~~~^~~~~~~~
cc1: all warnings being treated as errors
[2543/2598] Compiling C object 'examples/c590b3c@@dpdk-qos_sched at exe/qos_sched_args.c.o'.
[2544/2598] Compiling C object 'examples/c590b3c@@dpdk-qos_sched at exe/qos_sched_cmdline.c.o'.
[2545/2598] Compiling C object 'examples/c590b3c@@dpdk-ptpclient at exe/ptpclient_ptpclient.c.o'.
[2546/2598] Compiling C object 'examples/c590b3c@@dpdk-packet_ordering at exe/packet_ordering_main.c.o'.
[2547/2598] Compiling C object 'examples/c590b3c@@dpdk-qos_sched at exe/qos_sched_init.c.o'.
[2548/2598] Compiling C object 'examples/c590b3c@@dpdk-qos_sched at exe/qos_sched_app_thread.c.o'.
[2549/2598] Compiling C object 'examples/c590b3c@@dpdk-l3fwd-thread at exe/performance-thread_l3fwd-thread_main.c.o'.
[2550/2598] Compiling C object 'examples/c590b3c@@dpdk-qos_sched at exe/qos_sched_stats.c.o'.
[2551/2598] Compiling C object 'examples/c590b3c@@dpdk-qos_sched at exe/qos_sched_main.c.o'.
[2552/2598] Compiling C object 'drivers/a715181@@tmp_rte_pmd_octeontx2_event at sta/event_octeontx2_otx2_worker.c.o'.
[2553/2598] Compiling C object 'drivers/a715181@@tmp_rte_pmd_octeontx2_event at sta/event_octeontx2_otx2_worker_dual.c.o'.
ninja: build stopped: subcommand failed




*Meson Build Failed #2:
OS: FC32-64
Target:./build-gcc-static
FAILED: examples/c590b3c@@dpdk-ntb at exe/ntb_ntb_fwd.c.o 
gcc -Iexamples/c590b3c@@dpdk-ntb at exe -Iexamples -I../examples -Iexamples/ntb -I../examples/ntb -I. -I../ -Iconfig -I../config -Ilib/librte_eal/include -I../lib/librte_eal/include -Ilib/librte_eal/linux/include -I../lib/librte_eal/linux/include -Ilib/librte_eal/x86/include -I../lib/librte_eal/x86/include -Ilib/librte_eal/common -I../lib/librte_eal/common -Ilib/librte_eal -I../lib/librte_eal -Ilib/librte_kvargs -I../lib/librte_kvargs -Ilib/librte_telemetry/../librte_metrics -I../lib/librte_telemetry/../librte_metrics -Ilib/librte_telemetry -I../lib/librte_telemetry -Ilib/librte_mempool -I../lib/librte_mempool -Ilib/librte_ring -I../lib/librte_ring -Ilib/librte_net -I../lib/librte_net -Ilib/librte_mbuf -I../lib/librte_mbuf -Ilib/librte_ethdev -I../lib/librte_ethdev -Ilib/librte_meter -I../lib/librte_meter -Ilib/librte_cmdline -I../lib/librte_cmdline -Ilib/librte_rawdev -I../lib/librte_rawdev -Idrivers/raw/ntb -I../drivers/raw/ntb -Ilib/librte_pci -I../lib/librte_pci -Idrivers/bus/pci -I../drivers/bus/pci -I../drivers/bus/pci/linux -fdiagnostics-color=always -pipe -Wall -Winvalid-pch -Werror -O2 -g -include rte_config.h -Wextra -Wcast-qual -Wdeprecated -Wformat-nonliteral -Wformat-security -Wmissing-declarations -Wmissing-prototypes -Wnested-externs -Wold-style-definition -Wpointer-arith -Wsign-compare -Wstrict-prototypes -Wundef -Wwrite-strings -Wno-address-of-packed-member -Wno-packed-not-aligned -Wno-missing-field-initializers -Wno-zero-length-bounds -D_GNU_SOURCE -march=native -Wno-format-truncation -D_FILE_OFFSET_BITS=64 -DALLOW_EXPERIMENTAL_API -MD -MQ 'examples/c590b3c@@dpdk-ntb at exe/ntb_ntb_fwd.c.o' -MF 'examples/c590b3c@@dpdk-ntb at exe/ntb_ntb_fwd.c.o.d' -o 'examples/c590b3c@@dpdk-ntb at exe/ntb_ntb_fwd.c.o' -c ../examples/ntb/ntb_fwd.c
../examples/ntb/ntb_fwd.c: In function ‘start_pkt_fwd’:
../examples/ntb/ntb_fwd.c:752:11: error: passing argument 4 of ‘rte_eth_link_strf’ from incompatible pointer type [-Werror=incompatible-pointer-types]
  752 |           &link);
      |           ^~~~~
      |           |
      |           int (*)(const char *, const char *)
In file included from ../examples/ntb/ntb_fwd.c:17:
../lib/librte_ethdev/rte_ethdev.h:2350:31: note: expected ‘const struct rte_eth_link *’ but argument is of type ‘int (*)(const char *, const char *)’
 2350 |    const struct rte_eth_link *eth_link);
      |    ~~~~~~~~~~~~~~~~~~~~~~~~~~~^~~~~~~~
cc1: all warnings being treated as errors
[2537/2599] Compiling C object 'examples/c590b3c@@dpdk-pthread_shim at exe/performance-thread_common_lthread_sched.c.o'.
[2538/2599] Compiling C object 'examples/c590b3c@@dpdk-pthread_shim at exe/performance-thread_common_lthread_tls.c.o'.
[2539/2599] Compiling C object 'examples/c590b3c@@dpdk-pthread_shim at exe/performance-thread_common_lthread_mutex.c.o'.
[2540/2599] Compiling C object 'examples/c590b3c@@dpdk-qos_meter at exe/qos_meter_main.c.o'.
[2541/2599] Compiling C object 'examples/c590b3c@@dpdk-qos_sched at exe/qos_sched_args.c.o'.
[2542/2599] Compiling C object 'examples/c590b3c@@dpdk-ptpclient at exe/ptpclient_ptpclient.c.o'.
[2543/2599] Compiling C object 'examples/c590b3c@@dpdk-packet_ordering at exe/packet_ordering_main.c.o'.
[2544/2599] Compiling C object 'examples/c590b3c@@dpdk-l3fwd-thread at exe/performance-thread_l3fwd-thread_main.c.o'.
[2545/2599] Compiling C object 'examples/c590b3c@@dpdk-qos_sched at exe/qos_sched_app_thread.c.o'.
[2546/2599] Compiling C object 'drivers/a715181@@tmp_rte_pmd_octeontx2_event at sta/event_octeontx2_otx2_worker.c.o'.
[2547/2599] Compiling C object 'drivers/a715181@@tmp_rte_pmd_octeontx2_event at sta/event_octeontx2_otx2_worker_dual.c.o'.
ninja: build stopped: subcommand failed




*Meson Build Failed #3:
OS: SUSE15-64
Target:./build-gcc-static
FAILED: examples/c590b3c@@dpdk-ntb at exe/ntb_ntb_fwd.c.o 
gcc -Iexamples/c590b3c@@dpdk-ntb at exe -Iexamples -I../examples -Iexamples/ntb -I../examples/ntb -I. -I../ -Iconfig -I../config -Ilib/librte_eal/include -I../lib/librte_eal/include -Ilib/librte_eal/linux/include -I../lib/librte_eal/linux/include -Ilib/librte_eal/x86/include -I../lib/librte_eal/x86/include -Ilib/librte_eal/common -I../lib/librte_eal/common -Ilib/librte_eal -I../lib/librte_eal -Ilib/librte_kvargs -I../lib/librte_kvargs -Ilib/librte_telemetry/../librte_metrics -I../lib/librte_telemetry/../librte_metrics -Ilib/librte_telemetry -I../lib/librte_telemetry -Ilib/librte_mempool -I../lib/librte_mempool -Ilib/librte_ring -I../lib/librte_ring -Ilib/librte_net -I../lib/librte_net -Ilib/librte_mbuf -I../lib/librte_mbuf -Ilib/librte_ethdev -I../lib/librte_ethdev -Ilib/librte_meter -I../lib/librte_meter -Ilib/librte_cmdline -I../lib/librte_cmdline -Ilib/librte_rawdev -I../lib/librte_rawdev -Idrivers/raw/ntb -I../drivers/raw/ntb -Ilib/librte_pci -I../lib/librte_pci -Idrivers/bus/pci -I../drivers/bus/pci -I../drivers/bus/pci/linux -fdiagnostics-color=always -pipe -Wall -Winvalid-pch -Werror -O2 -g -include rte_config.h -Wextra -Wcast-qual -Wdeprecated -Wformat-nonliteral -Wformat-security -Wmissing-declarations -Wmissing-prototypes -Wnested-externs -Wold-style-definition -Wpointer-arith -Wsign-compare -Wstrict-prototypes -Wundef -Wwrite-strings -Wno-missing-field-initializers -D_GNU_SOURCE -march=native -Wno-format-truncation -D_FILE_OFFSET_BITS=64 -DALLOW_EXPERIMENTAL_API -MD -MQ 'examples/c590b3c@@dpdk-ntb at exe/ntb_ntb_fwd.c.o' -MF 'examples/c590b3c@@dpdk-ntb at exe/ntb_ntb_fwd.c.o.d' -o 'examples/c590b3c@@dpdk-ntb at exe/ntb_ntb_fwd.c.o' -c ../examples/ntb/ntb_fwd.c
../examples/ntb/ntb_fwd.c: In function ‘start_pkt_fwd’:
../examples/ntb/ntb_fwd.c:752:11: error: passing argument 4 of ‘rte_eth_link_strf’ from incompatible pointer type [-Werror=incompatible-pointer-types]
           &link);
           ^
In file included from ../examples/ntb/ntb_fwd.c:17:0:
../lib/librte_ethdev/rte_ethdev.h:2349:5: note: expected ‘const struct rte_eth_link *’ but argument is of type ‘int (*)(const char *, const char *)’
 int rte_eth_link_strf(char *str, size_t len, const char *const fmt,
     ^~~~~~~~~~~~~~~~~
cc1: all warnings being treated as errors
[2427/2493] Compiling C object 'examples/c590b3c@@dpdk-pthread_shim at exe/performance-thread_common_lthread_cond.c.o'.
[2428/2493] Compiling C object 'examples/c590b3c@@dpdk-pthread_shim at exe/performance-thread_common_lthread_mutex.c.o'.
[2429/2493] Compiling C object 'examples/c590b3c@@dpdk-pthread_shim at exe/performance-thread_common_lthread.c.o'.
[2430/2493] Compiling C object 'examples/c590b3c@@dpdk-qos_meter at exe/qos_meter_main.c.o'.
[2431/2493] Compiling C object 'examples/c590b3c@@dpdk-pthread_shim at exe/performance-thread_common_lthread_sched.c.o'.
[2432/2493] Compiling C object 'examples/c590b3c@@dpdk-packet_ordering at exe/packet_ordering_main.c.o'.
[2433/2493] Compiling C object 'examples/c590b3c@@dpdk-l3fwd-thread at exe/performance-thread_l3fwd-thread_main.c.o'.
[2434/2493] Compiling C object 'drivers/a715181@@tmp_rte_pmd_octeontx2_event at sta/event_octeontx2_otx2_worker.c.o'.
[2435/2493] Compiling C object 'drivers/a715181@@tmp_rte_pmd_octeontx2_event at sta/event_octeontx2_otx2_worker_dual.c.o'.
ninja: build stopped: subcommand failed




*Meson Build Failed #4:
OS: UB1804-32
Target:./build-gcc-static
FAILED: examples/c590b3c@@dpdk-ntb at exe/ntb_ntb_fwd.c.o 
gcc -Iexamples/c590b3c@@dpdk-ntb at exe -Iexamples -I../examples -Iexamples/ntb -I../examples/ntb -I. -I../ -Iconfig -I../config -Ilib/librte_eal/include -I../lib/librte_eal/include -Ilib/librte_eal/linux/include -I../lib/librte_eal/linux/include -Ilib/librte_eal/x86/include -I../lib/librte_eal/x86/include -Ilib/librte_eal/common -I../lib/librte_eal/common -Ilib/librte_eal -I../lib/librte_eal -Ilib/librte_kvargs -I../lib/librte_kvargs -Ilib/librte_telemetry/../librte_metrics -I../lib/librte_telemetry/../librte_metrics -Ilib/librte_telemetry -I../lib/librte_telemetry -Ilib/librte_mempool -I../lib/librte_mempool -Ilib/librte_ring -I../lib/librte_ring -Ilib/librte_net -I../lib/librte_net -Ilib/librte_mbuf -I../lib/librte_mbuf -Ilib/librte_ethdev -I../lib/librte_ethdev -Ilib/librte_meter -I../lib/librte_meter -Ilib/librte_cmdline -I../lib/librte_cmdline -Ilib/librte_rawdev -I../lib/librte_rawdev -Idrivers/raw/ntb -I../drivers/raw/ntb -Ilib/librte_pci -I../lib/librte_pci -Idrivers/bus/pci -I../drivers/bus/pci -I../drivers/bus/pci/linux -fdiagnostics-color=always -pipe -Wall -Winvalid-pch -Werror -O2 -g -include rte_config.h -Wextra -Wcast-qual -Wdeprecated -Wformat-nonliteral -Wformat-security -Wmissing-declarations -Wmissing-prototypes -Wnested-externs -Wold-style-definition -Wpointer-arith -Wsign-compare -Wstrict-prototypes -Wundef -Wwrite-strings -Wno-missing-field-initializers -Wno-pointer-to-int-cast -D_GNU_SOURCE -m32 -march=native -Wno-format-truncation -D_FILE_OFFSET_BITS=64 -DALLOW_EXPERIMENTAL_API -MD -MQ 'examples/c590b3c@@dpdk-ntb at exe/ntb_ntb_fwd.c.o' -MF 'examples/c590b3c@@dpdk-ntb at exe/ntb_ntb_fwd.c.o.d' -o 'examples/c590b3c@@dpdk-ntb at exe/ntb_ntb_fwd.c.o' -c ../examples/ntb/ntb_fwd.c
../examples/ntb/ntb_fwd.c: In function ‘start_pkt_fwd’:
../examples/ntb/ntb_fwd.c:752:11: error: passing argument 4 of ‘rte_eth_link_strf’ from incompatible pointer type [-Werror=incompatible-pointer-types]
           &link);
           ^
In file included from ../examples/ntb/ntb_fwd.c:17:0:
../lib/librte_ethdev/rte_ethdev.h:2349:5: note: expected ‘const struct rte_eth_link *’ but argument is of type ‘int (*)(const char *, const char *)’
 int rte_eth_link_strf(char *str, size_t len, const char *const fmt,
     ^~~~~~~~~~~~~~~~~
cc1: all warnings being treated as errors
[2272/2318] Compiling C object 'examples/c590b3c@@dpdk-qos_sched at exe/qos_sched_main.c.o'.
[2273/2318] Compiling C object 'examples/c590b3c@@dpdk-service_cores at exe/service_cores_main.c.o'.
[2274/2318] Compiling C object 'examples/c590b3c@@dpdk-qos_sched at exe/qos_sched_stats.c.o'.
[2275/2318] Compiling C object 'examples/c590b3c@@dpdk-efd_server at exe/server_node_efd_server_init.c.o'.
[2276/2318] Compiling C object 'examples/c590b3c@@dpdk-rxtx_callbacks at exe/rxtx_callbacks_main.c.o'.
[2277/2318] Compiling C object 'examples/c590b3c@@dpdk-skeleton at exe/skeleton_basicfwd.c.o'.
[2278/2318] Compiling C object 'examples/c590b3c@@dpdk-efd_server at exe/server_node_efd_server_main.c.o'.
[2279/2318] Compiling C object 'examples/c590b3c@@dpdk-efd_node at exe/server_node_efd_node_node.c.o'.
[2280/2318] Compiling C object 'examples/c590b3c@@dpdk-packet_ordering at exe/packet_ordering_main.c.o'.
[2281/2318] Compiling C object 'drivers/a715181@@tmp_rte_pmd_octeontx2_event at sta/event_octeontx2_otx2_worker.c.o'.
[2282/2318] Compiling C object 'drivers/a715181@@tmp_rte_pmd_octeontx2_event at sta/event_octeontx2_otx2_worker_dual.c.o'.
ninja: build stopped: subcommand failed




*Meson Build Failed #5:
OS: UB2004-64
Target:./build-gcc-static
FAILED: examples/c590b3c@@dpdk-ntb at exe/ntb_ntb_fwd.c.o 
gcc -Iexamples/c590b3c@@dpdk-ntb at exe -Iexamples -I../examples -Iexamples/ntb -I../examples/ntb -I. -I../ -Iconfig -I../config -Ilib/librte_eal/include -I../lib/librte_eal/include -Ilib/librte_eal/linux/include -I../lib/librte_eal/linux/include -Ilib/librte_eal/x86/include -I../lib/librte_eal/x86/include -Ilib/librte_eal/common -I../lib/librte_eal/common -Ilib/librte_eal -I../lib/librte_eal -Ilib/librte_kvargs -I../lib/librte_kvargs -Ilib/librte_telemetry/../librte_metrics -I../lib/librte_telemetry/../librte_metrics -Ilib/librte_telemetry -I../lib/librte_telemetry -Ilib/librte_mempool -I../lib/librte_mempool -Ilib/librte_ring -I../lib/librte_ring -Ilib/librte_net -I../lib/librte_net -Ilib/librte_mbuf -I../lib/librte_mbuf -Ilib/librte_ethdev -I../lib/librte_ethdev -Ilib/librte_meter -I../lib/librte_meter -Ilib/librte_cmdline -I../lib/librte_cmdline -Ilib/librte_rawdev -I../lib/librte_rawdev -Idrivers/raw/ntb -I../drivers/raw/ntb -Ilib/librte_pci -I../lib/librte_pci -Idrivers/bus/pci -I../drivers/bus/pci -I../drivers/bus/pci/linux -fdiagnostics-color=always -pipe -Wall -Winvalid-pch -Werror -O2 -g -include rte_config.h -Wextra -Wcast-qual -Wdeprecated -Wformat-nonliteral -Wformat-security -Wmissing-declarations -Wmissing-prototypes -Wnested-externs -Wold-style-definition -Wpointer-arith -Wsign-compare -Wstrict-prototypes -Wundef -Wwrite-strings -Wno-address-of-packed-member -Wno-packed-not-aligned -Wno-missing-field-initializers -D_GNU_SOURCE -march=native -Wno-format-truncation -D_FILE_OFFSET_BITS=64 -DALLOW_EXPERIMENTAL_API -MD -MQ 'examples/c590b3c@@dpdk-ntb at exe/ntb_ntb_fwd.c.o' -MF 'examples/c590b3c@@dpdk-ntb at exe/ntb_ntb_fwd.c.o.d' -o 'examples/c590b3c@@dpdk-ntb at exe/ntb_ntb_fwd.c.o' -c ../examples/ntb/ntb_fwd.c
../examples/ntb/ntb_fwd.c: In function ‘start_pkt_fwd’:
../examples/ntb/ntb_fwd.c:752:11: error: passing argument 4 of ‘rte_eth_link_strf’ from incompatible pointer type [-Werror=incompatible-pointer-types]
  752 |           &link);
      |           ^~~~~
      |           |
      |           int (*)(const char *, const char *)
In file included from ../examples/ntb/ntb_fwd.c:17:
../lib/librte_ethdev/rte_ethdev.h:2350:31: note: expected ‘const struct rte_eth_link *’ but argument is of type ‘int (*)(const char *, const char *)’
 2350 |    const struct rte_eth_link *eth_link);
      |    ~~~~~~~~~~~~~~~~~~~~~~~~~~~^~~~~~~~
cc1: all warnings being treated as errors
[2520/2589] Compiling C object 'examples/c590b3c@@dpdk-l3fwd-thread at exe/performance-thread_common_lthread_tls.c.o'.
[2521/2589] Compiling C object 'examples/c590b3c@@dpdk-l3fwd-thread at exe/performance-thread_common_lthread.c.o'.
[2522/2589] Compiling C object 'examples/c590b3c@@dpdk-pthread_shim at exe/performance-thread_common_lthread_diag.c.o'.
[2523/2589] Compiling C object 'examples/c590b3c@@dpdk-pthread_shim at exe/performance-thread_common_lthread.c.o'.
[2524/2589] Compiling C object 'examples/c590b3c@@dpdk-pthread_shim at exe/performance-thread_common_lthread_cond.c.o'.
[2525/2589] Compiling C object 'examples/c590b3c@@dpdk-pthread_shim at exe/performance-thread_common_lthread_mutex.c.o'.
[2526/2589] Compiling C object 'examples/c590b3c@@dpdk-qos_meter at exe/qos_meter_main.c.o'.
[2527/2589] Compiling C object 'examples/c590b3c@@dpdk-l3fwd-thread at exe/performance-thread_l3fwd-thread_main.c.o'.
[2528/2589] Compiling C object 'examples/c590b3c@@dpdk-packet_ordering at exe/packet_ordering_main.c.o'.
[2529/2589] Compiling C object 'drivers/a715181@@tmp_rte_pmd_octeontx2_event at sta/event_octeontx2_otx2_worker.c.o'.
[2530/2589] Compiling C object 'drivers/a715181@@tmp_rte_pmd_octeontx2_event at sta/event_octeontx2_otx2_worker_dual.c.o'.
ninja: build stopped: subcommand failed


DPDK STV team


More information about the test-report mailing list