[dpdk-test-report] |FAILURE| pw(73964) [v2, 7/7] net/qede: add VF FLR support

sys_stv at intel.com sys_stv at intel.com
Tue Jul 14 04:09:00 CEST 2020


Test-Label: Intel-compilation
Test-Status: FAILURE
http://dpdk.org/patch/73964

_Compilation issues_

Submitter: Manish Chopra <manishc at marvell.com>
Date: 2020-07-13 15:13:19
Reply_mail: 20200713151319.17547-8-manishc at marvell.com

DPDK git baseline: Repo:dpdk, CommitID: 466032ef8012a7fddd8dda986c5977e9341e3c35


Meson build Summary: 8 Builds Done, 2 Successful, 6 Failures, 0 Blocked

Makefile build Summary: 20 Builds Done, 18 Successful, 2 Failures, 0 Blocked

                +==============================================+===========+==========+
                |                   Makefile                   |   Meson   | Document |
+----------------+------+-------+------+------------+-----------+-----------+----------+
| os             | gcc  | clang | icc  | gcc+shared | gcc+debug | gcc/clang | pdf/html |
+----------------+------+-------+------+------------+-----------+-----------+----------+
| CENTOS82-64    | pass | pass  | pass | FAIL       | pass      | FAIL      |          |
| RHEL82-64      | pass |       |      |            |           |           |          |
| UB1804-64      | pass |       |      |            |           |           |          |
| FC32-64        | pass | pass  |      |            |           | FAIL      |          |
| CENTOS77-64    | pass |       |      |            |           |           |          |
| UB2004-64      | pass | pass  | pass |            |           | FAIL      | pass     |
| WIN10-64       |      |       |      |            |           | pass      |          |
| UB2004-32      | pass |       |      |            |           |           |          |
| UB1804-32      |      |       |      |            |           | FAIL      |          |
| FreeBSD1201-64 | pass | pass  |      | FAIL       | pass      | FAIL      |          |
| SUSE15-64      | pass | pass  |      |            |           | FAIL      |          |
+----------------+------+-------+------+------------+-----------+-----------+----------+
Test environment and configuration as below:

** Makefile build **


OS: CENTOS82-64
	Kernel Version: 4.18.0-193.el8.x86_64
	CPU info: Intel(R) Xeon(R) Platinum 8280M CPU @ 2.70GHz
	GCC Version: gcc (GCC) 8.3.1 20191121 (Red Hat 8.3.1-5)
	Clang Version: 9.0.1 (Red Hat 9.0.1-2.module_el8.2.0+309+0c7b6b03)
	x86_64-native-linuxapp-gcc
	x86_64-native-linuxapp-clang
	x86_64-native-linuxapp-icc
	x86_64-native-linuxapp-gcc+shared
	x86_64-native-linuxapp-gcc+debug


OS: RHEL82-64
	Kernel Version: 4.18.0-193.el8.x86_64
	CPU info: Intel(R) Xeon(R) Platinum 8280M CPU @ 2.70GHz
	GCC Version: gcc (GCC) 8.3.1 20191121 (Red Hat 8.3.1-5)
	Clang Version: 8.0.1 (Red Hat 8.0.1-1.module_el8.1.0+215+a01033fb)
	x86_64-native-linuxapp-gcc


OS: UB1804-64
	Kernel Version: 4.15.0-29-generic
	CPU info: Intel(R) Xeon(R) Platinum 8180 CPU @ 2.50GHz
	GCC Version: gcc (Ubuntu 7.5.0-3ubuntu1~18.04) 7.5.0
	Clang Version: 6.0.0-1ubuntu2 (tags/RELEASE_600/final)
	x86_64-native-linuxapp-gcc


OS: FC32-64
	Kernel Version: 5.6.0-0.rc7.git0.2.fc32.x86_64
	CPU info: Intel(R) Xeon(R) Platinum 8280M CPU @ 2.70GHz
	GCC Version: gcc (GCC) 10.0.1 20200311 (Red Hat 10.0.1-0.9)
	Clang Version: 10.0.0 (Fedora 10.0.0-0.3.rc4.fc32)
	x86_64-native-linuxapp-gcc
	x86_64-native-linuxapp-clang


OS: CENTOS77-64
	Kernel Version: 3.10.0-1062.9.1.el7.x86_64
	CPU info: Intel(R) Xeon(R) Platinum 8280M CPU @ 2.70GHz
	GCC Version: gcc (GCC) 4.8.5 20150623 (Red Hat 4.8.5-39)
	Clang Version: 3.4.2 (tags/RELEASE_34/dot2-final)
	x86_64-native-linuxapp-gcc


OS: UB2004-64
	Kernel Version: 5.4.0-26-generic
	CPU info: Intel(R) Xeon(R) Platinum 8180 CPU @ 2.50GHz
	GCC Version: gcc (Ubuntu 10-20200416-0ubuntu1) 10.0.1 20200416 (experimental) [master revision 3c3f12e2a76:dcee354ce56:44b326839d864fc10c459916abcc97f35a9ac3de]
	Clang Version: 10.0.0-4ubuntu1
	x86_64-native-linuxapp-clang
	x86_64-native-linuxapp-gcc
	x86_64-native-linuxapp-icc


OS: UB2004-32
	Kernel Version: 5.4.0-26-generic
	CPU info: Intel(R) Xeon(R) Platinum 8180 CPU @ 2.50GHz
	GCC Version: gcc (Ubuntu 9.3.0-10ubuntu2) 9.3.0
	Clang Version: 10.0.0-4ubuntu1
	i686-native-linuxapp-gcc


OS: FreeBSD1201-64
	Kernel Version: 12.1-RELEASE
	CPU info: Intel(R) Xeon(R) CPU E5-2699 v3 @ 2.30GHz (2294.74-MHz K8-class CPU)
	GCC Version: gcc (FreeBSD Ports Collection) 9.2.0
	Clang Version: 8.0.1 (tags/RELEASE_801/final 366581) (based on LLVM 8.0.1)
	x86_64-native-bsdapp-gcc
	x86_64-native-bsdapp-clang
	x86_64-native-bsdapp-gcc+shared
	x86_64-native-bsdapp-gcc+debug


OS: SUSE15-64
	Kernel Version: 4.12.14-lp150.11-default
	CPU info: Intel(R) Xeon(R) CPU E5-2699 v4 @ 2.20GHz
	GCC Version: gcc (SUSE Linux) 7.3.1 20180323 [gcc-7-branch revision 258812]
	Clang Version: 5.0.1 (tags/RELEASE_501/final 312548)
	x86_64-native-linuxapp-clang
	x86_64-native-linuxapp-gcc

** Meson build **


OS: CENTOS82-64
	Kernel Version: 4.18.0-193.el8.x86_64
	CPU info: Intel(R) Xeon(R) CPU E5-2699 v4 @ 2.20GHz
	GCC Version: gcc (GCC) 8.3.1 20191121 (Red Hat 8.3.1-5)
	Clang Version: 9.0.1 (Red Hat 9.0.1-2.module_el8.2.0+309+0c7b6b03)
	./build-gcc-static
	./build-gcc-shared
	./build-clang-static
	./build-clang-shared
	./build-x86-default


OS: UB2004-64
	Kernel Version: 5.4.0-26-generic
	CPU info: Intel(R) Xeon(R) Platinum 8180 CPU @ 2.50GHz
	GCC Version: gcc (Ubuntu 9.3.0-10ubuntu2) 9.3.0
	Clang Version: 10.0.0-4ubuntu1
	x86_64-native-linuxapp-doc
	./build-gcc-static
	./build-gcc-shared
	./build-clang-static
	./build-clang-shared
	./build-x86-default


OS: FC32-64
	Kernel Version: 5.6.0-0.rc7.git0.2.fc32.x86_64
	CPU info: Intel(R) Xeon(R) CPU E5-2699 v4 @ 2.20GHz
	GCC Version: gcc (GCC) 10.0.1 20200311 (Red Hat 10.0.1-0.9)
	Clang Version: 10.0.0 (Fedora 10.0.0-0.3.rc4.fc32)
	./build-gcc-static
	./build-gcc-shared
	./build-clang-static
	./build-clang-shared
	./build-x86-default


OS: WIN10-64
	Kernel Version: N/A
	CPU info: N/A
	GCC Version: N/A
	Clang Version: Clang 8.0.0
	x86_64-windows-clang


OS: UB1804-32
	Kernel Version: 4.15.0-20-generic
	CPU info: Intel(R) Xeon(R) CPU E5-2699 v4 @ 2.20GHz
	GCC Version: gcc (Ubuntu 7.5.0-3ubuntu1~18.04) 7.5.0
	Clang Version: 6.0.0-1ubuntu2 (tags/RELEASE_600/final)
	./build-gcc-static
	./build-gcc-shared
	./build-clang-static
	./build-clang-shared
	./build-x86-default


OS: FreeBSD1201-64
	Kernel Version: 12.1-RELEASE
	CPU info: Intel(R) Xeon(R) CPU E5-2699 v4 @ 2.20GHz (2194.97-MHz K8-class CPU)
	GCC Version: gcc (FreeBSD Ports Collection) 9.2.0
	Clang Version: 8.0.1 (tags/RELEASE_801/final 366581) (based on LLVM 8.0.1)
	./build-gcc-static
	./build-gcc-shared
	./build-clang-static
	./build-clang-shared
	./build-x86-default


OS: SUSE15-64
	Kernel Version: 4.12.14-lp150.12.82-default
	CPU info: Intel(R) Xeon(R) CPU E5-2699 v4 @ 2.20GHz
	GCC Version: gcc (SUSE Linux) 7.4.1 20190905 [gcc-7-branch revision 275407]
	Clang Version: 5.0.1 (tags/RELEASE_501/final 312548)
	./build-gcc-static
	./build-gcc-shared
	./build-clang-static
	./build-clang-shared
	./build-x86-default



*Meson Build Failed #1:
OS: CENTOS82-64
Target:./build-gcc-static
FAILED: drivers/librte_pmd_ice.so.20.0.3 
gcc  -o drivers/librte_pmd_ice.so.20.0.3 'drivers/a715181@@rte_pmd_ice at sha/meson-generated_.._rte_pmd_ice.pmd.c.o' 'drivers/net/ice/base/39545a2@@ice_base at sta/ice_controlq.c.o' 'drivers/net/ice/base/39545a2@@ice_base at sta/ice_common.c.o' 'drivers/net/ice/base/39545a2@@ice_base at sta/ice_sched.c.o' 'drivers/net/ice/base/39545a2@@ice_base at sta/ice_switch.c.o' 'drivers/net/ice/base/39545a2@@ice_base at sta/ice_nvm.c.o' 'drivers/net/ice/base/39545a2@@ice_base at sta/ice_flex_pipe.c.o' 'drivers/net/ice/base/39545a2@@ice_base at sta/ice_flow.c.o' 'drivers/net/ice/base/39545a2@@ice_base at sta/ice_dcb.c.o' 'drivers/net/ice/base/39545a2@@ice_base at sta/ice_fdir.c.o' 'drivers/net/ice/base/39545a2@@ice_base at sta/ice_acl.c.o' 'drivers/net/ice/base/39545a2@@ice_base at sta/ice_acl_ctrl.c.o' 'drivers/a715181@@tmp_rte_pmd_ice at sta/net_ice_ice_ethdev.c.o' 'drivers/a715181@@tmp_rte_pmd_ice at sta/net_ice_ice_rxtx.c.o' 'drivers/a715181@@tmp_rte_pmd_ice at sta/net_ice_ice_switch_filter.c.o' 'drivers/a715181@@tmp_rte_pmd_ice at sta/net_ice_ice_generic_flow.c.o' 'drivers/a715181@@tmp_rte_pmd_ice at sta/net_ice_ice_fdir_filter.c.o' 'drivers/a715181@@tmp_rte_pmd_ice at sta/net_ice_ice_hash.c.o' 'drivers/a715181@@tmp_rte_pmd_ice at sta/net_ice_ice_rxtx_vec_sse.c.o' 'drivers/a715181@@tmp_rte_pmd_ice at sta/net_ice_ice_rxtx_vec_avx2.c.o' 'drivers/a715181@@tmp_rte_pmd_ice at sta/net_ice_ice_dcf.c.o' 'drivers/a715181@@tmp_rte_pmd_ice at sta/net_ice_ice_dcf_ethdev.c.o' 'drivers/a715181@@tmp_rte_pmd_ice at sta/net_ice_ice_dcf_parent.c.o' -Wl,--as-needed -Wl,--no-undefined -shared -fPIC -Wl,--start-group -Wl,-soname,librte_pmd_ice.so.20.0 -Wl,--no-as-needed -pthread -lm -ldl -lnuma lib/librte_ethdev.so.20.0.3 lib/librte_eal.so.20.0.3 lib/librte_kvargs.so.20.0.3 lib/librte_telemetry.so.20.0.3 lib/librte_net.so.20.0.3 lib/librte_mbuf.so.20.0.3 lib/librte_mempool.so.20.0.3 lib/librte_ring.so.20.0.3 lib/librte_meter.so.20.0.3 drivers/librte_bus_pci.so.20.0.3 lib/librte_pci.so.20.0.3 drivers/librte_bus_vdev.so.20.0.3 lib/librte_hash.so.20.0.3 drivers/librte_common_iavf.so.20.0.3 -Wl,--end-group -Wl,--version-script=/root/CENTOS82-64_K4.18.0_GCC8.3.1/x86_64-native-linuxapp-gcc/ddb692a3986d4592a9da4779055a4b2c/dpdk/drivers/net/ice/rte_pmd_ice_version.map '-Wl,-rpath,$ORIGIN/../lib:$ORIGIN/' -Wl,-rpath-link,/root/CENTOS82-64_K4.18.0_GCC8.3.1/x86_64-native-linuxapp-gcc/ddb692a3986d4592a9da4779055a4b2c/dpdk/build-gcc-static/lib -Wl,-rpath-link,/root/CENTOS82-64_K4.18.0_GCC8.3.1/x86_64-native-linuxapp-gcc/ddb692a3986d4592a9da4779055a4b2c/dpdk/build-gcc-static/drivers
drivers/a715181@@tmp_rte_pmd_ice at sta/net_ice_ice_ethdev.c.o: In function `ice_pkg_file_search_path':
/root/CENTOS82-64_K4.18.0_GCC8.3.1/x86_64-native-linuxapp-gcc/ddb692a3986d4592a9da4779055a4b2c/dpdk/build-gcc-static/../drivers/net/ice/ice_ethdev.c:1747: undefined reference to `rte_pci_find_next_ext_capability'
collect2: error: ld returned 1 exit status
[1310/2390] Generating rte_pmd_liquidio_mingw with a custom command.
[1311/2390] Generating rte_pmd_liquidio_def with a custom command.
[1312/2390] Generating rte_pmd_igc.sym_chk with a meson_exe.py custom command.
[1313/2390] Compiling C object 'drivers/a715181@@tmp_rte_pmd_liquidio at sta/net_liquidio_base_lio_23xx_vf.c.o'.
[1314/2390] Compiling C object 'drivers/a715181@@tmp_rte_pmd_kni at sta/net_kni_rte_eth_kni.c.o'.
[1315/2390] Compiling C object 'drivers/a715181@@tmp_rte_pmd_liquidio at sta/net_liquidio_base_lio_mbox.c.o'.
[1316/2390] Compiling C object 'drivers/a715181@@tmp_rte_pmd_liquidio at sta/net_liquidio_lio_ethdev.c.o'.
[1317/2390] Compiling C object 'drivers/a715181@@tmp_rte_pmd_ixgbe at sta/net_ixgbe_ixgbe_rxtx_vec_sse.c.o'.
[1318/2390] Compiling C object 'drivers/a715181@@tmp_rte_pmd_liquidio at sta/net_liquidio_lio_rxtx.c.o'.
[1319/2390] Compiling C object 'drivers/a715181@@tmp_rte_pmd_ixgbe at sta/net_ixgbe_ixgbe_ethdev.c.o'.
[1320/2390] Compiling C object 'drivers/a715181@@tmp_rte_pmd_ixgbe at sta/net_ixgbe_ixgbe_rxtx.c.o'.
ninja: build stopped: subcommand failed




*Meson Build Failed #2:
OS: FC32-64
Target:./build-gcc-static
FAILED: drivers/librte_pmd_ice.so.20.0.3 
gcc  -o drivers/librte_pmd_ice.so.20.0.3 'drivers/a715181@@rte_pmd_ice at sha/meson-generated_.._rte_pmd_ice.pmd.c.o' 'drivers/net/ice/base/39545a2@@ice_base at sta/ice_controlq.c.o' 'drivers/net/ice/base/39545a2@@ice_base at sta/ice_common.c.o' 'drivers/net/ice/base/39545a2@@ice_base at sta/ice_sched.c.o' 'drivers/net/ice/base/39545a2@@ice_base at sta/ice_switch.c.o' 'drivers/net/ice/base/39545a2@@ice_base at sta/ice_nvm.c.o' 'drivers/net/ice/base/39545a2@@ice_base at sta/ice_flex_pipe.c.o' 'drivers/net/ice/base/39545a2@@ice_base at sta/ice_flow.c.o' 'drivers/net/ice/base/39545a2@@ice_base at sta/ice_dcb.c.o' 'drivers/net/ice/base/39545a2@@ice_base at sta/ice_fdir.c.o' 'drivers/net/ice/base/39545a2@@ice_base at sta/ice_acl.c.o' 'drivers/net/ice/base/39545a2@@ice_base at sta/ice_acl_ctrl.c.o' 'drivers/a715181@@tmp_rte_pmd_ice at sta/net_ice_ice_ethdev.c.o' 'drivers/a715181@@tmp_rte_pmd_ice at sta/net_ice_ice_rxtx.c.o' 'drivers/a715181@@tmp_rte_pmd_ice at sta/net_ice_ice_switch_filter.c.o' 'drivers/a715181@@tmp_rte_pmd_ice at sta/net_ice_ice_generic_flow.c.o' 'drivers/a715181@@tmp_rte_pmd_ice at sta/net_ice_ice_fdir_filter.c.o' 'drivers/a715181@@tmp_rte_pmd_ice at sta/net_ice_ice_hash.c.o' 'drivers/a715181@@tmp_rte_pmd_ice at sta/net_ice_ice_rxtx_vec_sse.c.o' 'drivers/a715181@@tmp_rte_pmd_ice at sta/net_ice_ice_rxtx_vec_avx2.c.o' 'drivers/a715181@@tmp_rte_pmd_ice at sta/net_ice_ice_dcf.c.o' 'drivers/a715181@@tmp_rte_pmd_ice at sta/net_ice_ice_dcf_ethdev.c.o' 'drivers/a715181@@tmp_rte_pmd_ice at sta/net_ice_ice_dcf_parent.c.o' -Wl,--as-needed -Wl,--no-undefined -shared -fPIC -Wl,--start-group -Wl,-soname,librte_pmd_ice.so.20.0 -Wl,--no-as-needed -pthread -lm -ldl -lnuma lib/librte_ethdev.so.20.0.3 lib/librte_eal.so.20.0.3 lib/librte_kvargs.so.20.0.3 lib/librte_telemetry.so.20.0.3 lib/librte_net.so.20.0.3 lib/librte_mbuf.so.20.0.3 lib/librte_mempool.so.20.0.3 lib/librte_ring.so.20.0.3 lib/librte_meter.so.20.0.3 drivers/librte_bus_pci.so.20.0.3 lib/librte_pci.so.20.0.3 drivers/librte_bus_vdev.so.20.0.3 lib/librte_hash.so.20.0.3 drivers/librte_common_iavf.so.20.0.3 -Wl,--end-group -Wl,--version-script=/root/FC32-64_K5.6.0_GCC10.0.1/x86_64-native-linuxapp-gcc/ddb692a3986d4592a9da4779055a4b2c/dpdk/drivers/net/ice/rte_pmd_ice_version.map '-Wl,-rpath,$ORIGIN/../lib:$ORIGIN/' -Wl,-rpath-link,/root/FC32-64_K5.6.0_GCC10.0.1/x86_64-native-linuxapp-gcc/ddb692a3986d4592a9da4779055a4b2c/dpdk/build-gcc-static/lib -Wl,-rpath-link,/root/FC32-64_K5.6.0_GCC10.0.1/x86_64-native-linuxapp-gcc/ddb692a3986d4592a9da4779055a4b2c/dpdk/build-gcc-static/drivers
/usr/bin/ld: drivers/a715181@@tmp_rte_pmd_ice at sta/net_ice_ice_ethdev.c.o: in function `ice_pkg_file_search_path':
/root/FC32-64_K5.6.0_GCC10.0.1/x86_64-native-linuxapp-gcc/ddb692a3986d4592a9da4779055a4b2c/dpdk/build-gcc-static/../drivers/net/ice/ice_ethdev.c:1747: undefined reference to `rte_pci_find_next_ext_capability'
collect2: error: ld returned 1 exit status
[1287/2391] Compiling C object 'drivers/net/ixgbe/base/a7935d9@@ixgbe_base at sta/ixgbe_phy.c.o'.
[1288/2391] Compiling C object 'drivers/a715181@@tmp_rte_pmd_igc at sta/net_igc_igc_txrx.c.o'.
[1289/2391] Compiling C object 'drivers/a715181@@tmp_rte_pmd_ixgbe at sta/net_ixgbe_ixgbe_bypass.c.o'.
[1290/2391] Compiling C object 'drivers/net/ixgbe/base/a7935d9@@ixgbe_base at sta/ixgbe_common.c.o'.
[1291/2391] Compiling C object 'drivers/net/ixgbe/base/a7935d9@@ixgbe_base at sta/ixgbe_x550.c.o'.
[1292/2391] Compiling C object 'drivers/a715181@@tmp_rte_pmd_ixgbe at sta/net_ixgbe_ixgbe_pf.c.o'.
[1293/2391] Compiling C object 'drivers/a715181@@tmp_rte_pmd_ixgbe at sta/net_ixgbe_ixgbe_fdir.c.o'.
[1294/2391] Compiling C object 'drivers/a715181@@tmp_rte_pmd_ixgbe at sta/net_ixgbe_ixgbe_ipsec.c.o'.
[1295/2391] Compiling C object 'drivers/a715181@@tmp_rte_pmd_ixgbe at sta/net_ixgbe_ixgbe_flow.c.o'.
[1296/2391] Compiling C object 'drivers/a715181@@tmp_rte_pmd_ixgbe at sta/net_ixgbe_ixgbe_ethdev.c.o'.
[1297/2391] Compiling C object 'drivers/a715181@@tmp_rte_pmd_ixgbe at sta/net_ixgbe_ixgbe_rxtx.c.o'.
ninja: build stopped: subcommand failed




*Meson Build Failed #3:
OS: FreeBSD1201-64
Target:./build-gcc-static
FAILED: drivers/librte_pmd_ice.so.20.0.3 
gcc  -o drivers/librte_pmd_ice.so.20.0.3 'drivers/a715181@@rte_pmd_ice at sha/meson-generated_.._rte_pmd_ice.pmd.c.o' 'drivers/net/ice/base/39545a2@@ice_base at sta/ice_controlq.c.o' 'drivers/net/ice/base/39545a2@@ice_base at sta/ice_common.c.o' 'drivers/net/ice/base/39545a2@@ice_base at sta/ice_sched.c.o' 'drivers/net/ice/base/39545a2@@ice_base at sta/ice_switch.c.o' 'drivers/net/ice/base/39545a2@@ice_base at sta/ice_nvm.c.o' 'drivers/net/ice/base/39545a2@@ice_base at sta/ice_flex_pipe.c.o' 'drivers/net/ice/base/39545a2@@ice_base at sta/ice_flow.c.o' 'drivers/net/ice/base/39545a2@@ice_base at sta/ice_dcb.c.o' 'drivers/net/ice/base/39545a2@@ice_base at sta/ice_fdir.c.o' 'drivers/net/ice/base/39545a2@@ice_base at sta/ice_acl.c.o' 'drivers/net/ice/base/39545a2@@ice_base at sta/ice_acl_ctrl.c.o' 'drivers/a715181@@tmp_rte_pmd_ice at sta/net_ice_ice_ethdev.c.o' 'drivers/a715181@@tmp_rte_pmd_ice at sta/net_ice_ice_rxtx.c.o' 'drivers/a715181@@tmp_rte_pmd_ice at sta/net_ice_ice_switch_filter.c.o' 'drivers/a715181@@tmp_rte_pmd_ice at sta/net_ice_ice_generic_flow.c.o' 'drivers/a715181@@tmp_rte_pmd_ice at sta/net_ice_ice_fdir_filter.c.o' 'drivers/a715181@@tmp_rte_pmd_ice at sta/net_ice_ice_hash.c.o' 'drivers/a715181@@tmp_rte_pmd_ice at sta/net_ice_ice_rxtx_vec_sse.c.o' 'drivers/a715181@@tmp_rte_pmd_ice at sta/net_ice_ice_rxtx_vec_avx2.c.o' 'drivers/a715181@@tmp_rte_pmd_ice at sta/net_ice_ice_dcf.c.o' 'drivers/a715181@@tmp_rte_pmd_ice at sta/net_ice_ice_dcf_ethdev.c.o' 'drivers/a715181@@tmp_rte_pmd_ice at sta/net_ice_ice_dcf_parent.c.o' -Wl,--as-needed -Wl,--no-undefined -shared -fPIC -Wl,--start-group -Wl,-soname,librte_pmd_ice.so.20.0 -Wl,--no-as-needed -pthread -lm -lexecinfo lib/librte_ethdev.so.20.0.3 lib/librte_eal.so.20.0.3 lib/librte_kvargs.so.20.0.3 lib/librte_telemetry.so.20.0.3 lib/librte_net.so.20.0.3 lib/librte_mbuf.so.20.0.3 lib/librte_mempool.so.20.0.3 lib/librte_ring.so.20.0.3 lib/librte_meter.so.20.0.3 drivers/librte_bus_pci.so.20.0.3 lib/librte_pci.so.20.0.3 drivers/librte_bus_vdev.so.20.0.3 lib/librte_hash.so.20.0.3 drivers/librte_common_iavf.so.20.0.3 -Wl,--end-group -Wl,--version-script=/root/FreeBSD1201-64_K12.1_GCC9.2.0/x86_64-native-bsdapp-gcc/ddb692a3986d4592a9da4779055a4b2c/dpdk/drivers/net/ice/rte_pmd_ice_version.map '-Wl,-rpath,$ORIGIN/../lib:$ORIGIN/' -Wl,-rpath-link,/root/FreeBSD1201-64_K12.1_GCC9.2.0/x86_64-native-bsdapp-gcc/ddb692a3986d4592a9da4779055a4b2c/dpdk/build-gcc-static/lib -Wl,-rpath-link,/root/FreeBSD1201-64_K12.1_GCC9.2.0/x86_64-native-bsdapp-gcc/ddb692a3986d4592a9da4779055a4b2c/dpdk/build-gcc-static/drivers
/usr/local/bin/ld: drivers/a715181@@tmp_rte_pmd_ice at sta/net_ice_ice_ethdev.c.o: in function `ice_pkg_file_search_path':
/root/FreeBSD1201-64_K12.1_GCC9.2.0/x86_64-native-bsdapp-gcc/ddb692a3986d4592a9da4779055a4b2c/dpdk/build-gcc-static/../drivers/net/ice/ice_ethdev.c:1747: undefined reference to `rte_pci_find_next_ext_capability'
collect2: error: ld returned 1 exit status
[1050/1777] Compiling C object 'drivers/net/octeontx/base/ccb1678@@octeontx_base at sta/octeontx_pkivf.c.o'
[1051/1777] Compiling C object 'drivers/net/octeontx/base/ccb1678@@octeontx_base at sta/octeontx_pkovf.c.o'
[1052/1777] Generating rte_pmd_igc.sym_chk with a meson_exe.py custom command
[1053/1777] Compiling C object 'drivers/a715181@@tmp_rte_pmd_liquidio at sta/net_liquidio_lio_ethdev.c.o'
[1054/1777] Compiling C object 'drivers/a715181@@tmp_rte_pmd_ixgbe at sta/net_ixgbe_ixgbe_rxtx_vec_sse.c.o'
[1055/1777] Compiling C object 'drivers/a715181@@tmp_rte_pmd_null at sta/net_null_rte_eth_null.c.o'
[1056/1777] Compiling C object 'drivers/a715181@@tmp_rte_pmd_liquidio at sta/net_liquidio_lio_rxtx.c.o'
[1057/1777] Compiling C object 'drivers/a715181@@tmp_rte_pmd_ixgbe at sta/net_ixgbe_ixgbe_ethdev.c.o'
[1058/1777] Compiling C object 'drivers/a715181@@tmp_rte_pmd_ixgbe at sta/net_ixgbe_ixgbe_rxtx.c.o'
ninja: build stopped: subcommand failed




*Meson Build Failed #4:
OS: SUSE15-64
Target:./build-gcc-static
FAILED: drivers/librte_pmd_ice.so.20.0.3 
gcc  -o drivers/librte_pmd_ice.so.20.0.3 'drivers/a715181@@rte_pmd_ice at sha/meson-generated_.._rte_pmd_ice.pmd.c.o' 'drivers/net/ice/base/39545a2@@ice_base at sta/ice_controlq.c.o' 'drivers/net/ice/base/39545a2@@ice_base at sta/ice_common.c.o' 'drivers/net/ice/base/39545a2@@ice_base at sta/ice_sched.c.o' 'drivers/net/ice/base/39545a2@@ice_base at sta/ice_switch.c.o' 'drivers/net/ice/base/39545a2@@ice_base at sta/ice_nvm.c.o' 'drivers/net/ice/base/39545a2@@ice_base at sta/ice_flex_pipe.c.o' 'drivers/net/ice/base/39545a2@@ice_base at sta/ice_flow.c.o' 'drivers/net/ice/base/39545a2@@ice_base at sta/ice_dcb.c.o' 'drivers/net/ice/base/39545a2@@ice_base at sta/ice_fdir.c.o' 'drivers/net/ice/base/39545a2@@ice_base at sta/ice_acl.c.o' 'drivers/net/ice/base/39545a2@@ice_base at sta/ice_acl_ctrl.c.o' 'drivers/a715181@@tmp_rte_pmd_ice at sta/net_ice_ice_ethdev.c.o' 'drivers/a715181@@tmp_rte_pmd_ice at sta/net_ice_ice_rxtx.c.o' 'drivers/a715181@@tmp_rte_pmd_ice at sta/net_ice_ice_switch_filter.c.o' 'drivers/a715181@@tmp_rte_pmd_ice at sta/net_ice_ice_generic_flow.c.o' 'drivers/a715181@@tmp_rte_pmd_ice at sta/net_ice_ice_fdir_filter.c.o' 'drivers/a715181@@tmp_rte_pmd_ice at sta/net_ice_ice_hash.c.o' 'drivers/a715181@@tmp_rte_pmd_ice at sta/net_ice_ice_rxtx_vec_sse.c.o' 'drivers/a715181@@tmp_rte_pmd_ice at sta/net_ice_ice_rxtx_vec_avx2.c.o' 'drivers/a715181@@tmp_rte_pmd_ice at sta/net_ice_ice_dcf.c.o' 'drivers/a715181@@tmp_rte_pmd_ice at sta/net_ice_ice_dcf_ethdev.c.o' 'drivers/a715181@@tmp_rte_pmd_ice at sta/net_ice_ice_dcf_parent.c.o' -Wl,--no-undefined -Wl,--as-needed -shared -fPIC -Wl,--start-group -Wl,-soname,librte_pmd_ice.so.20.0 -Wl,--no-as-needed -pthread -lm -ldl -lnuma lib/librte_ethdev.so.20.0.3 lib/librte_eal.so.20.0.3 lib/librte_kvargs.so.20.0.3 lib/librte_telemetry.so.20.0.3 lib/librte_net.so.20.0.3 lib/librte_mbuf.so.20.0.3 lib/librte_mempool.so.20.0.3 lib/librte_ring.so.20.0.3 lib/librte_meter.so.20.0.3 drivers/librte_bus_pci.so.20.0.3 lib/librte_pci.so.20.0.3 drivers/librte_bus_vdev.so.20.0.3 lib/librte_hash.so.20.0.3 drivers/librte_common_iavf.so.20.0.3 -Wl,--end-group -Wl,--version-script=/root/SUSE15-64_K4.12.14_GCC7.3.1/x86_64-native-linuxapp-gcc/ddb692a3986d4592a9da4779055a4b2c/dpdk/drivers/net/ice/rte_pmd_ice_version.map '-Wl,-rpath,$ORIGIN/../lib:$ORIGIN/' -Wl,-rpath-link,/root/SUSE15-64_K4.12.14_GCC7.3.1/x86_64-native-linuxapp-gcc/ddb692a3986d4592a9da4779055a4b2c/dpdk/build-gcc-static/lib:/root/SUSE15-64_K4.12.14_GCC7.3.1/x86_64-native-linuxapp-gcc/ddb692a3986d4592a9da4779055a4b2c/dpdk/build-gcc-static/drivers 
/usr/lib64/gcc/x86_64-suse-linux/7/../../../../x86_64-suse-linux/bin/ld: drivers/a715181@@tmp_rte_pmd_ice at sta/net_ice_ice_ethdev.c.o: in function `ice_pkg_file_search_path':
/root/SUSE15-64_K4.12.14_GCC7.3.1/x86_64-native-linuxapp-gcc/ddb692a3986d4592a9da4779055a4b2c/dpdk/build-gcc-static/../drivers/net/ice/ice_ethdev.c:1747: undefined reference to `rte_pci_find_next_ext_capability'
collect2: error: ld returned 1 exit status
[1295/2285] Compiling C object 'drivers/a715181@@tmp_rte_pmd_ixgbe at sta/net_ixgbe_ixgbe_flow.c.o'.
[1296/2285] Linking target drivers/librte_pmd_igc.so.20.0.3.
[1297/2285] Compiling C object 'drivers/a715181@@tmp_rte_pmd_kni at sta/net_kni_rte_eth_kni.c.o'.
[1298/2285] Compiling C object 'drivers/a715181@@tmp_rte_pmd_ixgbe at sta/net_ixgbe_rte_pmd_ixgbe.c.o'.
[1299/2285] Compiling C object 'drivers/a715181@@tmp_rte_pmd_liquidio at sta/net_liquidio_base_lio_mbox.c.o'.
[1300/2285] Compiling C object 'drivers/a715181@@tmp_rte_pmd_liquidio at sta/net_liquidio_base_lio_23xx_vf.c.o'.
[1301/2285] Compiling C object 'drivers/a715181@@tmp_rte_pmd_ixgbe at sta/net_ixgbe_ixgbe_rxtx_vec_sse.c.o'.
[1302/2285] Compiling C object 'drivers/a715181@@tmp_rte_pmd_ixgbe at sta/net_ixgbe_ixgbe_ethdev.c.o'.
[1303/2285] Compiling C object 'drivers/a715181@@tmp_rte_pmd_ixgbe at sta/net_ixgbe_ixgbe_rxtx.c.o'.
ninja: build stopped: subcommand failed




*Meson Build Failed #5:
OS: UB1804-32
Target:./build-gcc-static
FAILED: drivers/librte_pmd_ice.so.20.0.3 
gcc  -o drivers/librte_pmd_ice.so.20.0.3 'drivers/a715181@@rte_pmd_ice at sha/meson-generated_.._rte_pmd_ice.pmd.c.o' 'drivers/net/ice/base/39545a2@@ice_base at sta/ice_controlq.c.o' 'drivers/net/ice/base/39545a2@@ice_base at sta/ice_common.c.o' 'drivers/net/ice/base/39545a2@@ice_base at sta/ice_sched.c.o' 'drivers/net/ice/base/39545a2@@ice_base at sta/ice_switch.c.o' 'drivers/net/ice/base/39545a2@@ice_base at sta/ice_nvm.c.o' 'drivers/net/ice/base/39545a2@@ice_base at sta/ice_flex_pipe.c.o' 'drivers/net/ice/base/39545a2@@ice_base at sta/ice_flow.c.o' 'drivers/net/ice/base/39545a2@@ice_base at sta/ice_dcb.c.o' 'drivers/net/ice/base/39545a2@@ice_base at sta/ice_fdir.c.o' 'drivers/net/ice/base/39545a2@@ice_base at sta/ice_acl.c.o' 'drivers/net/ice/base/39545a2@@ice_base at sta/ice_acl_ctrl.c.o' 'drivers/a715181@@tmp_rte_pmd_ice at sta/net_ice_ice_ethdev.c.o' 'drivers/a715181@@tmp_rte_pmd_ice at sta/net_ice_ice_rxtx.c.o' 'drivers/a715181@@tmp_rte_pmd_ice at sta/net_ice_ice_switch_filter.c.o' 'drivers/a715181@@tmp_rte_pmd_ice at sta/net_ice_ice_generic_flow.c.o' 'drivers/a715181@@tmp_rte_pmd_ice at sta/net_ice_ice_fdir_filter.c.o' 'drivers/a715181@@tmp_rte_pmd_ice at sta/net_ice_ice_hash.c.o' 'drivers/a715181@@tmp_rte_pmd_ice at sta/net_ice_ice_rxtx_vec_sse.c.o' 'drivers/a715181@@tmp_rte_pmd_ice at sta/net_ice_ice_rxtx_vec_avx2.c.o' 'drivers/a715181@@tmp_rte_pmd_ice at sta/net_ice_ice_dcf.c.o' 'drivers/a715181@@tmp_rte_pmd_ice at sta/net_ice_ice_dcf_ethdev.c.o' 'drivers/a715181@@tmp_rte_pmd_ice at sta/net_ice_ice_dcf_parent.c.o' -Wl,--no-undefined -Wl,--as-needed -shared -fPIC -Wl,--start-group -Wl,-soname,librte_pmd_ice.so.20.0 -Wl,--no-as-needed -pthread -lm -ldl -lnuma -m32 lib/librte_ethdev.so.20.0.3 lib/librte_eal.so.20.0.3 lib/librte_kvargs.so.20.0.3 lib/librte_telemetry.so.20.0.3 lib/librte_net.so.20.0.3 lib/librte_mbuf.so.20.0.3 lib/librte_mempool.so.20.0.3 lib/librte_ring.so.20.0.3 lib/librte_meter.so.20.0.3 drivers/librte_bus_pci.so.20.0.3 lib/librte_pci.so.20.0.3 drivers/librte_bus_vdev.so.20.0.3 lib/librte_hash.so.20.0.3 drivers/librte_common_iavf.so.20.0.3 -Wl,--end-group -Wl,--version-script=/root/UB1804-32_K4.15.0_GCC7.3.0/i686-native-linuxapp-gcc/ddb692a3986d4592a9da4779055a4b2c/dpdk/drivers/net/ice/rte_pmd_ice_version.map '-Wl,-rpath,$ORIGIN/../lib:$ORIGIN/' -Wl,-rpath-link,/root/UB1804-32_K4.15.0_GCC7.3.0/i686-native-linuxapp-gcc/ddb692a3986d4592a9da4779055a4b2c/dpdk/build-gcc-static/lib:/root/UB1804-32_K4.15.0_GCC7.3.0/i686-native-linuxapp-gcc/ddb692a3986d4592a9da4779055a4b2c/dpdk/build-gcc-static/drivers 
/usr/local/bin/ld: drivers/a715181@@tmp_rte_pmd_ice at sta/net_ice_ice_ethdev.c.o: in function `ice_pkg_file_search_path':
/root/UB1804-32_K4.15.0_GCC7.3.0/i686-native-linuxapp-gcc/ddb692a3986d4592a9da4779055a4b2c/dpdk/build-gcc-static/../drivers/net/ice/ice_ethdev.c:1747: undefined reference to `rte_pci_find_next_ext_capability'
collect2: error: ld returned 1 exit status
[1237/2131] Compiling C object 'drivers/a715181@@tmp_rte_pmd_ixgbe at sta/net_ixgbe_ixgbe_vf_representor.c.o'.
[1238/2131] Compiling C object 'drivers/a715181@@tmp_rte_pmd_ixgbe at sta/net_ixgbe_ixgbe_tm.c.o'.
[1239/2131] Generating rte_pmd_igc.sym_chk with a meson_exe.py custom command.
[1240/2131] Compiling C object 'drivers/a715181@@tmp_rte_pmd_liquidio at sta/net_liquidio_base_lio_mbox.c.o'.
[1241/2131] Compiling C object 'drivers/a715181@@tmp_rte_pmd_ixgbe at sta/net_ixgbe_rte_pmd_ixgbe.c.o'.
[1242/2131] Compiling C object 'drivers/a715181@@tmp_rte_pmd_ixgbe at sta/net_ixgbe_ixgbe_flow.c.o'.
[1243/2131] Compiling C object 'drivers/a715181@@tmp_rte_pmd_liquidio at sta/net_liquidio_base_lio_23xx_vf.c.o'.
[1244/2131] Compiling C object 'drivers/a715181@@tmp_rte_pmd_ixgbe at sta/net_ixgbe_ixgbe_rxtx_vec_sse.c.o'.
[1245/2131] Compiling C object 'drivers/a715181@@tmp_rte_pmd_liquidio at sta/net_liquidio_lio_rxtx.c.o'.
[1246/2131] Compiling C object 'drivers/a715181@@tmp_rte_pmd_ixgbe at sta/net_ixgbe_ixgbe_ethdev.c.o'.
[1247/2131] Compiling C object 'drivers/a715181@@tmp_rte_pmd_ixgbe at sta/net_ixgbe_ixgbe_rxtx.c.o'.
ninja: build stopped: subcommand failed




*Meson Build Failed #6:
OS: UB2004-64
Target:./build-gcc-static
FAILED: drivers/librte_pmd_ice.so.20.0.3 
gcc  -o drivers/librte_pmd_ice.so.20.0.3 'drivers/a715181@@rte_pmd_ice at sha/meson-generated_.._rte_pmd_ice.pmd.c.o' 'drivers/net/ice/base/39545a2@@ice_base at sta/ice_controlq.c.o' 'drivers/net/ice/base/39545a2@@ice_base at sta/ice_common.c.o' 'drivers/net/ice/base/39545a2@@ice_base at sta/ice_sched.c.o' 'drivers/net/ice/base/39545a2@@ice_base at sta/ice_switch.c.o' 'drivers/net/ice/base/39545a2@@ice_base at sta/ice_nvm.c.o' 'drivers/net/ice/base/39545a2@@ice_base at sta/ice_flex_pipe.c.o' 'drivers/net/ice/base/39545a2@@ice_base at sta/ice_flow.c.o' 'drivers/net/ice/base/39545a2@@ice_base at sta/ice_dcb.c.o' 'drivers/net/ice/base/39545a2@@ice_base at sta/ice_fdir.c.o' 'drivers/net/ice/base/39545a2@@ice_base at sta/ice_acl.c.o' 'drivers/net/ice/base/39545a2@@ice_base at sta/ice_acl_ctrl.c.o' 'drivers/a715181@@tmp_rte_pmd_ice at sta/net_ice_ice_ethdev.c.o' 'drivers/a715181@@tmp_rte_pmd_ice at sta/net_ice_ice_rxtx.c.o' 'drivers/a715181@@tmp_rte_pmd_ice at sta/net_ice_ice_switch_filter.c.o' 'drivers/a715181@@tmp_rte_pmd_ice at sta/net_ice_ice_generic_flow.c.o' 'drivers/a715181@@tmp_rte_pmd_ice at sta/net_ice_ice_fdir_filter.c.o' 'drivers/a715181@@tmp_rte_pmd_ice at sta/net_ice_ice_hash.c.o' 'drivers/a715181@@tmp_rte_pmd_ice at sta/net_ice_ice_rxtx_vec_sse.c.o' 'drivers/a715181@@tmp_rte_pmd_ice at sta/net_ice_ice_rxtx_vec_avx2.c.o' 'drivers/a715181@@tmp_rte_pmd_ice at sta/net_ice_ice_dcf.c.o' 'drivers/a715181@@tmp_rte_pmd_ice at sta/net_ice_ice_dcf_ethdev.c.o' 'drivers/a715181@@tmp_rte_pmd_ice at sta/net_ice_ice_dcf_parent.c.o' -Wl,--as-needed -Wl,--no-undefined -shared -fPIC -Wl,--start-group -Wl,-soname,librte_pmd_ice.so.20.0 -Wl,--no-as-needed -pthread -lm -ldl -lnuma lib/librte_ethdev.so.20.0.3 lib/librte_eal.so.20.0.3 lib/librte_kvargs.so.20.0.3 lib/librte_telemetry.so.20.0.3 lib/librte_net.so.20.0.3 lib/librte_mbuf.so.20.0.3 lib/librte_mempool.so.20.0.3 lib/librte_ring.so.20.0.3 lib/librte_meter.so.20.0.3 drivers/librte_bus_pci.so.20.0.3 lib/librte_pci.so.20.0.3 drivers/librte_bus_vdev.so.20.0.3 lib/librte_hash.so.20.0.3 drivers/librte_common_iavf.so.20.0.3 -Wl,--end-group -Wl,--version-script=/root/UB2004-64_K5.4.0_GCC9.3.0/x86_64-native-linuxapp-gcc/ddb692a3986d4592a9da4779055a4b2c/dpdk/drivers/net/ice/rte_pmd_ice_version.map '-Wl,-rpath,$ORIGIN/../lib:$ORIGIN/' -Wl,-rpath-link,/root/UB2004-64_K5.4.0_GCC9.3.0/x86_64-native-linuxapp-gcc/ddb692a3986d4592a9da4779055a4b2c/dpdk/build-gcc-static/lib -Wl,-rpath-link,/root/UB2004-64_K5.4.0_GCC9.3.0/x86_64-native-linuxapp-gcc/ddb692a3986d4592a9da4779055a4b2c/dpdk/build-gcc-static/drivers
/usr/bin/ld: drivers/a715181@@tmp_rte_pmd_ice at sta/net_ice_ice_ethdev.c.o: in function `ice_pkg_file_search_path':
/root/UB2004-64_K5.4.0_GCC9.3.0/x86_64-native-linuxapp-gcc/ddb692a3986d4592a9da4779055a4b2c/dpdk/build-gcc-static/../drivers/net/ice/ice_ethdev.c:1747: undefined reference to `rte_pci_find_next_ext_capability'
collect2: error: ld returned 1 exit status
[1298/2381] Compiling C object 'drivers/a715181@@tmp_rte_pmd_ixgbe at sta/net_ixgbe_ixgbe_tm.c.o'.
[1299/2381] Compiling C object 'drivers/a715181@@tmp_rte_pmd_ixgbe at sta/net_ixgbe_ixgbe_flow.c.o'.
[1300/2381] Generating rte_pmd_igc.sym_chk with a meson_exe.py custom command.
[1301/2381] Compiling C object 'drivers/a715181@@tmp_rte_pmd_kni at sta/net_kni_rte_eth_kni.c.o'.
[1302/2381] Compiling C object 'drivers/a715181@@tmp_rte_pmd_liquidio at sta/net_liquidio_base_lio_23xx_vf.c.o'.
[1303/2381] Compiling C object 'drivers/a715181@@tmp_rte_pmd_ixgbe at sta/net_ixgbe_rte_pmd_ixgbe.c.o'.
[1304/2381] Compiling C object 'drivers/a715181@@tmp_rte_pmd_liquidio at sta/net_liquidio_base_lio_mbox.c.o'.
[1305/2381] Compiling C object 'drivers/a715181@@tmp_rte_pmd_liquidio at sta/net_liquidio_lio_ethdev.c.o'.
[1306/2381] Compiling C object 'drivers/a715181@@tmp_rte_pmd_ixgbe at sta/net_ixgbe_ixgbe_rxtx_vec_sse.c.o'.
[1307/2381] Compiling C object 'drivers/a715181@@tmp_rte_pmd_ixgbe at sta/net_ixgbe_ixgbe_ethdev.c.o'.
[1308/2381] Compiling C object 'drivers/a715181@@tmp_rte_pmd_ixgbe at sta/net_ixgbe_ixgbe_rxtx.c.o'.
ninja: build stopped: subcommand failed



*Makefile Build Failed #1:
OS: CENTOS82-64
Target: x86_64-native-linuxapp-gcc+shared
  CC rte_pmd_i40e.o
ice_ethdev.o: In function `ice_load_pkg.isra.26':
ice_ethdev.c:(.text+0x5df5): undefined reference to `rte_pci_find_next_ext_capability'
collect2: error: ld returned 1 exit status
make[6]: *** [/root/CENTOS82-64_K4.18.0_GCC8.3.1/x86_64-native-linuxapp-gcc+shared/ddb692a3986d4592a9da4779055a4b2c/dpdk/mk/rte.lib.mk:95: librte_pmd_ice.so.20.0.3] Error 1
make[5]: *** [/root/CENTOS82-64_K4.18.0_GCC8.3.1/x86_64-native-linuxapp-gcc+shared/ddb692a3986d4592a9da4779055a4b2c/dpdk/mk/rte.subdir.mk:37: ice] Error 2
make[5]: *** Waiting for unfinished jobs....
  CC memif_socket.o
  CC i40e_tm.o
--
  LD librte_pmd_nfp.so.20.0.3
nfp_cpp_pcie_ops.o: In function `nfp6000_init':
nfp_cpp_pcie_ops.c:(.text+0x7c2): undefined reference to `rte_pci_find_next_ext_capability'
collect2: error: ld returned 1 exit status
make[6]: *** [/root/CENTOS82-64_K4.18.0_GCC8.3.1/x86_64-native-linuxapp-gcc+shared/ddb692a3986d4592a9da4779055a4b2c/dpdk/mk/rte.lib.mk:95: librte_pmd_nfp.so.20.0.3] Error 1
make[5]: *** [/root/CENTOS82-64_K4.18.0_GCC8.3.1/x86_64-native-linuxapp-gcc+shared/ddb692a3986d4592a9da4779055a4b2c/dpdk/mk/rte.subdir.mk:35: nfp] Error 2
make[4]: *** [/root/CENTOS82-64_K4.18.0_GCC8.3.1/x86_64-native-linuxapp-gcc+shared/ddb692a3986d4592a9da4779055a4b2c/dpdk/mk/rte.subdir.mk:35: net] Error 2
make[3]: *** [/root/CENTOS82-64_K4.18.0_GCC8.3.1/x86_64-native-linuxapp-gcc+shared/ddb692a3986d4592a9da4779055a4b2c/dpdk/mk/rte.sdkbuild.mk:51: drivers] Error 2
make[2]: *** [/root/CENTOS82-64_K4.18.0_GCC8.3.1/x86_64-native-linuxapp-gcc+shared/ddb692a3986d4592a9da4779055a4b2c/dpdk/mk/rte.sdkroot.mk:115: all] Error 2
make[1]: *** [/root/CENTOS82-64_K4.18.0_GCC8.3.1/x86_64-native-linuxapp-gcc+shared/ddb692a3986d4592a9da4779055a4b2c/dpdk/mk/rte.sdkinstall.mk:61: pre_install] Error 2
make: *** [/root/CENTOS82-64_K4.18.0_GCC8.3.1/x86_64-native-linuxapp-gcc+shared/ddb692a3986d4592a9da4779055a4b2c/dpdk/mk/rte.sdkroot.mk:92: install] Error 2


*Makefile Build Failed #2:
OS: FreeBSD1201-64
Target: x86_64-native-bsdapp-gcc+shared
awk -f /usr/src/sys/tools/makeobjops.awk /usr/src/sys/kern/bus_if.m -h
awk -f /usr/src/sys/tools/makeobjops.awk /usr/src/sys/kern/bus_if.m -h
Warning: Object directory not changed from original /root/FreeBSD1201-64_K12.1_GCC7.3.0/x86_64-native-bsdapp-gcc+shared/ddb692a3986d4592a9da4779055a4b2c/dpdk/x86_64-native-bsdapp-gcc/build/kernel/freebsd/contigmem
cc  -Winline -Wall -Werror -include /root/FreeBSD1201-64_K12.1_GCC7.3.0/x86_64-native-bsdapp-gcc+shared/ddb692a3986d4592a9da4779055a4b2c/dpdk/x86_64-native-bsdapp-gcc/include/rte_config.h  -Werror -D_KERNEL -DKLD_MODULE -nostdinc  -I/root/FreeBSD1201-64_K12.1_GCC7.3.0/x86_64-native-bsdapp-gcc+shared/ddb692a3986d4592a9da4779055a4b2c/dpdk/kernel/freebsd/contigmem -I/root/FreeBSD1201-64_K12.1_GCC7.3.0/x86_64-native-bsdapp-gcc+shared/ddb692a3986d4592a9da4779055a4b2c/dpdk/x86_64-native-bsdapp-gcc/include -I. -I/usr/src/sys -I/usr/src/sys/contrib/ck/include -fno-common  -fno-omit-frame-pointer -mno-omit-leaf-frame-pointer -fdebug-prefix-map=./machine=/usr/src/sys/amd64/include -fdebug-prefix-map=./x86=/usr/src/sys/x86/include   -MD  -MF.depend.contigmem.o -MTcontigmem.o -mcmodel=kernel -mno-red-zone -mno-mmx -mno-sse -msoft-float  -fno-asynchronous-unwind-tables -ffreestanding -fwrapv -fstack-protector -Wall -Wredundant-decls -Wnested-externs -Wstrict-prototypes -Wmissing-prototypes -Wpointer-arith -Wcast-qual -Wundef -Wno-pointer-sign -D__printf__=__freebsd_kprintf__ -Wmissing-include-dirs -fdiagnostics-show-option -Wno-unknown-pragmas -Wno-error-tautological-compare -Wno-error-empty-body -Wno-error-parentheses-equality -Wno-error-unused-function -Wno-error-pointer-sign -Wno-error-shift-negative-value -Wno-address-of-packed-member  -mno-aes -mno-avx  -std=iso9899:1999 -c contigmem.c -o contigmem.o
awk -f /usr/src/sys/tools/makeobjops.awk /usr/src/sys/dev/pci/pci_if.m -h
Warning: Object directory not changed from original /root/FreeBSD1201-64_K12.1_GCC7.3.0/x86_64-native-bsdapp-gcc+shared/ddb692a3986d4592a9da4779055a4b2c/dpdk/x86_64-native-bsdapp-gcc/build/kernel/freebsd/nic_uio
cc  -Winline -Wall -Werror -include /root/FreeBSD1201-64_K12.1_GCC7.3.0/x86_64-native-bsdapp-gcc+shared/ddb692a3986d4592a9da4779055a4b2c/dpdk/x86_64-native-bsdapp-gcc/include/rte_config.h  -Werror -D_KERNEL -DKLD_MODULE -nostdinc  -I/root/FreeBSD1201-64_K12.1_GCC7.3.0/x86_64-native-bsdapp-gcc+shared/ddb692a3986d4592a9da4779055a4b2c/dpdk/kernel/freebsd/nic_uio -I/root/FreeBSD1201-64_K12.1_GCC7.3.0/x86_64-native-bsdapp-gcc+shared/ddb692a3986d4592a9da4779055a4b2c/dpdk/x86_64-native-bsdapp-gcc/include -I. -I/usr/src/sys -I/usr/src/sys/contrib/ck/include -fno-common  -fno-omit-frame-pointer -mno-omit-leaf-frame-pointer -fdebug-prefix-map=./machine=/usr/src/sys/amd64/include -fdebug-prefix-map=./x86=/usr/src/sys/x86/include   -MD  -MF.depend.nic_uio.o -MTnic_uio.o -mcmodel=kernel -mno-red-zone -mno-mmx -mno-sse -msoft-float  -fno-asynchronous-unwind-tables -ffreestanding -fwrapv -fstack-protector -Wall -Wredundant-decls -Wnested-externs -Wstrict-prototypes -Wmissing-prototypes -Wpointer-arith -Wcast-qual -Wundef -Wno-pointer-sign -D__printf__=__freebsd_kprintf__ -Wmissing-include-dirs -fdiagnostics-show-option -Wno-unknown-pragmas -Wno-error-tautological-compare -Wno-error-empty-body -Wno-error-parentheses-equality -Wno-error-unused-function -Wno-error-pointer-sign -Wno-error-shift-negative-value -Wno-address-of-packed-member  -mno-aes -mno-avx  -std=iso9899:1999 -c nic_uio.c -o nic_uio.o
ld -m elf_x86_64_fbsd -L/root/FreeBSD1201-64_K12.1_GCC7.3.0/x86_64-native-bsdapp-gcc+shared/ddb692a3986d4592a9da4779055a4b2c/dpdk/x86_64-native-bsdapp-gcc/lib -d -warn-common --build-id=sha1 -r -d -o nic_uio.ko nic_uio.o
ld -m elf_x86_64_fbsd -L/root/FreeBSD1201-64_K12.1_GCC7.3.0/x86_64-native-bsdapp-gcc+shared/ddb692a3986d4592a9da4779055a4b2c/dpdk/x86_64-native-bsdapp-gcc/lib -d -warn-common --build-id=sha1 -r -d -o contigmem.ko contigmem.o
:> export_syms
--
/  CC otx2_mac.o
usr/local/bin/ld: ice_ethdev.o: in function `ice_load_pkg.isra.0':
ice_ethdev.c:(.text+0x5c55): undefined reference to `rte_pci_find_next_ext_capability'
collect2: error: ld returned 1 exit status
gmake[6]: *** [/root/FreeBSD1201-64_K12.1_GCC7.3.0/x86_64-native-bsdapp-gcc+shared/ddb692a3986d4592a9da4779055a4b2c/dpdk/mk/rte.lib.mk:95: librte_pmd_ice.so.20.0.3] Error 1
gmake[5]: *** [/root/FreeBSD1201-64_K12.1_GCC7.3.0/x86_64-native-bsdapp-gcc+shared/ddb692a3986d4592a9da4779055a4b2c/dpdk/mk/rte.subdir.mk:35: ice] Error 2
gmake[5]: *** Waiting for unfinished jobs....
  CC virtio_rxtx_simple.o
  CC tf_ulp/ulp_template_db_act.o
--
/usr/  CC efx_rx.o
local/bin/ld: ecore_sriov.o: in function `ecore_iov_hw_info':
ecore_sriov.c:(.text+0xe10): undefined reference to `rte_pci_find_next_ext_capability'
collect2: error: ld returned 1 exit status
gmake[6]: *** [/root/FreeBSD1201-64_K12.1_GCC7.3.0/x86_64-native-bsdapp-gcc+shared/ddb692a3986d4592a9da4779055a4b2c/dpdk/mk/rte.lib.mk:95: librte_pmd_qede.so.20.0.3] Error 1
gmake[5]: *** [/root/FreeBSD1201-64_K12.1_GCC7.3.0/x86_64-native-bsdapp-gcc+shared/ddb692a3986d4592a9da4779055a4b2c/dpdk/mk/rte.subdir.mk:35: qede] Error 2
  CC tf_core/tf_em_host.o
  LD librte_pmd_octeontx2.so.20.0.3
  CC efx_sram.o
--
  CC medford2_nic.o
  LD librte_pmd_sfc_efx.so.20.0.3
  INSTALL-LIB librte_pmd_sfc_efx.so.20.0.3
gmake[4]: *** [/root/FreeBSD1201-64_K12.1_GCC7.3.0/x86_64-native-bsdapp-gcc+shared/ddb692a3986d4592a9da4779055a4b2c/dpdk/mk/rte.subdir.mk:35: net] Error 2
gmake[3]: *** [/root/FreeBSD1201-64_K12.1_GCC7.3.0/x86_64-native-bsdapp-gcc+shared/ddb692a3986d4592a9da4779055a4b2c/dpdk/mk/rte.sdkbuild.mk:51: drivers] Error 2
gmake[2]: *** [/root/FreeBSD1201-64_K12.1_GCC7.3.0/x86_64-native-bsdapp-gcc+shared/ddb692a3986d4592a9da4779055a4b2c/dpdk/mk/rte.sdkroot.mk:115: all] Error 2
gmake[1]: *** [/root/FreeBSD1201-64_K12.1_GCC7.3.0/x86_64-native-bsdapp-gcc+shared/ddb692a3986d4592a9da4779055a4b2c/dpdk/mk/rte.sdkinstall.mk:61: pre_install] Error 2
gmake: *** [/root/FreeBSD1201-64_K12.1_GCC7.3.0/x86_64-native-bsdapp-gcc+shared/ddb692a3986d4592a9da4779055a4b2c/dpdk/mk/rte.sdkroot.mk:92: install] Error 2
DPDK STV team


More information about the test-report mailing list