[dpdk-test-report] |FAILURE| pw(71481) [27/27] event/dlb: add eventdev_stop and eventdev_close

sys_stv at intel.com sys_stv at intel.com
Wed Jun 17 08:21:17 CEST 2020


Test-Label: Intel-compilation
Test-Status: FAILURE
http://dpdk.org/patch/71481

_Compilation issues_

Submitter: McDaniel, Timothy <timothy.mcdaniel at intel.com>
Date: 2020-06-12 21:24:34
Reply_mail: 20200612212434.6852-28-timothy.mcdaniel at intel.com

DPDK git baseline: Repo:dpdk, CommitID: 2a5d547a4a9b7b4644e0b75d90d3b577a34e6d11


Meson build Summary: 9 Builds Done, 2 Successful, 7 Failures, 0 Blocked

Makefile build Summary: 23 Builds Done, 0 Successful, 23 Failures, 0 Blocked

                +==============================================+===========+==========+
                |                   Makefile                   |   Meson   | Document |
+----------------+------+-------+------+------------+-----------+-----------+----------+
| os             | gcc  | clang | icc  | gcc+shared | gcc+debug | gcc/clang | pdf/html |
+----------------+------+-------+------+------------+-----------+-----------+----------+
| UB2004-64      | FAIL | FAIL  | FAIL |            |           | FAIL      |          |
| UB1804-64      | FAIL | FAIL  | FAIL |            |           | FAIL      | pass     |
| FC32-64        | FAIL | FAIL  |      |            |           |           |          |
| CENTOS77-64    | FAIL |       |      |            |           |           |          |
| FC31-64        |      |       |      |            |           | FAIL      |          |
| WIN10-64       |      |       |      |            |           | pass      |          |
| CENTOS80-64    | FAIL | FAIL  | FAIL | FAIL       | FAIL      | FAIL      |          |
| UB1804-32      | FAIL |       |      |            |           | FAIL      |          |
| RHEL80-64      | FAIL |       |      |            |           |           |          |
| FreeBSD1201-64 | FAIL | FAIL  |      | FAIL       | FAIL      | FAIL      |          |
| RHEL77-64      | FAIL |       |      |            |           |           |          |
| SUSE15-64      | FAIL | FAIL  |      |            |           | FAIL      |          |
+----------------+------+-------+------+------------+-----------+-----------+----------+
Test environment and configuration as below:

** Makefile build **


OS: UB2004-64
	Kernel Version: 5.4.0-26-generic
	CPU info: Intel(R) Xeon(R) Platinum 8180 CPU @ 2.50GHz
	GCC Version: gcc (Ubuntu 9.3.0-10ubuntu2) 9.3.0
	Clang Version: 10.0.0-4ubuntu1
	x86_64-native-linuxapp-clang
	x86_64-native-linuxapp-gcc
	x86_64-native-linuxapp-icc


OS: UB1804-64
	Kernel Version: 4.15.0-20-generic
	CPU info: Intel(R) Xeon(R) CPU E5-2699 v3 @ 2.30GHz
	GCC Version: gcc (Ubuntu 7.3.0-16ubuntu3) 7.3.0
	Clang Version: 6.0.0-1ubuntu2 (tags/RELEASE_600/final)
	x86_64-native-linuxapp-clang
	x86_64-native-linuxapp-gcc
	x86_64-native-linuxapp-icc


OS: FC32-64
	Kernel Version: 5.6.0-0.rc7.git0.2.fc32.x86_64
	CPU info: Intel(R) Xeon(R) Platinum 8280M CPU @ 2.70GHz
	GCC Version: gcc (GCC) 10.0.1 20200311 (Red Hat 10.0.1-0.9)
	Clang Version: 10.0.0 (Fedora 10.0.0-0.3.rc4.fc32)
	x86_64-native-linuxapp-gcc
	x86_64-native-linuxapp-clang


OS: CENTOS77-64
	Kernel Version: 3.10.0-1062.9.1.el7.x86_64
	CPU info: Intel(R) Xeon(R) Platinum 8280M CPU @ 2.70GHz
	GCC Version: gcc (GCC) 4.8.5 20150623 (Red Hat 4.8.5-39)
	Clang Version: 3.4.2 (tags/RELEASE_34/dot2-final)
	x86_64-native-linuxapp-gcc


OS: CENTOS80-64
	Kernel Version: 4.18.0-80.11.2.el8_0.x86_64
	CPU info: Intel(R) Xeon(R) Platinum 8280M CPU @ 2.70GHz
	GCC Version: gcc (GCC) 8.2.1 20180905 (Red Hat 8.2.1-3)
	Clang Version: 7.0.1 (tags/RELEASE_701/final)
	x86_64-native-linuxapp-gcc
	x86_64-native-linuxapp-clang
	x86_64-native-linuxapp-icc
	x86_64-native-linuxapp-gcc+shared
	x86_64-native-linuxapp-gcc+debug


OS: UB1804-32
	Kernel Version: 4.15.0-20-generic
	CPU info: Intel(R) Xeon(R) Platinum 8180 CPU @ 2.50GHz
	GCC Version: gcc (Ubuntu 7.5.0-3ubuntu1~18.04) 7.5.0
	Clang Version: 6.0.0-1ubuntu2 (tags/RELEASE_600/final)
	i686-native-linuxapp-gcc


OS: RHEL80-64
	Kernel Version: 4.18.0-80.el8.x86_64
	CPU info: Intel(R) Xeon(R) Platinum 8280M CPU @ 2.70GHz
	GCC Version: gcc (GCC) 8.2.1 20180905 (Red Hat 8.2.1-3)
	Clang Version: 6.0.1 (tags/RELEASE_601/final)
	x86_64-native-linuxapp-gcc


OS: FreeBSD1201-64
	Kernel Version: 12.1-RELEASE
	CPU info: Intel(R) Xeon(R) CPU E5-2699 v3 @ 2.30GHz (2294.74-MHz K8-class CPU)
	GCC Version: gcc (FreeBSD Ports Collection) 9.2.0
	Clang Version: 8.0.1 (tags/RELEASE_801/final 366581) (based on LLVM 8.0.1)
	x86_64-native-bsdapp-gcc
	x86_64-native-bsdapp-clang
	x86_64-native-bsdapp-gcc+shared
	x86_64-native-bsdapp-gcc+debug


OS: RHEL77-64
	Kernel Version: 3.10.0-1062.9.1.el7.x86_64
	CPU info: Intel(R) Xeon(R) CPU E5-2699 v3 @ 2.30GHz
	GCC Version: gcc (GCC) 4.8.5 20150623 (Red Hat 4.8.5-39)
	Clang Version: 3.4.2 (tags/RELEASE_34/dot2-final)
	x86_64-native-linuxapp-gcc


OS: SUSE15-64
	Kernel Version: 4.12.14-lp150.11-default
	CPU info: Intel(R) Xeon(R) CPU E5-2699 v4 @ 2.20GHz
	GCC Version: gcc (SUSE Linux) 7.3.1 20180323 [gcc-7-branch revision 258812]
	Clang Version: 5.0.1 (tags/RELEASE_501/final 312548)
	x86_64-native-linuxapp-clang
	x86_64-native-linuxapp-gcc

** Meson build **


OS: UB2004-64
	Kernel Version: 5.4.0-26-generic
	CPU info: Intel(R) Xeon(R) CPU E5-2699 v4 @ 2.20GHz
	GCC Version: gcc (Ubuntu 9.3.0-10ubuntu2) 9.3.0
	Clang Version: 10.0.0-4ubuntu1
	./build-gcc-static
	./build-gcc-shared
	./build-clang-static
	./build-clang-shared
	./build-x86-default


OS: UB1804-64
	Kernel Version: 4.15.0-20-generic
	CPU info: Intel(R) Xeon(R) Platinum 8180 CPU @ 2.50GHz
	GCC Version: gcc (Ubuntu 7.3.0-16ubuntu3) 7.3.0
	Clang Version: 6.0.0-1ubuntu2 (tags/RELEASE_600/final)
	x86_64-native-linuxapp-doc
	./build-gcc-static
	./build-gcc-shared
	./build-clang-static
	./build-clang-shared
	./build-x86-default


OS: WIN10-64
	Kernel Version: N/A
	CPU info: N/A
	GCC Version: N/A
	Clang Version: Clang 8.0.0
	x86_64-windows-clang


OS: CENTOS80-64
	Kernel Version: 4.18.0-147.8.1.el8_1.x86_64
	CPU info: Intel(R) Xeon(R) CPU E5-2699 v4 @ 2.20GHz
	GCC Version: gcc (GCC) 8.3.1 20190507 (Red Hat 8.3.1-4)
	Clang Version: 8.0.1 (Red Hat 8.0.1-1.module_el8.1.0+215+a01033fb)
	./build-gcc-static
	./build-gcc-shared
	./build-clang-static
	./build-clang-shared
	./build-x86-default


OS: FC31-64
	Kernel Version: 5.4.18-200.fc31.x86_64
	CPU info: Intel(R) Xeon(R) Platinum 8180 CPU @ 2.50GHz
	GCC Version: gcc (GCC) 9.2.1 20190827 (Red Hat 9.2.1-1)
	Clang Version: 9.0.0 (Fedora 9.0.0-1.fc31)
	./build-gcc-static
	./build-gcc-shared
	./build-clang-static
	./build-clang-shared
	./build-x86-default


OS: UB1804-32
	Kernel Version: 4.15.0-20-generic
	CPU info: Intel(R) Xeon(R) CPU E5-2699 v4 @ 2.20GHz
	GCC Version: gcc (Ubuntu 7.5.0-3ubuntu1~18.04) 7.5.0
	Clang Version: 6.0.0-1ubuntu2 (tags/RELEASE_600/final)
	./build-gcc-static
	./build-gcc-shared
	./build-clang-static
	./build-clang-shared
	./build-x86-default


OS: FreeBSD1201-64
	Kernel Version: 12.1-RELEASE
	CPU info: Intel(R) Xeon(R) CPU E5-2699 v4 @ 2.20GHz (2194.97-MHz K8-class CPU)
	GCC Version: gcc (FreeBSD Ports Collection) 9.2.0
	Clang Version: 8.0.1 (tags/RELEASE_801/final 366581) (based on LLVM 8.0.1)
	./build-gcc-static
	./build-gcc-shared
	./build-clang-static
	./build-clang-shared
	./build-x86-default


OS: SUSE15-64
	Kernel Version: 4.12.14-lp150.12.82-default
	CPU info: Intel(R) Xeon(R) CPU E5-2699 v4 @ 2.20GHz
	GCC Version: gcc (SUSE Linux) 7.4.1 20190905 [gcc-7-branch revision 275407]
	Clang Version: 5.0.1 (tags/RELEASE_501/final 312548)
	./build-gcc-static
	./build-gcc-shared
	./build-clang-static
	./build-clang-shared
	./build-x86-default



*Meson Build Failed #1:
OS: CENTOS80-64
Target:./build-gcc-static
FAILED: drivers/a715181@@tmp_rte_pmd_dlb_event at sta/event_dlb_dlb_xstats.c.o 
gcc -Idrivers/a715181@@tmp_rte_pmd_dlb_event at sta -Idrivers -I../drivers -Idrivers/event/dlb -I../drivers/event/dlb -Ilib/librte_eventdev -I../lib/librte_eventdev -I. -I../ -Iconfig -I../config -Ilib/librte_eal/include -I../lib/librte_eal/include -Ilib/librte_eal/linux/include -I../lib/librte_eal/linux/include -Ilib/librte_eal/x86/include -I../lib/librte_eal/x86/include -Ilib/librte_eal/common -I../lib/librte_eal/common -Ilib/librte_eal -I../lib/librte_eal -Ilib/librte_kvargs -I../lib/librte_kvargs -Ilib/librte_telemetry/../librte_metrics -I../lib/librte_telemetry/../librte_metrics -Ilib/librte_telemetry -I../lib/librte_telemetry -Ilib/librte_ring -I../lib/librte_ring -Ilib/librte_ethdev -I../lib/librte_ethdev -Ilib/librte_net -I../lib/librte_net -Ilib/librte_mbuf -I../lib/librte_mbuf -Ilib/librte_mempool -I../lib/librte_mempool -Ilib/librte_meter -I../lib/librte_meter -Ilib/librte_hash -I../lib/librte_hash -Ilib/librte_timer -I../lib/librte_timer -Ilib/librte_cryptodev -I../lib/librte_cryptodev -Ilib/librte_pci -I../lib/librte_pci -Idrivers/bus/pci -I../drivers/bus/pci -I../drivers/bus/pci/linux -fdiagnostics-color=always -pipe -D_FILE_OFFSET_BITS=64 -Wall -Winvalid-pch -Werror -O2 -g -include rte_config.h -Wextra -Wcast-qual -Wdeprecated -Wformat-nonliteral -Wformat-security -Wmissing-declarations -Wmissing-prototypes -Wnested-externs -Wold-style-definition -Wpointer-arith -Wsign-compare -Wstrict-prototypes -Wundef -Wwrite-strings -Wno-packed-not-aligned -Wno-missing-field-initializers -D_GNU_SOURCE -fPIC -march=native -mno-avx512f -DALLOW_EXPERIMENTAL_API -DALLOW_INTERNAL_API -Wno-format-truncation -MD -MQ 'drivers/a715181@@tmp_rte_pmd_dlb_event at sta/event_dlb_dlb_xstats.c.o' -MF 'drivers/a715181@@tmp_rte_pmd_dlb_event at sta/event_dlb_dlb_xstats.c.o.d' -o 'drivers/a715181@@tmp_rte_pmd_dlb_event at sta/event_dlb_dlb_xstats.c.o' -c ../drivers/event/dlb/dlb_xstats.c
../drivers/event/dlb/dlb_xstats.c:16:10: fatal error: rte_bus_vdev.h: No such file or directory
 #include <rte_bus_vdev.h>
          ^~~~~~~~~~~~~~~~
compilation terminated.
[1906/2212] Compiling C object 'drivers/a715181@@tmp_rte_pmd_octeontx_event at sta/event_octeontx_timvf_worker.c.o'.
[1907/2212] Generating rte_pmd_opdl_event.sym_chk with a meson_exe.py custom command.
[1908/2212] Compiling C object 'drivers/a715181@@tmp_rte_pmd_octeontx_event at sta/event_octeontx_timvf_evdev.c.o'.
[1909/2212] Compiling C object 'drivers/a715181@@tmp_rte_pmd_octeontx2_event at sta/event_octeontx2_otx2_evdev.c.o'.
[1910/2212] Compiling C object 'drivers/a715181@@tmp_rte_pmd_octeontx_event at sta/event_octeontx_timvf_probe.c.o'.
[1911/2212] Compiling C object 'drivers/a715181@@tmp_rte_pmd_sw_event at sta/event_sw_sw_evdev_selftest.c.o'.
[1912/2212] Compiling C object 'drivers/a715181@@tmp_rte_pmd_dsw_event at sta/event_dsw_dsw_event.c.o'.
[1913/2212] Compiling C object 'drivers/a715181@@tmp_rte_pmd_octeontx_event at sta/event_octeontx_ssovf_evdev_selftest.c.o'.
[1914/2212] Compiling C object 'drivers/a715181@@tmp_rte_pmd_octeontx_event at sta/event_octeontx_ssovf_worker.c.o'.
[1915/2212] Compiling C object 'drivers/a715181@@tmp_rte_pmd_octeontx2_event at sta/event_octeontx2_otx2_worker.c.o'.
[1916/2212] Compiling C object 'drivers/a715181@@tmp_rte_pmd_octeontx2_event at sta/event_octeontx2_otx2_worker_dual.c.o'.
ninja: build stopped: subcommand failed




*Meson Build Failed #2:
OS: FC31-64
Target:./build-gcc-static
FAILED: drivers/a715181@@tmp_rte_pmd_dlb_event at sta/event_dlb_dlb_xstats.c.o 
gcc -Idrivers/a715181@@tmp_rte_pmd_dlb_event at sta -Idrivers -I../drivers -Idrivers/event/dlb -I../drivers/event/dlb -Ilib/librte_eventdev -I../lib/librte_eventdev -I. -I../ -Iconfig -I../config -Ilib/librte_eal/include -I../lib/librte_eal/include -Ilib/librte_eal/linux/include -I../lib/librte_eal/linux/include -Ilib/librte_eal/x86/include -I../lib/librte_eal/x86/include -Ilib/librte_eal/common -I../lib/librte_eal/common -Ilib/librte_eal -I../lib/librte_eal -Ilib/librte_kvargs -I../lib/librte_kvargs -Ilib/librte_telemetry/../librte_metrics -I../lib/librte_telemetry/../librte_metrics -Ilib/librte_telemetry -I../lib/librte_telemetry -Ilib/librte_ring -I../lib/librte_ring -Ilib/librte_ethdev -I../lib/librte_ethdev -Ilib/librte_net -I../lib/librte_net -Ilib/librte_mbuf -I../lib/librte_mbuf -Ilib/librte_mempool -I../lib/librte_mempool -Ilib/librte_meter -I../lib/librte_meter -Ilib/librte_hash -I../lib/librte_hash -Ilib/librte_timer -I../lib/librte_timer -Ilib/librte_cryptodev -I../lib/librte_cryptodev -Ilib/librte_pci -I../lib/librte_pci -Idrivers/bus/pci -I../drivers/bus/pci -I../drivers/bus/pci/linux -fdiagnostics-color=always -pipe -D_FILE_OFFSET_BITS=64 -Wall -Winvalid-pch -Werror -O2 -g -include rte_config.h -Wextra -Wcast-qual -Wdeprecated -Wformat-nonliteral -Wformat-security -Wmissing-declarations -Wmissing-prototypes -Wnested-externs -Wold-style-definition -Wpointer-arith -Wsign-compare -Wstrict-prototypes -Wundef -Wwrite-strings -Wno-address-of-packed-member -Wno-packed-not-aligned -Wno-missing-field-initializers -D_GNU_SOURCE -fPIC -march=native -DALLOW_EXPERIMENTAL_API -DALLOW_INTERNAL_API -Wno-format-truncation -MD -MQ 'drivers/a715181@@tmp_rte_pmd_dlb_event at sta/event_dlb_dlb_xstats.c.o' -MF 'drivers/a715181@@tmp_rte_pmd_dlb_event at sta/event_dlb_dlb_xstats.c.o.d' -o 'drivers/a715181@@tmp_rte_pmd_dlb_event at sta/event_dlb_dlb_xstats.c.o' -c ../drivers/event/dlb/dlb_xstats.c
../drivers/event/dlb/dlb_xstats.c:16:10: fatal error: rte_bus_vdev.h: No such file or directory
   16 | #include <rte_bus_vdev.h>
      |          ^~~~~~~~~~~~~~~~
compilation terminated.
[1915/2213] Compiling C object 'drivers/a715181@@rte_pmd_dsw_event at sha/meson-generated_.._rte_pmd_dsw_event.pmd.c.o'.
[1916/2213] Compiling C object 'drivers/a715181@@tmp_rte_pmd_octeontx_event at sta/event_octeontx_timvf_worker.c.o'.
[1917/2213] Compiling C object 'drivers/a715181@@tmp_rte_pmd_octeontx_event at sta/event_octeontx_timvf_probe.c.o'.
[1918/2213] Compiling C object 'drivers/a715181@@tmp_rte_pmd_sw_event at sta/event_sw_sw_evdev_selftest.c.o'.
[1919/2213] Compiling C object 'drivers/a715181@@tmp_rte_pmd_sw_event at sta/event_sw_sw_evdev_scheduler.c.o'.
[1920/2213] Compiling C object 'drivers/a715181@@tmp_rte_pmd_octeontx_event at sta/event_octeontx_ssovf_evdev_selftest.c.o'.
[1921/2213] Compiling C object 'drivers/a715181@@tmp_rte_pmd_octeontx_event at sta/event_octeontx_ssovf_worker.c.o'.
[1922/2213] Compiling C object 'drivers/a715181@@tmp_rte_pmd_octeontx2_event at sta/event_octeontx2_otx2_worker.c.o'.
[1923/2213] Compiling C object 'drivers/a715181@@tmp_rte_pmd_octeontx2_event at sta/event_octeontx2_otx2_worker_dual.c.o'.
ninja: build stopped: subcommand failed




*Meson Build Failed #3:
OS: FreeBSD1201-64
Target:./build-gcc-static
FAILED: drivers/a715181@@tmp_rte_pmd_dlb_event at sta/event_dlb_dlb_xstats.c.o 
gcc -Idrivers/a715181@@tmp_rte_pmd_dlb_event at sta -Idrivers -I../drivers -Idrivers/event/dlb -I../drivers/event/dlb -Ilib/librte_eventdev -I../lib/librte_eventdev -I. -I.. -Iconfig -I../config -Ilib/librte_eal/include -I../lib/librte_eal/include -Ilib/librte_eal/freebsd/include -I../lib/librte_eal/freebsd/include -Ilib/librte_eal/x86/include -I../lib/librte_eal/x86/include -Ilib/librte_eal/common -I../lib/librte_eal/common -Ilib/librte_eal -I../lib/librte_eal -Ilib/librte_kvargs -I../lib/librte_kvargs -Ilib/librte_metrics -I../lib/librte_metrics -Ilib/librte_telemetry -I../lib/librte_telemetry -Ilib/librte_ring -I../lib/librte_ring -Ilib/librte_ethdev -I../lib/librte_ethdev -Ilib/librte_net -I../lib/librte_net -Ilib/librte_mbuf -I../lib/librte_mbuf -Ilib/librte_mempool -I../lib/librte_mempool -Ilib/librte_meter -I../lib/librte_meter -Ilib/librte_hash -I../lib/librte_hash -Ilib/librte_timer -I../lib/librte_timer -Ilib/librte_cryptodev -I../lib/librte_cryptodev -Ilib/librte_pci -I../lib/librte_pci -Idrivers/bus/pci -I../drivers/bus/pci -I../drivers/bus/pci/bsd -fdiagnostics-color=always -pipe -D_FILE_OFFSET_BITS=64 -Wall -Winvalid-pch -Werror -O2 -g -include rte_config.h -Wextra -Wcast-qual -Wdeprecated -Wformat-nonliteral -Wformat-security -Wmissing-declarations -Wmissing-prototypes -Wnested-externs -Wold-style-definition -Wpointer-arith -Wsign-compare -Wstrict-prototypes -Wundef -Wwrite-strings -Wno-address-of-packed-member -Wno-packed-not-aligned -Wno-missing-field-initializers -D_GNU_SOURCE -D__BSD_VISIBLE -fPIC -march=native -DALLOW_EXPERIMENTAL_API -DALLOW_INTERNAL_API -Wno-format-truncation -MD -MQ 'drivers/a715181@@tmp_rte_pmd_dlb_event at sta/event_dlb_dlb_xstats.c.o' -MF 'drivers/a715181@@tmp_rte_pmd_dlb_event at sta/event_dlb_dlb_xstats.c.o.d' -o 'drivers/a715181@@tmp_rte_pmd_dlb_event at sta/event_dlb_dlb_xstats.c.o' -c ../drivers/event/dlb/dlb_xstats.c
../drivers/event/dlb/dlb_xstats.c:16:10: fatal error: rte_bus_vdev.h: No such file or directory
   16 | #include <rte_bus_vdev.h>
      |          ^~~~~~~~~~~~~~~~
compilation terminated.
[1345/1646] Compiling C object 'drivers/a715181@@tmp_rte_pmd_dlb_event at sta/event_dlb_rte_pmd_dlb.c.o'
FAILED: drivers/a715181@@tmp_rte_pmd_dlb_event at sta/event_dlb_rte_pmd_dlb.c.o 
gcc -Idrivers/a715181@@tmp_rte_pmd_dlb_event at sta -Idrivers -I../drivers -Idrivers/event/dlb -I../drivers/event/dlb -Ilib/librte_eventdev -I../lib/librte_eventdev -I. -I.. -Iconfig -I../config -Ilib/librte_eal/include -I../lib/librte_eal/include -Ilib/librte_eal/freebsd/include -I../lib/librte_eal/freebsd/include -Ilib/librte_eal/x86/include -I../lib/librte_eal/x86/include -Ilib/librte_eal/common -I../lib/librte_eal/common -Ilib/librte_eal -I../lib/librte_eal -Ilib/librte_kvargs -I../lib/librte_kvargs -Ilib/librte_metrics -I../lib/librte_metrics -Ilib/librte_telemetry -I../lib/librte_telemetry -Ilib/librte_ring -I../lib/librte_ring -Ilib/librte_ethdev -I../lib/librte_ethdev -Ilib/librte_net -I../lib/librte_net -Ilib/librte_mbuf -I../lib/librte_mbuf -Ilib/librte_mempool -I../lib/librte_mempool -Ilib/librte_meter -I../lib/librte_meter -Ilib/librte_hash -I../lib/librte_hash -Ilib/librte_timer -I../lib/librte_timer -Ilib/librte_cryptodev -I../lib/librte_cryptodev -Ilib/librte_pci -I../lib/librte_pci -Idrivers/bus/pci -I../drivers/bus/pci -I../drivers/bus/pci/bsd -fdiagnostics-color=always -pipe -D_FILE_OFFSET_BITS=64 -Wall -Winvalid-pch -Werror -O2 -g -include rte_config.h -Wextra -Wcast-qual -Wdeprecated -Wformat-nonliteral -Wformat-security -Wmissing-declarations -Wmissing-prototypes -Wnested-externs -Wold-style-definition -Wpointer-arith -Wsign-compare -Wstrict-prototypes -Wundef -Wwrite-strings -Wno-address-of-packed-member -Wno-packed-not-aligned -Wno-missing-field-initializers -D_GNU_SOURCE -D__BSD_VISIBLE -fPIC -march=native -DALLOW_EXPERIMENTAL_API -DALLOW_INTERNAL_API -Wno-format-truncation -MD -MQ 'drivers/a715181@@tmp_rte_pmd_dlb_event at sta/event_dlb_rte_pmd_dlb.c.o' -MF 'drivers/a715181@@tmp_rte_pmd_dlb_event at sta/event_dlb_rte_pmd_dlb.c.o.d' -o 'drivers/a715181@@tmp_rte_pmd_dlb_event at sta/event_dlb_rte_pmd_dlb.c.o' -c ../drivers/event/dlb/rte_pmd_dlb.c
In file included from ../drivers/event/dlb/dlb_priv.h:12,
                 from ../drivers/event/dlb/rte_pmd_dlb.c:9:
../drivers/event/dlb/dlb_user.h:10:10: fatal error: linux/types.h: No such file or directory
   10 | #include <linux/types.h>
      |          ^~~~~~~~~~~~~~~
compilation terminated.
[1346/1646] Compiling C object 'drivers/a715181@@tmp_rte_pmd_dlb_event at sta/event_dlb_dlb.c.o'
FAILED: drivers/a715181@@tmp_rte_pmd_dlb_event at sta/event_dlb_dlb.c.o 
gcc -Idrivers/a715181@@tmp_rte_pmd_dlb_event at sta -Idrivers -I../drivers -Idrivers/event/dlb -I../drivers/event/dlb -Ilib/librte_eventdev -I../lib/librte_eventdev -I. -I.. -Iconfig -I../config -Ilib/librte_eal/include -I../lib/librte_eal/include -Ilib/librte_eal/freebsd/include -I../lib/librte_eal/freebsd/include -Ilib/librte_eal/x86/include -I../lib/librte_eal/x86/include -Ilib/librte_eal/common -I../lib/librte_eal/common -Ilib/librte_eal -I../lib/librte_eal -Ilib/librte_kvargs -I../lib/librte_kvargs -Ilib/librte_metrics -I../lib/librte_metrics -Ilib/librte_telemetry -I../lib/librte_telemetry -Ilib/librte_ring -I../lib/librte_ring -Ilib/librte_ethdev -I../lib/librte_ethdev -Ilib/librte_net -I../lib/librte_net -Ilib/librte_mbuf -I../lib/librte_mbuf -Ilib/librte_mempool -I../lib/librte_mempool -Ilib/librte_meter -I../lib/librte_meter -Ilib/librte_hash -I../lib/librte_hash -Ilib/librte_timer -I../lib/librte_timer -Ilib/librte_cryptodev -I../lib/librte_cryptodev -Ilib/librte_pci -I../lib/librte_pci -Idrivers/bus/pci -I../drivers/bus/pci -I../drivers/bus/pci/bsd -fdiagnostics-color=always -pipe -D_FILE_OFFSET_BITS=64 -Wall -Winvalid-pch -Werror -O2 -g -include rte_config.h -Wextra -Wcast-qual -Wdeprecated -Wformat-nonliteral -Wformat-security -Wmissing-declarations -Wmissing-prototypes -Wnested-externs -Wold-style-definition -Wpointer-arith -Wsign-compare -Wstrict-prototypes -Wundef -Wwrite-strings -Wno-address-of-packed-member -Wno-packed-not-aligned -Wno-missing-field-initializers -D_GNU_SOURCE -D__BSD_VISIBLE -fPIC -march=native -DALLOW_EXPERIMENTAL_API -DALLOW_INTERNAL_API -Wno-format-truncation -MD -MQ 'drivers/a715181@@tmp_rte_pmd_dlb_event at sta/event_dlb_dlb.c.o' -MF 'drivers/a715181@@tmp_rte_pmd_dlb_event at sta/event_dlb_dlb.c.o.d' -o 'drivers/a715181@@tmp_rte_pmd_dlb_event at sta/event_dlb_dlb.c.o' -c ../drivers/event/dlb/dlb.c
In file included from ../drivers/event/dlb/dlb_priv.h:12,
                 from ../drivers/event/dlb/dlb.c:34:
../drivers/event/dlb/dlb_user.h:10:10: fatal error: linux/types.h: No such file or directory
   10 | #include <linux/types.h>
      |          ^~~~~~~~~~~~~~~
compilation terminated.
[1347/1646] Generating rte_pmd_sw_event.sym_chk with a meson_exe.py custom command
[1348/1646] Compiling C object 'drivers/a715181@@tmp_rte_pmd_octeontx_event at sta/event_octeontx_timvf_probe.c.o'
[1349/1646] Compiling C object 'drivers/a715181@@tmp_rte_pmd_dlb_event at sta/event_dlb_dlb_iface.c.o'
FAILED: drivers/a715181@@tmp_rte_pmd_dlb_event at sta/event_dlb_dlb_iface.c.o 
gcc -Idrivers/a715181@@tmp_rte_pmd_dlb_event at sta -Idrivers -I../drivers -Idrivers/event/dlb -I../drivers/event/dlb -Ilib/librte_eventdev -I../lib/librte_eventdev -I. -I.. -Iconfig -I../config -Ilib/librte_eal/include -I../lib/librte_eal/include -Ilib/librte_eal/freebsd/include -I../lib/librte_eal/freebsd/include -Ilib/librte_eal/x86/include -I../lib/librte_eal/x86/include -Ilib/librte_eal/common -I../lib/librte_eal/common -Ilib/librte_eal -I../lib/librte_eal -Ilib/librte_kvargs -I../lib/librte_kvargs -Ilib/librte_metrics -I../lib/librte_metrics -Ilib/librte_telemetry -I../lib/librte_telemetry -Ilib/librte_ring -I../lib/librte_ring -Ilib/librte_ethdev -I../lib/librte_ethdev -Ilib/librte_net -I../lib/librte_net -Ilib/librte_mbuf -I../lib/librte_mbuf -Ilib/librte_mempool -I../lib/librte_mempool -Ilib/librte_meter -I../lib/librte_meter -Ilib/librte_hash -I../lib/librte_hash -Ilib/librte_timer -I../lib/librte_timer -Ilib/librte_cryptodev -I../lib/librte_cryptodev -Ilib/librte_pci -I../lib/librte_pci -Idrivers/bus/pci -I../drivers/bus/pci -I../drivers/bus/pci/bsd -fdiagnostics-color=always -pipe -D_FILE_OFFSET_BITS=64 -Wall -Winvalid-pch -Werror -O2 -g -include rte_config.h -Wextra -Wcast-qual -Wdeprecated -Wformat-nonliteral -Wformat-security -Wmissing-declarations -Wmissing-prototypes -Wnested-externs -Wold-style-definition -Wpointer-arith -Wsign-compare -Wstrict-prototypes -Wundef -Wwrite-strings -Wno-address-of-packed-member -Wno-packed-not-aligned -Wno-missing-field-initializers -D_GNU_SOURCE -D__BSD_VISIBLE -fPIC -march=native -DALLOW_EXPERIMENTAL_API -DALLOW_INTERNAL_API -Wno-format-truncation -MD -MQ 'drivers/a715181@@tmp_rte_pmd_dlb_event at sta/event_dlb_dlb_iface.c.o' -MF 'drivers/a715181@@tmp_rte_pmd_dlb_event at sta/event_dlb_dlb_iface.c.o.d' -o 'drivers/a715181@@tmp_rte_pmd_dlb_event at sta/event_dlb_dlb_iface.c.o' -c ../drivers/event/dlb/dlb_iface.c
In file included from ../drivers/event/dlb/dlb_priv.h:12,
                 from ../drivers/event/dlb/dlb_iface.c:21:
../drivers/event/dlb/dlb_user.h:10:10: fatal error: linux/types.h: No such file or directory
   10 | #include <linux/types.h>
      |          ^~~~~~~~~~~~~~~
compilation terminated.
[1350/1646] Compiling C object 'drivers/a715181@@tmp_rte_pmd_octeontx_event at sta/event_octeontx_ssovf_worker.c.o'
[1351/1646] Generating rte_pmd_dsw_event.sym_chk with a meson_exe.py custom command
[1352/1646] Compiling C object 'drivers/a715181@@tmp_rte_pmd_octeontx2_event at sta/event_octeontx2_otx2_worker.c.o'
[1353/1646] Compiling C object 'drivers/a715181@@tmp_rte_pmd_octeontx2_event at sta/event_octeontx2_otx2_worker_dual.c.o'
ninja: build stopped: subcommand failed




*Meson Build Failed #4:
OS: SUSE15-64
Target:./build-gcc-static
FAILED: drivers/a715181@@tmp_rte_pmd_dlb_event at sta/event_dlb_dlb_xstats.c.o 
gcc -Idrivers/a715181@@tmp_rte_pmd_dlb_event at sta -Idrivers -I../drivers -Idrivers/event/dlb -I../drivers/event/dlb -Ilib/librte_eventdev -I../lib/librte_eventdev -I. -I../ -Iconfig -I../config -Ilib/librte_eal/include -I../lib/librte_eal/include -Ilib/librte_eal/linux/include -I../lib/librte_eal/linux/include -Ilib/librte_eal/x86/include -I../lib/librte_eal/x86/include -Ilib/librte_eal/common -I../lib/librte_eal/common -Ilib/librte_eal -I../lib/librte_eal -Ilib/librte_kvargs -I../lib/librte_kvargs -Ilib/librte_telemetry/../librte_metrics -I../lib/librte_telemetry/../librte_metrics -Ilib/librte_telemetry -I../lib/librte_telemetry -Ilib/librte_ring -I../lib/librte_ring -Ilib/librte_ethdev -I../lib/librte_ethdev -Ilib/librte_net -I../lib/librte_net -Ilib/librte_mbuf -I../lib/librte_mbuf -Ilib/librte_mempool -I../lib/librte_mempool -Ilib/librte_meter -I../lib/librte_meter -Ilib/librte_hash -I../lib/librte_hash -Ilib/librte_timer -I../lib/librte_timer -Ilib/librte_cryptodev -I../lib/librte_cryptodev -Ilib/librte_pci -I../lib/librte_pci -Idrivers/bus/pci -I../drivers/bus/pci -I../drivers/bus/pci/linux -fdiagnostics-color=always -pipe -D_FILE_OFFSET_BITS=64 -Wall -Winvalid-pch -Werror -O2 -g -include rte_config.h -Wextra -Wcast-qual -Wdeprecated -Wformat-nonliteral -Wformat-security -Wmissing-declarations -Wmissing-prototypes -Wnested-externs -Wold-style-definition -Wpointer-arith -Wsign-compare -Wstrict-prototypes -Wundef -Wwrite-strings -Wno-missing-field-initializers -D_GNU_SOURCE -fPIC -march=native -DALLOW_EXPERIMENTAL_API -DALLOW_INTERNAL_API -Wno-format-truncation -MD -MQ 'drivers/a715181@@tmp_rte_pmd_dlb_event at sta/event_dlb_dlb_xstats.c.o' -MF 'drivers/a715181@@tmp_rte_pmd_dlb_event at sta/event_dlb_dlb_xstats.c.o.d' -o 'drivers/a715181@@tmp_rte_pmd_dlb_event at sta/event_dlb_dlb_xstats.c.o' -c ../drivers/event/dlb/dlb_xstats.c
../drivers/event/dlb/dlb_xstats.c:16:10: fatal error: rte_bus_vdev.h: No such file or directory
 #include <rte_bus_vdev.h>
          ^~~~~~~~~~~~~~~~
compilation terminated.
[1810/2116] Compiling C object 'drivers/a715181@@tmp_rte_pmd_octeontx_event at sta/event_octeontx_timvf_worker.c.o'.
[1811/2116] Compiling C object 'drivers/a715181@@tmp_rte_pmd_sw_event at sta/event_sw_sw_evdev_selftest.c.o'.
[1812/2116] Compiling C object 'drivers/a715181@@tmp_rte_pmd_dsw_event at sta/event_dsw_dsw_event.c.o'.
[1813/2116] Compiling C object 'drivers/a715181@@tmp_rte_pmd_octeontx_event at sta/event_octeontx_timvf_probe.c.o'.
[1814/2116] Compiling C object 'drivers/a715181@@tmp_rte_pmd_octeontx_event at sta/event_octeontx_timvf_evdev.c.o'.
[1815/2116] Compiling C object 'drivers/a715181@@tmp_rte_pmd_octeontx_event at sta/event_octeontx_ssovf_evdev_selftest.c.o'.
[1816/2116] Compiling C object 'drivers/a715181@@tmp_rte_pmd_octeontx_event at sta/event_octeontx_ssovf_worker.c.o'.
[1817/2116] Compiling C object 'drivers/a715181@@tmp_rte_pmd_octeontx2_event at sta/event_octeontx2_otx2_worker.c.o'.
[1818/2116] Compiling C object 'drivers/a715181@@tmp_rte_pmd_octeontx2_event at sta/event_octeontx2_otx2_worker_dual.c.o'.
ninja: build stopped: subcommand failed




*Meson Build Failed #5:
OS: UB1804-32
Target:./build-gcc-static
FAILED: drivers/a715181@@tmp_rte_pmd_dlb_event at sta/event_dlb_dlb_xstats.c.o 
gcc -Idrivers/a715181@@tmp_rte_pmd_dlb_event at sta -Idrivers -I../drivers -Idrivers/event/dlb -I../drivers/event/dlb -Ilib/librte_eventdev -I../lib/librte_eventdev -I. -I../ -Iconfig -I../config -Ilib/librte_eal/include -I../lib/librte_eal/include -Ilib/librte_eal/linux/include -I../lib/librte_eal/linux/include -Ilib/librte_eal/x86/include -I../lib/librte_eal/x86/include -Ilib/librte_eal/common -I../lib/librte_eal/common -Ilib/librte_eal -I../lib/librte_eal -Ilib/librte_kvargs -I../lib/librte_kvargs -Ilib/librte_telemetry/../librte_metrics -I../lib/librte_telemetry/../librte_metrics -Ilib/librte_telemetry -I../lib/librte_telemetry -Ilib/librte_ring -I../lib/librte_ring -Ilib/librte_ethdev -I../lib/librte_ethdev -Ilib/librte_net -I../lib/librte_net -Ilib/librte_mbuf -I../lib/librte_mbuf -Ilib/librte_mempool -I../lib/librte_mempool -Ilib/librte_meter -I../lib/librte_meter -Ilib/librte_hash -I../lib/librte_hash -Ilib/librte_timer -I../lib/librte_timer -Ilib/librte_cryptodev -I../lib/librte_cryptodev -Ilib/librte_pci -I../lib/librte_pci -Idrivers/bus/pci -I../drivers/bus/pci -I../drivers/bus/pci/linux -fdiagnostics-color=always -pipe -D_FILE_OFFSET_BITS=64 -Wall -Winvalid-pch -Werror -O2 -g -include rte_config.h -Wextra -Wcast-qual -Wdeprecated -Wformat-nonliteral -Wformat-security -Wmissing-declarations -Wmissing-prototypes -Wnested-externs -Wold-style-definition -Wpointer-arith -Wsign-compare -Wstrict-prototypes -Wundef -Wwrite-strings -Wno-missing-field-initializers -Wno-pointer-to-int-cast -D_GNU_SOURCE -m32 -fPIC -march=native -DALLOW_EXPERIMENTAL_API -DALLOW_INTERNAL_API -Wno-format-truncation -MD -MQ 'drivers/a715181@@tmp_rte_pmd_dlb_event at sta/event_dlb_dlb_xstats.c.o' -MF 'drivers/a715181@@tmp_rte_pmd_dlb_event at sta/event_dlb_dlb_xstats.c.o.d' -o 'drivers/a715181@@tmp_rte_pmd_dlb_event at sta/event_dlb_dlb_xstats.c.o' -c ../drivers/event/dlb/dlb_xstats.c
../drivers/event/dlb/dlb_xstats.c:16:10: fatal error: rte_bus_vdev.h: No such file or directory
 #include <rte_bus_vdev.h>
          ^~~~~~~~~~~~~~~~
compilation terminated.
[1653/1968] Compiling C object 'drivers/a715181@@rte_pmd_octeontx_crypto at sta/meson-generated_.._rte_pmd_octeontx_crypto.pmd.c.o'.
[1654/1968] Compiling C object 'drivers/a715181@@tmp_rte_pmd_octeontx_event at sta/event_octeontx_timvf_evdev.c.o'.
[1655/1968] Generating rte_pmd_opdl_event.sym_chk with a meson_exe.py custom command.
[1656/1968] Compiling C object 'drivers/a715181@@tmp_rte_pmd_sw_event at sta/event_sw_sw_evdev_selftest.c.o'.
[1657/1968] Compiling C object 'drivers/a715181@@tmp_rte_pmd_octeontx_event at sta/event_octeontx_timvf_probe.c.o'.
[1658/1968] Compiling C object 'drivers/a715181@@tmp_rte_pmd_dsw_event at sta/event_dsw_dsw_event.c.o'.
[1659/1968] Compiling C object 'drivers/a715181@@tmp_rte_pmd_octeontx_event at sta/event_octeontx_ssovf_evdev_selftest.c.o'.
[1660/1968] Compiling C object 'drivers/a715181@@tmp_rte_pmd_octeontx_event at sta/event_octeontx_ssovf_worker.c.o'.
[1661/1968] Compiling C object 'drivers/a715181@@tmp_rte_pmd_octeontx2_event at sta/event_octeontx2_otx2_evdev.c.o'.
[1662/1968] Compiling C object 'drivers/a715181@@tmp_rte_pmd_octeontx2_event at sta/event_octeontx2_otx2_worker.c.o'.
[1663/1968] Compiling C object 'drivers/a715181@@tmp_rte_pmd_octeontx2_event at sta/event_octeontx2_otx2_worker_dual.c.o'.
ninja: build stopped: subcommand failed




*Meson Build Failed #6:
OS: UB1804-64
Target:./build-gcc-static
FAILED: drivers/a715181@@tmp_rte_pmd_dlb_event at sta/event_dlb_dlb_xstats.c.o 
gcc -Idrivers/a715181@@tmp_rte_pmd_dlb_event at sta -Idrivers -I../drivers -Idrivers/event/dlb -I../drivers/event/dlb -Ilib/librte_eventdev -I../lib/librte_eventdev -I. -I../ -Iconfig -I../config -Ilib/librte_eal/include -I../lib/librte_eal/include -Ilib/librte_eal/linux/include -I../lib/librte_eal/linux/include -Ilib/librte_eal/x86/include -I../lib/librte_eal/x86/include -Ilib/librte_eal/common -I../lib/librte_eal/common -Ilib/librte_eal -I../lib/librte_eal -Ilib/librte_kvargs -I../lib/librte_kvargs -Ilib/librte_telemetry/../librte_metrics -I../lib/librte_telemetry/../librte_metrics -Ilib/librte_telemetry -I../lib/librte_telemetry -Ilib/librte_ring -I../lib/librte_ring -Ilib/librte_ethdev -I../lib/librte_ethdev -Ilib/librte_net -I../lib/librte_net -Ilib/librte_mbuf -I../lib/librte_mbuf -Ilib/librte_mempool -I../lib/librte_mempool -Ilib/librte_meter -I../lib/librte_meter -Ilib/librte_hash -I../lib/librte_hash -Ilib/librte_timer -I../lib/librte_timer -Ilib/librte_cryptodev -I../lib/librte_cryptodev -Ilib/librte_pci -I../lib/librte_pci -Idrivers/bus/pci -I../drivers/bus/pci -I../drivers/bus/pci/linux -fdiagnostics-color=always -pipe -D_FILE_OFFSET_BITS=64 -Wall -Winvalid-pch -Werror -O2 -g -include rte_config.h -Wextra -Wcast-qual -Wdeprecated -Wformat-nonliteral -Wformat-security -Wmissing-declarations -Wmissing-prototypes -Wnested-externs -Wold-style-definition -Wpointer-arith -Wsign-compare -Wstrict-prototypes -Wundef -Wwrite-strings -Wno-missing-field-initializers -D_GNU_SOURCE -fPIC -march=native -mno-avx512f -DALLOW_EXPERIMENTAL_API -DALLOW_INTERNAL_API -Wno-format-truncation -MD -MQ 'drivers/a715181@@tmp_rte_pmd_dlb_event at sta/event_dlb_dlb_xstats.c.o' -MF 'drivers/a715181@@tmp_rte_pmd_dlb_event at sta/event_dlb_dlb_xstats.c.o.d' -o 'drivers/a715181@@tmp_rte_pmd_dlb_event at sta/event_dlb_dlb_xstats.c.o' -c ../drivers/event/dlb/dlb_xstats.c
../drivers/event/dlb/dlb_xstats.c:16:10: fatal error: rte_bus_vdev.h: No such file or directory
 #include <rte_bus_vdev.h>
          ^~~~~~~~~~~~~~~~
compilation terminated.
[1795/2088] Compiling C object 'drivers/a715181@@tmp_rte_pmd_octeontx_event at sta/event_octeontx_timvf_worker.c.o'.
[1796/2088] Generating rte_pmd_dsw_event.pmd.c with a custom command.
[1797/2088] Compiling C object 'drivers/a715181@@tmp_rte_pmd_octeontx_event at sta/event_octeontx_timvf_probe.c.o'.
[1798/2088] Generating rte_pmd_sw_event.sym_chk with a meson_exe.py custom command.
[1799/2088] Compiling C object 'drivers/a715181@@tmp_rte_pmd_dlb_event at sta/event_dlb_dlb_iface.c.o'.
[1800/2088] Compiling C object 'drivers/a715181@@tmp_rte_pmd_octeontx_event at sta/event_octeontx_ssovf_worker.c.o'.
[1801/2088] Compiling C object 'drivers/a715181@@tmp_rte_pmd_octeontx_event at sta/event_octeontx_ssovf_evdev_selftest.c.o'.
[1802/2088] Compiling C object 'drivers/a715181@@tmp_rte_pmd_octeontx2_event at sta/event_octeontx2_otx2_worker.c.o'.
[1803/2088] Compiling C object 'drivers/a715181@@tmp_rte_pmd_octeontx2_event at sta/event_octeontx2_otx2_worker_dual.c.o'.
ninja: build stopped: subcommand failed




*Meson Build Failed #7:
OS: UB2004-64
Target:./build-gcc-static
FAILED: drivers/a715181@@tmp_rte_pmd_dlb_event at sta/event_dlb_dlb_xstats.c.o 
gcc -Idrivers/a715181@@tmp_rte_pmd_dlb_event at sta -Idrivers -I../drivers -Idrivers/event/dlb -I../drivers/event/dlb -Ilib/librte_eventdev -I../lib/librte_eventdev -I. -I../ -Iconfig -I../config -Ilib/librte_eal/include -I../lib/librte_eal/include -Ilib/librte_eal/linux/include -I../lib/librte_eal/linux/include -Ilib/librte_eal/x86/include -I../lib/librte_eal/x86/include -Ilib/librte_eal/common -I../lib/librte_eal/common -Ilib/librte_eal -I../lib/librte_eal -Ilib/librte_kvargs -I../lib/librte_kvargs -Ilib/librte_telemetry/../librte_metrics -I../lib/librte_telemetry/../librte_metrics -Ilib/librte_telemetry -I../lib/librte_telemetry -Ilib/librte_ring -I../lib/librte_ring -Ilib/librte_ethdev -I../lib/librte_ethdev -Ilib/librte_net -I../lib/librte_net -Ilib/librte_mbuf -I../lib/librte_mbuf -Ilib/librte_mempool -I../lib/librte_mempool -Ilib/librte_meter -I../lib/librte_meter -Ilib/librte_hash -I../lib/librte_hash -Ilib/librte_timer -I../lib/librte_timer -Ilib/librte_cryptodev -I../lib/librte_cryptodev -Ilib/librte_pci -I../lib/librte_pci -Idrivers/bus/pci -I../drivers/bus/pci -I../drivers/bus/pci/linux -fdiagnostics-color=always -pipe -D_FILE_OFFSET_BITS=64 -Wall -Winvalid-pch -Werror -O2 -g -include rte_config.h -Wextra -Wcast-qual -Wdeprecated -Wformat-nonliteral -Wformat-security -Wmissing-declarations -Wmissing-prototypes -Wnested-externs -Wold-style-definition -Wpointer-arith -Wsign-compare -Wstrict-prototypes -Wundef -Wwrite-strings -Wno-address-of-packed-member -Wno-packed-not-aligned -Wno-missing-field-initializers -D_GNU_SOURCE -fPIC -march=native -DALLOW_EXPERIMENTAL_API -DALLOW_INTERNAL_API -Wno-format-truncation -MD -MQ 'drivers/a715181@@tmp_rte_pmd_dlb_event at sta/event_dlb_dlb_xstats.c.o' -MF 'drivers/a715181@@tmp_rte_pmd_dlb_event at sta/event_dlb_dlb_xstats.c.o.d' -o 'drivers/a715181@@tmp_rte_pmd_dlb_event at sta/event_dlb_dlb_xstats.c.o' -c ../drivers/event/dlb/dlb_xstats.c
../drivers/event/dlb/dlb_xstats.c:16:10: fatal error: rte_bus_vdev.h: No such file or directory
   16 | #include <rte_bus_vdev.h>
      |          ^~~~~~~~~~~~~~~~
compilation terminated.
[1906/2204] Linking target drivers/librte_pmd_opdl_event.so.20.0.3.
[1907/2204] Compiling C object 'drivers/a715181@@tmp_rte_pmd_octeontx_event at sta/event_octeontx_timvf_evdev.c.o'.
[1908/2204] Compiling C object 'drivers/a715181@@tmp_rte_pmd_octeontx_event at sta/event_octeontx_timvf_worker.c.o'.
[1909/2204] Compiling C object 'drivers/a715181@@tmp_rte_pmd_sw_event at sta/event_sw_sw_evdev_selftest.c.o'.
[1910/2204] Compiling C object 'drivers/a715181@@tmp_rte_pmd_octeontx_event at sta/event_octeontx_timvf_probe.c.o'.
[1911/2204] Compiling C object 'drivers/a715181@@tmp_rte_pmd_octeontx2_event at sta/event_octeontx2_otx2_evdev.c.o'.
[1912/2204] Compiling C object 'drivers/a715181@@tmp_rte_pmd_octeontx_event at sta/event_octeontx_ssovf_evdev_selftest.c.o'.
[1913/2204] Compiling C object 'drivers/a715181@@tmp_rte_pmd_octeontx_event at sta/event_octeontx_ssovf_worker.c.o'.
[1914/2204] Compiling C object 'drivers/a715181@@tmp_rte_pmd_dsw_event at sta/event_dsw_dsw_event.c.o'.
[1915/2204] Compiling C object 'drivers/a715181@@tmp_rte_pmd_octeontx2_event at sta/event_octeontx2_otx2_worker.c.o'.
[1916/2204] Compiling C object 'drivers/a715181@@tmp_rte_pmd_octeontx2_event at sta/event_octeontx2_otx2_worker_dual.c.o'.
ninja: build stopped: subcommand failed



*Build Build Failed #1:
OS: CENTOS77-64
Target: x86_64-native-linuxapp-gcc
  SYMLINK-FILE include/rte_pmd_dlb.h
  CC dlb.o
/root/CENTOS77-64_K3.10.0_GCC4.8.5/x86_64-native-linuxapp-gcc/608fc020b86c4e05bcc0541c552e57ed/dpdk/drivers/event/dlb/dlb.c: In function ‘dlb_event_dequeue_burst_sparse’:
/root/CENTOS77-64_K3.10.0_GCC4.8.5/x86_64-native-linuxapp-gcc/608fc020b86c4e05bcc0541c552e57ed/dpdk/drivers/event/dlb/dlb.c:3062:11: error: ‘cnt’ may be used uninitialized in this function [-Werror=maybe-uninitialized]
  uint16_t cnt;
           ^
/root/CENTOS77-64_K3.10.0_GCC4.8.5/x86_64-native-linuxapp-gcc/608fc020b86c4e05bcc0541c552e57ed/dpdk/drivers/event/dlb/dlb.c: At top level:
cc1: error: unrecognized command line option "-Wno-address-of-packed-member" [-Werror]
cc1: all warnings being treated as errors
make[6]: *** [dlb.o] Error 1
make[5]: *** [dlb] Error 2
make[5]: *** Waiting for unfinished jobs....
  CC otx2_evdev_selftest.o
  CC otx2_evdev_irq.o
  AR librte_pmd_octeontx2_event.a
  INSTALL-LIB librte_pmd_octeontx2_event.a
make[4]: *** [event] Error 2
make[3]: *** [drivers] Error 2
make[2]: *** [all] Error 2
make[1]: *** [pre_install] Error 2
make: *** [install] Error 2


*Build Build Failed #2:
OS: CENTOS80-64
Target: x86_64-native-linuxapp-gcc
  SYMLINK-FILE include/rte_pmd_dlb.h
  CC dlb.o
/root/CENTOS80-64_K4.18.0_GCC8.2.1/x86_64-native-linuxapp-gcc/608fc020b86c4e05bcc0541c552e57ed/dpdk/drivers/event/dlb/dlb.c: In function ‘dlb_event_dequeue_burst_sparse’:
/root/CENTOS80-64_K4.18.0_GCC8.2.1/x86_64-native-linuxapp-gcc/608fc020b86c4e05bcc0541c552e57ed/dpdk/drivers/event/dlb/dlb.c:3062:11: error: ‘cnt’ may be used uninitialized in this function [-Werror=maybe-uninitialized]
  uint16_t cnt;
           ^~~
/root/CENTOS80-64_K4.18.0_GCC8.2.1/x86_64-native-linuxapp-gcc/608fc020b86c4e05bcc0541c552e57ed/dpdk/drivers/event/dlb/dlb.c: At top level:
cc1: error: unrecognized command line option ‘-Wno-address-of-packed-member’ [-Werror]
cc1: all warnings being treated as errors
make[6]: *** [/root/CENTOS80-64_K4.18.0_GCC8.2.1/x86_64-native-linuxapp-gcc/608fc020b86c4e05bcc0541c552e57ed/dpdk/mk/internal/rte.compile-pre.mk:116: dlb.o] Error 1
make[5]: *** [/root/CENTOS80-64_K4.18.0_GCC8.2.1/x86_64-native-linuxapp-gcc/608fc020b86c4e05bcc0541c552e57ed/dpdk/mk/rte.subdir.mk:37: dlb] Error 2
make[5]: *** Waiting for unfinished jobs....
  CC otx2_worker.o
  CC otx2_tim_worker.o
--
  AR librte_pmd_octeontx_ssovf.a
  INSTALL-LIB librte_pmd_octeontx_ssovf.a
make[6]: warning:  Clock skew detected.  Your build may be incomplete.
make[4]: *** [/root/CENTOS80-64_K4.18.0_GCC8.2.1/x86_64-native-linuxapp-gcc/608fc020b86c4e05bcc0541c552e57ed/dpdk/mk/rte.subdir.mk:37: event] Error 2
make[3]: *** [/root/CENTOS80-64_K4.18.0_GCC8.2.1/x86_64-native-linuxapp-gcc/608fc020b86c4e05bcc0541c552e57ed/dpdk/mk/rte.sdkbuild.mk:51: drivers] Error 2
make[2]: *** [/root/CENTOS80-64_K4.18.0_GCC8.2.1/x86_64-native-linuxapp-gcc/608fc020b86c4e05bcc0541c552e57ed/dpdk/mk/rte.sdkroot.mk:99: all] Error 2
make[1]: *** [/root/CENTOS80-64_K4.18.0_GCC8.2.1/x86_64-native-linuxapp-gcc/608fc020b86c4e05bcc0541c552e57ed/dpdk/mk/rte.sdkinstall.mk:61: pre_install] Error 2
make: *** [/root/CENTOS80-64_K4.18.0_GCC8.2.1/x86_64-native-linuxapp-gcc/608fc020b86c4e05bcc0541c552e57ed/dpdk/mk/rte.sdkroot.mk:77: install] Error 2


*Build Build Failed #3:
OS: CENTOS80-64
Target: x86_64-native-linuxapp-clang
  CC dlb.o
  CC opdl_evdev_xstats.o
In file included from /root/CENTOS80-64_K4.18.0_Clang7.0.1/x86_64-native-linuxapp-clang/608fc020b86c4e05bcc0541c552e57ed/dpdk/drivers/event/dlb/dlb.c:34:
/root/CENTOS80-64_K4.18.0_Clang7.0.1/x86_64-native-linuxapp-clang/608fc020b86c4e05bcc0541c552e57ed/dpdk/drivers/event/dlb/dlb_priv.h:358:4: error: attribute '__aligned__' is ignored, place it after "struct" to apply attribute to type declaration [-Werror,-Wignored-attributes]
}; __rte_cache_aligned
   ^
/root/CENTOS80-64_K4.18.0_Clang7.0.1/x86_64-native-linuxapp-clang/608fc020b86c4e05bcc0541c552e57ed/dpdk/x86_64-native-linuxapp-clang/include/rte_common.h:367:29: note: expanded from macro '__rte_cache_aligned'
--
#define __rte_aligned(a) __attribute__((__aligned__(a)))
                                        ^
In file included from /root/CENTOS80-64_K4.18.0_Clang7.0.1/x86_64-native-linuxapp-clang/608fc020b86c4e05bcc0541c552e57ed/dpdk/drivers/event/dlb/dlb.c:36:
/root/CENTOS80-64_K4.18.0_Clang7.0.1/x86_64-native-linuxapp-clang/608fc020b86c4e05bcc0541c552e57ed/dpdk/drivers/event/dlb/dlb_inline_fns.h:46:2: error: use of unknown builtin '__builtin_ia32_movntdq' [-Wimplicit-function-declaration]
        __builtin_ia32_movntdq((__v2di *)pp_addr + 0, (__v2di)src_data0);
        ^
/root/CENTOS80-64_K4.18.0_Clang7.0.1/x86_64-native-linuxapp-clang/608fc020b86c4e05bcc0541c552e57ed/dpdk/drivers/event/dlb/dlb_inline_fns.h:46:2: note: did you mean '__builtin_ia32_movntq'?
--
  __builtin_ia32_movntq(__p, __a);
  ^
In file included from /root/CENTOS80-64_K4.18.0_Clang7.0.1/x86_64-native-linuxapp-clang/608fc020b86c4e05bcc0541c552e57ed/dpdk/drivers/event/dlb/dlb.c:36:
/root/CENTOS80-64_K4.18.0_Clang7.0.1/x86_64-native-linuxapp-clang/608fc020b86c4e05bcc0541c552e57ed/dpdk/drivers/event/dlb/dlb_inline_fns.h:46:2: error: this function declaration is not a prototype [-Werror,-Wstrict-prototypes]
        __builtin_ia32_movntdq((__v2di *)pp_addr + 0, (__v2di)src_data0);
        ^
/root/CENTOS80-64_K4.18.0_Clang7.0.1/x86_64-native-linuxapp-clang/608fc020b86c4e05bcc0541c552e57ed/dpdk/drivers/event/dlb/dlb_inline_fns.h:62:2: error: use of unknown builtin '__builtin_ia32_movntdq' [-Wimplicit-function-declaration]
        __builtin_ia32_movntdq((__v2di *)pp_addr, (__v2di)src_data0);
        ^
  CC opdl_test.o
4 errors generated.
make[6]: *** [/root/CENTOS80-64_K4.18.0_Clang7.0.1/x86_64-native-linuxapp-clang/608fc020b86c4e05bcc0541c552e57ed/dpdk/mk/internal/rte.compile-pre.mk:116: dlb.o] Error 1
make[5]: *** [/root/CENTOS80-64_K4.18.0_Clang7.0.1/x86_64-native-linuxapp-clang/608fc020b86c4e05bcc0541c552e57ed/dpdk/mk/rte.subdir.mk:37: dlb] Error 2
make[5]: *** Waiting for unfinished jobs....
  CC otx2_worker.o
  AR librte_pmd_opdl_event.a
--
  CC otx2_evdev_irq.o
  AR librte_pmd_octeontx2_event.a
  INSTALL-LIB librte_pmd_octeontx2_event.a
make[4]: *** [/root/CENTOS80-64_K4.18.0_Clang7.0.1/x86_64-native-linuxapp-clang/608fc020b86c4e05bcc0541c552e57ed/dpdk/mk/rte.subdir.mk:37: event] Error 2
make[3]: *** [/root/CENTOS80-64_K4.18.0_Clang7.0.1/x86_64-native-linuxapp-clang/608fc020b86c4e05bcc0541c552e57ed/dpdk/mk/rte.sdkbuild.mk:51: drivers] Error 2
make[2]: *** [/root/CENTOS80-64_K4.18.0_Clang7.0.1/x86_64-native-linuxapp-clang/608fc020b86c4e05bcc0541c552e57ed/dpdk/mk/rte.sdkroot.mk:99: all] Error 2
make[1]: *** [/root/CENTOS80-64_K4.18.0_Clang7.0.1/x86_64-native-linuxapp-clang/608fc020b86c4e05bcc0541c552e57ed/dpdk/mk/rte.sdkinstall.mk:61: pre_install] Error 2
make: *** [/root/CENTOS80-64_K4.18.0_Clang7.0.1/x86_64-native-linuxapp-clang/608fc020b86c4e05bcc0541c552e57ed/dpdk/mk/rte.sdkroot.mk:77: install] Error 2


*Build Build Failed #4:
OS: CENTOS80-64
Target: x86_64-native-linuxapp-icc
  LD pf/dlb_pf.o
  CC pf/dlb_main.o
  CC otx2_worker.o
/root/CENTOS80-64_K4.18.0_ICC19.0.0/x86_64-native-linuxapp-icc/608fc020b86c4e05bcc0541c552e57ed/dpdk/drivers/event/dlb/pf/dlb_main.c(86): error: identifier "__v2di" is undefined
  	__v2di src_data0 = (__v2di){_qe[0], _qe[1]};
  	^

/root/CENTOS80-64_K4.18.0_ICC19.0.0/x86_64-native-linuxapp-icc/608fc020b86c4e05bcc0541c552e57ed/dpdk/drivers/event/dlb/pf/dlb_main.c(86): error: identifier "__v2di" is undefined
  	__v2di src_data0 = (__v2di){_qe[0], _qe[1]};
  	                    ^

/root/CENTOS80-64_K4.18.0_ICC19.0.0/x86_64-native-linuxapp-icc/608fc020b86c4e05bcc0541c552e57ed/dpdk/drivers/event/dlb/pf/dlb_main.c(86): error: expected a ";"
  	__v2di src_data0 = (__v2di){_qe[0], _qe[1]};
  	                           ^

/root/CENTOS80-64_K4.18.0_ICC19.0.0/x86_64-native-linuxapp-icc/608fc020b86c4e05bcc0541c552e57ed/dpdk/drivers/event/dlb/pf/dlb_main.c(87): error: expected a ";"
  	__v2di src_data1 = (__v2di){_qe[2], _qe[3]};
  	       ^

/root/CENTOS80-64_K4.18.0_ICC19.0.0/x86_64-native-linuxapp-icc/608fc020b86c4e05bcc0541c552e57ed/dpdk/drivers/event/dlb/pf/dlb_main.c(88): error: expected a ";"
  	__v2di src_data2 = (__v2di){_qe[4], _qe[5]};
  	       ^

/root/CENTOS80-64_K4.18.0_ICC19.0.0/x86_64-native-linuxapp-icc/608fc020b86c4e05bcc0541c552e57ed/dpdk/drivers/event/dlb/pf/dlb_main.c(89): error: expected a ";"
  	__v2di src_data3 = (__v2di){_qe[6], _qe[7]};
  	       ^

/root/CENTOS80-64_K4.18.0_ICC19.0.0/x86_64-native-linuxapp-icc/608fc020b86c4e05bcc0541c552e57ed/dpdk/drivers/event/dlb/pf/dlb_main.c(90): error: expected an expression
  	__builtin_ia32_movntdq((__v2di *)pp_addr + 0, (__v2di)src_data0);
  	                                ^

--
  	__builtin_ia32_movntdq((__v2di *)pp_addr + 0, (__v2di)src_data0);
  	                                 ^

/root/CENTOS80-64_K4.18.0_ICC19.0.0/x86_64-native-linuxapp-icc/608fc020b86c4e05bcc0541c552e57ed/dpdk/drivers/event/dlb/pf/dlb_main.c(90): error: expected a ")"
  	__builtin_ia32_movntdq((__v2di *)pp_addr + 0, (__v2di)src_data0);
  	                                 ^

/root/CENTOS80-64_K4.18.0_ICC19.0.0/x86_64-native-linuxapp-icc/608fc020b86c4e05bcc0541c552e57ed/dpdk/drivers/event/dlb/pf/dlb_main.c(92): error: expected an expression
  	__builtin_ia32_movntdq((__v2di *)pp_addr + 1, (__v2di)src_data1);
  	                                ^

--
  	__builtin_ia32_movntdq((__v2di *)pp_addr + 1, (__v2di)src_data1);
  	                                 ^

/root/CENTOS80-64_K4.18.0_ICC19.0.0/x86_64-native-linuxapp-icc/608fc020b86c4e05bcc0541c552e57ed/dpdk/drivers/event/dlb/pf/dlb_main.c(92): error: expected a ")"
  	__builtin_ia32_movntdq((__v2di *)pp_addr + 1, (__v2di)src_data1);
  	                                 ^

/root/CENTOS80-64_K4.18.0_ICC19.0.0/x86_64-native-linuxapp-icc/608fc020b86c4e05bcc0541c552e57ed/dpdk/drivers/event/dlb/pf/dlb_main.c(94): error: expected an expression
  	__builtin_ia32_movntdq((__v2di *)pp_addr + 2, (__v2di)src_data2);
  	                                ^

--
  	__builtin_ia32_movntdq((__v2di *)pp_addr + 2, (__v2di)src_data2);
  	                                 ^

/root/CENTOS80-64_K4.18.0_ICC19.0.0/x86_64-native-linuxapp-icc/608fc020b86c4e05bcc0541c552e57ed/dpdk/drivers/event/dlb/pf/dlb_main.c(94): error: expected a ")"
  	__builtin_ia32_movntdq((__v2di *)pp_addr + 2, (__v2di)src_data2);
  	                                 ^

/root/CENTOS80-64_K4.18.0_ICC19.0.0/x86_64-native-linuxapp-icc/608fc020b86c4e05bcc0541c552e57ed/dpdk/drivers/event/dlb/pf/dlb_main.c(96): error: expected an expression
  	__builtin_ia32_movntdq((__v2di *)pp_addr + 3, (__v2di)src_data3);
  	                                ^

--
  	__builtin_ia32_movntdq((__v2di *)pp_addr + 3, (__v2di)src_data3);
  	                                 ^

/root/CENTOS80-64_K4.18.0_ICC19.0.0/x86_64-native-linuxapp-icc/608fc020b86c4e05bcc0541c552e57ed/dpdk/drivers/event/dlb/pf/dlb_main.c(96): error: expected a ")"
  	__builtin_ia32_movntdq((__v2di *)pp_addr + 3, (__v2di)src_data3);
  	                                 ^

compilation aborted for /root/CENTOS80-64_K4.18.0_ICC19.0.0/x86_64-native-linuxapp-icc/608fc020b86c4e05bcc0541c552e57ed/dpdk/drivers/event/dlb/pf/dlb_main.c (code 2)
make[6]: *** [/root/CENTOS80-64_K4.18.0_ICC19.0.0/x86_64-native-linuxapp-icc/608fc020b86c4e05bcc0541c552e57ed/dpdk/mk/internal/rte.compile-pre.mk:114: pf/dlb_main.o] Error 2
make[5]: *** [/root/CENTOS80-64_K4.18.0_ICC19.0.0/x86_64-native-linuxapp-icc/608fc020b86c4e05bcc0541c552e57ed/dpdk/mk/rte.subdir.mk:35: dlb] Error 2
make[5]: *** Waiting for unfinished jobs....
  CC otx2_tim_worker.o
  CC otx2_evdev.o
--
  CC otx2_evdev_irq.o
  AR librte_pmd_octeontx2_event.a
  INSTALL-LIB librte_pmd_octeontx2_event.a
make[4]: *** [/root/CENTOS80-64_K4.18.0_ICC19.0.0/x86_64-native-linuxapp-icc/608fc020b86c4e05bcc0541c552e57ed/dpdk/mk/rte.subdir.mk:37: event] Error 2
make[3]: *** [/root/CENTOS80-64_K4.18.0_ICC19.0.0/x86_64-native-linuxapp-icc/608fc020b86c4e05bcc0541c552e57ed/dpdk/mk/rte.sdkbuild.mk:51: drivers] Error 2
make[2]: *** [/root/CENTOS80-64_K4.18.0_ICC19.0.0/x86_64-native-linuxapp-icc/608fc020b86c4e05bcc0541c552e57ed/dpdk/mk/rte.sdkroot.mk:99: all] Error 2
make[1]: *** [/root/CENTOS80-64_K4.18.0_ICC19.0.0/x86_64-native-linuxapp-icc/608fc020b86c4e05bcc0541c552e57ed/dpdk/mk/rte.sdkinstall.mk:61: pre_install] Error 2
make: *** [/root/CENTOS80-64_K4.18.0_ICC19.0.0/x86_64-native-linuxapp-icc/608fc020b86c4e05bcc0541c552e57ed/dpdk/mk/rte.sdkroot.mk:77: install] Error 2


*Build Build Failed #5:
OS: CENTOS80-64
Target: x86_64-native-linuxapp-gcc+shared
  SYMLINK-FILE include/rte_pmd_dlb.h
  CC dlb.o
/root/CENTOS80-64_K4.18.0_GCC8.2.1/x86_64-native-linuxapp-gcc+shared/608fc020b86c4e05bcc0541c552e57ed/dpdk/drivers/event/dlb/dlb.c: In function ‘dlb_event_dequeue_burst_sparse’:
/root/CENTOS80-64_K4.18.0_GCC8.2.1/x86_64-native-linuxapp-gcc+shared/608fc020b86c4e05bcc0541c552e57ed/dpdk/drivers/event/dlb/dlb.c:3062:11: error: ‘cnt’ may be used uninitialized in this function [-Werror=maybe-uninitialized]
  uint16_t cnt;
           ^~~
/root/CENTOS80-64_K4.18.0_GCC8.2.1/x86_64-native-linuxapp-gcc+shared/608fc020b86c4e05bcc0541c552e57ed/dpdk/drivers/event/dlb/dlb.c: At top level:
cc1: error: unrecognized command line option ‘-Wno-address-of-packed-member’ [-Werror]
cc1: all warnings being treated as errors
make[6]: *** [/root/CENTOS80-64_K4.18.0_GCC8.2.1/x86_64-native-linuxapp-gcc+shared/608fc020b86c4e05bcc0541c552e57ed/dpdk/mk/internal/rte.compile-pre.mk:116: dlb.o] Error 1
make[5]: *** [/root/CENTOS80-64_K4.18.0_GCC8.2.1/x86_64-native-linuxapp-gcc+shared/608fc020b86c4e05bcc0541c552e57ed/dpdk/mk/rte.subdir.mk:37: dlb] Error 2
make[5]: *** Waiting for unfinished jobs....
  CC otx2_worker.o
  CC otx2_tim_worker.o
--
  LD librte_pmd_octeontx_ssovf.so.20.0.3
  INSTALL-LIB librte_pmd_octeontx_ssovf.so.20.0.3
make[6]: warning:  Clock skew detected.  Your build may be incomplete.
make[4]: *** [/root/CENTOS80-64_K4.18.0_GCC8.2.1/x86_64-native-linuxapp-gcc+shared/608fc020b86c4e05bcc0541c552e57ed/dpdk/mk/rte.subdir.mk:37: event] Error 2
make[3]: *** [/root/CENTOS80-64_K4.18.0_GCC8.2.1/x86_64-native-linuxapp-gcc+shared/608fc020b86c4e05bcc0541c552e57ed/dpdk/mk/rte.sdkbuild.mk:51: drivers] Error 2
make[2]: *** [/root/CENTOS80-64_K4.18.0_GCC8.2.1/x86_64-native-linuxapp-gcc+shared/608fc020b86c4e05bcc0541c552e57ed/dpdk/mk/rte.sdkroot.mk:99: all] Error 2
make[1]: *** [/root/CENTOS80-64_K4.18.0_GCC8.2.1/x86_64-native-linuxapp-gcc+shared/608fc020b86c4e05bcc0541c552e57ed/dpdk/mk/rte.sdkinstall.mk:61: pre_install] Error 2
make: *** [/root/CENTOS80-64_K4.18.0_GCC8.2.1/x86_64-native-linuxapp-gcc+shared/608fc020b86c4e05bcc0541c552e57ed/dpdk/mk/rte.sdkroot.mk:77: install] Error 2


*Build Build Failed #6:
OS: CENTOS80-64
Target: x86_64-native-linuxapp-gcc+debug
  SYMLINK-FILE include/rte_pmd_dlb.h
  CC dlb.o
/root/CENTOS80-64_K4.18.0_GCC8.2.1/x86_64-native-linuxapp-gcc+debug/608fc020b86c4e05bcc0541c552e57ed/dpdk/drivers/event/dlb/dlb.c: In function ‘dlb_event_dequeue_burst_sparse’:
/root/CENTOS80-64_K4.18.0_GCC8.2.1/x86_64-native-linuxapp-gcc+debug/608fc020b86c4e05bcc0541c552e57ed/dpdk/drivers/event/dlb/dlb.c:3062:11: error: ‘cnt’ may be used uninitialized in this function [-Werror=maybe-uninitialized]
  uint16_t cnt;
           ^~~
  CC opdl_evdev.o
--
  CC opdl_evdev_xstats.o
  CC opdl_test.o
/root/CENTOS80-64_K4.18.0_GCC8.2.1/x86_64-native-linuxapp-gcc+debug/608fc020b86c4e05bcc0541c552e57ed/dpdk/drivers/event/dlb/dlb.c: At top level:
cc1: error: unrecognized command line option ‘-Wno-address-of-packed-member’ [-Werror]
cc1: all warnings being treated as errors
make[6]: *** [/root/CENTOS80-64_K4.18.0_GCC8.2.1/x86_64-native-linuxapp-gcc+debug/608fc020b86c4e05bcc0541c552e57ed/dpdk/mk/internal/rte.compile-pre.mk:116: dlb.o] Error 1
make[5]: *** [/root/CENTOS80-64_K4.18.0_GCC8.2.1/x86_64-native-linuxapp-gcc+debug/608fc020b86c4e05bcc0541c552e57ed/dpdk/mk/rte.subdir.mk:37: dlb] Error 2
make[5]: *** Waiting for unfinished jobs....
  CC otx2_worker.o
  AR librte_pmd_opdl_event.a
--
  CC otx2_evdev_irq.o
  AR librte_pmd_octeontx2_event.a
  INSTALL-LIB librte_pmd_octeontx2_event.a
make[4]: *** [/root/CENTOS80-64_K4.18.0_GCC8.2.1/x86_64-native-linuxapp-gcc+debug/608fc020b86c4e05bcc0541c552e57ed/dpdk/mk/rte.subdir.mk:37: event] Error 2
make[3]: *** [/root/CENTOS80-64_K4.18.0_GCC8.2.1/x86_64-native-linuxapp-gcc+debug/608fc020b86c4e05bcc0541c552e57ed/dpdk/mk/rte.sdkbuild.mk:51: drivers] Error 2
make[2]: *** [/root/CENTOS80-64_K4.18.0_GCC8.2.1/x86_64-native-linuxapp-gcc+debug/608fc020b86c4e05bcc0541c552e57ed/dpdk/mk/rte.sdkroot.mk:99: all] Error 2
make[1]: *** [/root/CENTOS80-64_K4.18.0_GCC8.2.1/x86_64-native-linuxapp-gcc+debug/608fc020b86c4e05bcc0541c552e57ed/dpdk/mk/rte.sdkinstall.mk:61: pre_install] Error 2
make: *** [/root/CENTOS80-64_K4.18.0_GCC8.2.1/x86_64-native-linuxapp-gcc+debug/608fc020b86c4e05bcc0541c552e57ed/dpdk/mk/rte.sdkroot.mk:77: install] Error 2


*Build Build Failed #7:
OS: FC32-64
Target: x86_64-native-linuxapp-gcc
  CC opdl_evdev.o.pmd.o
  LD opdl_evdev.o
/root/FC32-64_K5.6.0_GCC10.0.1/x86_64-native-linuxapp-gcc/608fc020b86c4e05bcc0541c552e57ed/dpdk/drivers/event/dlb/dlb.c: In function ‘dlb_event_dequeue_burst_sparse’:
/root/FC32-64_K5.6.0_GCC10.0.1/x86_64-native-linuxapp-gcc/608fc020b86c4e05bcc0541c552e57ed/dpdk/drivers/event/dlb/dlb.c:3087:66: error: ‘cnt’ may be used uninitialized in this function [-Werror=maybe-uninitialized]
 3087 |  DLB_INC_STAT(ev_port->stats.traffic.zero_polls, ((cnt == 0) ? 1 : 0));
      |                                                                  ^
  CC opdl_evdev_init.o
  CC opdl_evdev_xstats.o
  CC opdl_test.o
cc1: all warnings being treated as errors
make[6]: *** [/root/FC32-64_K5.6.0_GCC10.0.1/x86_64-native-linuxapp-gcc/608fc020b86c4e05bcc0541c552e57ed/dpdk/mk/internal/rte.compile-pre.mk:116: dlb.o] Error 1
make[5]: *** [/root/FC32-64_K5.6.0_GCC10.0.1/x86_64-native-linuxapp-gcc/608fc020b86c4e05bcc0541c552e57ed/dpdk/mk/rte.subdir.mk:37: dlb] Error 2
make[5]: *** Waiting for unfinished jobs....
  CC otx2_worker.o
  AR librte_pmd_opdl_event.a
--
  CC otx2_evdev_irq.o
  AR librte_pmd_octeontx2_event.a
  INSTALL-LIB librte_pmd_octeontx2_event.a
make[4]: *** [/root/FC32-64_K5.6.0_GCC10.0.1/x86_64-native-linuxapp-gcc/608fc020b86c4e05bcc0541c552e57ed/dpdk/mk/rte.subdir.mk:37: event] Error 2
make[3]: *** [/root/FC32-64_K5.6.0_GCC10.0.1/x86_64-native-linuxapp-gcc/608fc020b86c4e05bcc0541c552e57ed/dpdk/mk/rte.sdkbuild.mk:51: drivers] Error 2
make[2]: *** [/root/FC32-64_K5.6.0_GCC10.0.1/x86_64-native-linuxapp-gcc/608fc020b86c4e05bcc0541c552e57ed/dpdk/mk/rte.sdkroot.mk:99: all] Error 2
make[1]: *** [/root/FC32-64_K5.6.0_GCC10.0.1/x86_64-native-linuxapp-gcc/608fc020b86c4e05bcc0541c552e57ed/dpdk/mk/rte.sdkinstall.mk:61: pre_install] Error 2
make: *** [/root/FC32-64_K5.6.0_GCC10.0.1/x86_64-native-linuxapp-gcc/608fc020b86c4e05bcc0541c552e57ed/dpdk/mk/rte.sdkroot.mk:77: install] Error 2


*Build Build Failed #8:
OS: FC32-64
Target: x86_64-native-linuxapp-clang
  SYMLINK-FILE include/rte_pmd_dlb.h
  CC dlb.o
In file included from /root/FC32-64_K5.6.0_Clang10.0.0/x86_64-native-linuxapp-clang/608fc020b86c4e05bcc0541c552e57ed/dpdk/drivers/event/dlb/dlb.c:34:
/root/FC32-64_K5.6.0_Clang10.0.0/x86_64-native-linuxapp-clang/608fc020b86c4e05bcc0541c552e57ed/dpdk/drivers/event/dlb/dlb_priv.h:358:4: error: attribute '__aligned__' is ignored, place it after "struct" to apply attribute to type declaration [-Werror,-Wignored-attributes]
}; __rte_cache_aligned
   ^
/root/FC32-64_K5.6.0_Clang10.0.0/x86_64-native-linuxapp-clang/608fc020b86c4e05bcc0541c552e57ed/dpdk/x86_64-native-linuxapp-clang/include/rte_common.h:367:29: note: expanded from macro '__rte_cache_aligned'
--
#define __rte_aligned(a) __attribute__((__aligned__(a)))
                                        ^
In file included from /root/FC32-64_K5.6.0_Clang10.0.0/x86_64-native-linuxapp-clang/608fc020b86c4e05bcc0541c552e57ed/dpdk/drivers/event/dlb/dlb.c:36:
/root/FC32-64_K5.6.0_Clang10.0.0/x86_64-native-linuxapp-clang/608fc020b86c4e05bcc0541c552e57ed/dpdk/drivers/event/dlb/dlb_inline_fns.h:46:2: error: use of unknown builtin '__builtin_ia32_movntdq' [-Wimplicit-function-declaration]
        __builtin_ia32_movntdq((__v2di *)pp_addr + 0, (__v2di)src_data0);
        ^
/root/FC32-64_K5.6.0_Clang10.0.0/x86_64-native-linuxapp-clang/608fc020b86c4e05bcc0541c552e57ed/dpdk/drivers/event/dlb/dlb_inline_fns.h:46:2: note: did you mean '__builtin_ia32_movntq'?
--
  __builtin_ia32_movntq(__p, __a);
  ^
In file included from /root/FC32-64_K5.6.0_Clang10.0.0/x86_64-native-linuxapp-clang/608fc020b86c4e05bcc0541c552e57ed/dpdk/drivers/event/dlb/dlb.c:36:
/root/FC32-64_K5.6.0_Clang10.0.0/x86_64-native-linuxapp-clang/608fc020b86c4e05bcc0541c552e57ed/dpdk/drivers/event/dlb/dlb_inline_fns.h:62:2: error: use of unknown builtin '__builtin_ia32_movntdq' [-Wimplicit-function-declaration]
        __builtin_ia32_movntdq((__v2di *)pp_addr, (__v2di)src_data0);
        ^
3 errors generated.
make[6]: *** [/root/FC32-64_K5.6.0_Clang10.0.0/x86_64-native-linuxapp-clang/608fc020b86c4e05bcc0541c552e57ed/dpdk/mk/internal/rte.compile-pre.mk:116: dlb.o] Error 1
make[5]: *** [/root/FC32-64_K5.6.0_Clang10.0.0/x86_64-native-linuxapp-clang/608fc020b86c4e05bcc0541c552e57ed/dpdk/mk/rte.subdir.mk:37: dlb] Error 2
make[5]: *** Waiting for unfinished jobs....
  CC otx2_worker.o
  CC opdl_evdev.o
--
  CC otx2_evdev_irq.o
  AR librte_pmd_octeontx2_event.a
  INSTALL-LIB librte_pmd_octeontx2_event.a
make[4]: *** [/root/FC32-64_K5.6.0_Clang10.0.0/x86_64-native-linuxapp-clang/608fc020b86c4e05bcc0541c552e57ed/dpdk/mk/rte.subdir.mk:37: event] Error 2
make[3]: *** [/root/FC32-64_K5.6.0_Clang10.0.0/x86_64-native-linuxapp-clang/608fc020b86c4e05bcc0541c552e57ed/dpdk/mk/rte.sdkbuild.mk:51: drivers] Error 2
make[2]: *** [/root/FC32-64_K5.6.0_Clang10.0.0/x86_64-native-linuxapp-clang/608fc020b86c4e05bcc0541c552e57ed/dpdk/mk/rte.sdkroot.mk:99: all] Error 2
make[1]: *** [/root/FC32-64_K5.6.0_Clang10.0.0/x86_64-native-linuxapp-clang/608fc020b86c4e05bcc0541c552e57ed/dpdk/mk/rte.sdkinstall.mk:61: pre_install] Error 2
make: *** [/root/FC32-64_K5.6.0_Clang10.0.0/x86_64-native-linuxapp-clang/608fc020b86c4e05bcc0541c552e57ed/dpdk/mk/rte.sdkroot.mk:77: install] Error 2


*Build Build Failed #9:
OS: FreeBSD1201-64
Target: x86_64-native-bsdapp-gcc
awk -f /usr/src/sys/tools/makeobjops.awk /usr/src/sys/kern/bus_if.m -h
awk -f /usr/src/sys/tools/makeobjops.awk /usr/src/sys/dev/pci/pci_if.m -h
Warning: Object directory not changed from original /root/FreeBSD1201-64_K12.1_GCC9.2.0/x86_64-native-bsdapp-gcc/608fc020b86c4e05bcc0541c552e57ed/dpdk/x86_64-native-bsdapp-gcc/build/kernel/freebsd/contigmem
cc  -Winline -Wall -Werror -include /root/FreeBSD1201-64_K12.1_GCC9.2.0/x86_64-native-bsdapp-gcc/608fc020b86c4e05bcc0541c552e57ed/dpdk/x86_64-native-bsdapp-gcc/include/rte_config.h  -Werror -D_KERNEL -DKLD_MODULE -nostdinc  -I/root/FreeBSD1201-64_K12.1_GCC9.2.0/x86_64-native-bsdapp-gcc/608fc020b86c4e05bcc0541c552e57ed/dpdk/kernel/freebsd/contigmem -I/root/FreeBSD1201-64_K12.1_GCC9.2.0/x86_64-native-bsdapp-gcc/608fc020b86c4e05bcc0541c552e57ed/dpdk/x86_64-native-bsdapp-gcc/include -I. -I/usr/src/sys -I/usr/src/sys/contrib/ck/include -fno-common  -fno-omit-frame-pointer -mno-omit-leaf-frame-pointer -fdebug-prefix-map=./machine=/usr/src/sys/amd64/include -fdebug-prefix-map=./x86=/usr/src/sys/x86/include   -MD  -MF.depend.contigmem.o -MTcontigmem.o -mcmodel=kernel -mno-red-zone -mno-mmx -mno-sse -msoft-float  -fno-asynchronous-unwind-tables -ffreestanding -fwrapv -fstack-protector -Wall -Wredundant-decls -Wnested-externs -Wstrict-prototypes -Wmissing-prototypes -Wpointer-arith -Wcast-qual -Wundef -Wno-pointer-sign -D__printf__=__freebsd_kprintf__ -Wmissing-include-dirs -fdiagnostics-show-option -Wno-unknown-pragmas -Wno-error-tautological-compare -Wno-error-empty-body -Wno-error-parentheses-equality -Wno-error-unused-function -Wno-error-pointer-sign -Wno-error-shift-negative-value -Wno-address-of-packed-member  -mno-aes -mno-avx  -std=iso9899:1999 -c contigmem.c -o contigmem.o
== Build drivers/common
Warning: Object directory not changed from original /root/FreeBSD1201-64_K12.1_GCC9.2.0/x86_64-native-bsdapp-gcc/608fc020b86c4e05bcc0541c552e57ed/dpdk/x86_64-native-bsdapp-gcc/build/kernel/freebsd/nic_uio
cc  -Winline -Wall -Werror -include /root/FreeBSD1201-64_K12.1_GCC9.2.0/x86_64-native-bsdapp-gcc/608fc020b86c4e05bcc0541c552e57ed/dpdk/x86_64-native-bsdapp-gcc/include/rte_config.h  -Werror -D_KERNEL -DKLD_MODULE -nostdinc  -I/root/FreeBSD1201-64_K12.1_GCC9.2.0/x86_64-native-bsdapp-gcc/608fc020b86c4e05bcc0541c552e57ed/dpdk/kernel/freebsd/nic_uio -I/root/FreeBSD1201-64_K12.1_GCC9.2.0/x86_64-native-bsdapp-gcc/608fc020b86c4e05bcc0541c552e57ed/dpdk/x86_64-native-bsdapp-gcc/include -I. -I/usr/src/sys -I/usr/src/sys/contrib/ck/include -fno-common  -fno-omit-frame-pointer -mno-omit-leaf-frame-pointer -fdebug-prefix-map=./machine=/usr/src/sys/amd64/include -fdebug-prefix-map=./x86=/usr/src/sys/x86/include   -MD  -MF.depend.nic_uio.o -MTnic_uio.o -mcmodel=kernel -mno-red-zone -mno-mmx -mno-sse -msoft-float  -fno-asynchronous-unwind-tables -ffreestanding -fwrapv -fstack-protector -Wall -Wredundant-decls -Wnested-externs -Wstrict-prototypes -Wmissing-prototypes -Wpointer-arith -Wcast-qual -Wundef -Wno-pointer-sign -D__printf__=__freebsd_kprintf__ -Wmissing-include-dirs -fdiagnostics-show-option -Wno-unknown-pragmas -Wno-error-tautological-compare -Wno-error-empty-body -Wno-error-parentheses-equality -Wno-error-unused-function -Wno-error-pointer-sign -Wno-error-shift-negative-value -Wno-address-of-packed-member  -mno-aes -mno-avx  -std=iso9899:1999 -c nic_uio.c -o nic_uio.o
ld -m elf_x86_64_fbsd -L/root/FreeBSD1201-64_K12.1_GCC9.2.0/x86_64-native-bsdapp-gcc/608fc020b86c4e05bcc0541c552e57ed/dpdk/x86_64-native-bsdapp-gcc/lib -d -warn-common --build-id=sha1 -r -d -o contigmem.ko contigmem.o
:> export_syms
awk -f /usr/src/sys/conf/kmod_syms.awk contigmem.ko  export_syms | xargs -J% objcopy % contigmem.ko
--
  CC dlb.o
In file included from /root/FreeBSD1201-64_K12.1_GCC9.2.0/x86_64-native-bsdapp-gcc/608fc020b86c4e05bcc0541c552e57ed/dpdk/drivers/event/dlb/dlb_priv.h:12,
                 from /root/FreeBSD1201-64_K12.1_GCC9.2.0/x86_64-native-bsdapp-gcc/608fc020b86c4e05bcc0541c552e57ed/dpdk/drivers/event/dlb/dlb.c:34:
/root/FreeBSD1201-64_K12.1_GCC9.2.0/x86_64-native-bsdapp-gcc/608fc020b86c4e05bcc0541c552e57ed/dpdk/drivers/event/dlb/dlb_user.h:10:10: fatal error: linux/types.h: No such file or directory
   10 | #include <linux/types.h>
      |          ^~~~~~~~~~~~~~~
compilation terminated.
gmake[6]: *** [/root/FreeBSD1201-64_K12.1_GCC9.2.0/x86_64-native-bsdapp-gcc/608fc020b86c4e05bcc0541c552e57ed/dpdk/mk/internal/rte.compile-pre.mk:116: dlb.o] Error 1
gmake[5]: *** [/root/FreeBSD1201-64_K12.1_GCC9.2.0/x86_64-native-bsdapp-gcc/608fc020b86c4e05bcc0541c552e57ed/dpdk/mk/rte.subdir.mk:37: dlb] Error 2
gmake[5]: *** Waiting for unfinished jobs....
  CC otx2_tim_worker.o
  CC otx2_evdev.o
--
  CC otx2_evdev_irq.o
  AR librte_pmd_octeontx2_event.a
  INSTALL-LIB librte_pmd_octeontx2_event.a
gmake[4]: *** [/root/FreeBSD1201-64_K12.1_GCC9.2.0/x86_64-native-bsdapp-gcc/608fc020b86c4e05bcc0541c552e57ed/dpdk/mk/rte.subdir.mk:37: event] Error 2
gmake[3]: *** [/root/FreeBSD1201-64_K12.1_GCC9.2.0/x86_64-native-bsdapp-gcc/608fc020b86c4e05bcc0541c552e57ed/dpdk/mk/rte.sdkbuild.mk:51: drivers] Error 2
gmake[2]: *** [/root/FreeBSD1201-64_K12.1_GCC9.2.0/x86_64-native-bsdapp-gcc/608fc020b86c4e05bcc0541c552e57ed/dpdk/mk/rte.sdkroot.mk:99: all] Error 2
gmake[1]: *** [/root/FreeBSD1201-64_K12.1_GCC9.2.0/x86_64-native-bsdapp-gcc/608fc020b86c4e05bcc0541c552e57ed/dpdk/mk/rte.sdkinstall.mk:61: pre_install] Error 2
gmake: *** [/root/FreeBSD1201-64_K12.1_GCC9.2.0/x86_64-native-bsdapp-gcc/608fc020b86c4e05bcc0541c552e57ed/dpdk/mk/rte.sdkroot.mk:77: install] Error 2


*Build Build Failed #10:
OS: FreeBSD1201-64
Target: x86_64-native-bsdapp-clang
awk -f /usr/src/sys/tools/makeobjops.awk /usr/src/sys/kern/bus_if.m -h
awk -f /usr/src/sys/tools/makeobjops.awk /usr/src/sys/dev/pci/pci_if.m -h
Warning: Object directory not changed from original /root/FreeBSD1201-64_K12.1_Clang8.0.1/x86_64-native-bsdapp-clang/608fc020b86c4e05bcc0541c552e57ed/dpdk/x86_64-native-bsdapp-clang/build/kernel/freebsd/contigmem
cc  -Winline -Wall -Werror -include /root/FreeBSD1201-64_K12.1_Clang8.0.1/x86_64-native-bsdapp-clang/608fc020b86c4e05bcc0541c552e57ed/dpdk/x86_64-native-bsdapp-clang/include/rte_config.h  -Werror -D_KERNEL -DKLD_MODULE -nostdinc  -I/root/FreeBSD1201-64_K12.1_Clang8.0.1/x86_64-native-bsdapp-clang/608fc020b86c4e05bcc0541c552e57ed/dpdk/kernel/freebsd/contigmem -I/root/FreeBSD1201-64_K12.1_Clang8.0.1/x86_64-native-bsdapp-clang/608fc020b86c4e05bcc0541c552e57ed/dpdk/x86_64-native-bsdapp-clang/include -I. -I/usr/src/sys -I/usr/src/sys/contrib/ck/include -fno-common  -fno-omit-frame-pointer -mno-omit-leaf-frame-pointer -fdebug-prefix-map=./machine=/usr/src/sys/amd64/include -fdebug-prefix-map=./x86=/usr/src/sys/x86/include   -MD  -MF.depend.contigmem.o -MTcontigmem.o -mcmodel=kernel -mno-red-zone -mno-mmx -mno-sse -msoft-float  -fno-asynchronous-unwind-tables -ffreestanding -fwrapv -fstack-protector -Wall -Wredundant-decls -Wnested-externs -Wstrict-prototypes -Wmissing-prototypes -Wpointer-arith -Wcast-qual -Wundef -Wno-pointer-sign -D__printf__=__freebsd_kprintf__ -Wmissing-include-dirs -fdiagnostics-show-option -Wno-unknown-pragmas -Wno-error-tautological-compare -Wno-error-empty-body -Wno-error-parentheses-equality -Wno-error-unused-function -Wno-error-pointer-sign -Wno-error-shift-negative-value -Wno-address-of-packed-member  -mno-aes -mno-avx  -std=iso9899:1999 -c contigmem.c -o contigmem.o
== Build drivers/common
Warning: Object directory not changed from original /root/FreeBSD1201-64_K12.1_Clang8.0.1/x86_64-native-bsdapp-clang/608fc020b86c4e05bcc0541c552e57ed/dpdk/x86_64-native-bsdapp-clang/build/kernel/freebsd/nic_uio
cc  -Winline -Wall -Werror -include /root/FreeBSD1201-64_K12.1_Clang8.0.1/x86_64-native-bsdapp-clang/608fc020b86c4e05bcc0541c552e57ed/dpdk/x86_64-native-bsdapp-clang/include/rte_config.h  -Werror -D_KERNEL -DKLD_MODULE -nostdinc  -I/root/FreeBSD1201-64_K12.1_Clang8.0.1/x86_64-native-bsdapp-clang/608fc020b86c4e05bcc0541c552e57ed/dpdk/kernel/freebsd/nic_uio -I/root/FreeBSD1201-64_K12.1_Clang8.0.1/x86_64-native-bsdapp-clang/608fc020b86c4e05bcc0541c552e57ed/dpdk/x86_64-native-bsdapp-clang/include -I. -I/usr/src/sys -I/usr/src/sys/contrib/ck/include -fno-common  -fno-omit-frame-pointer -mno-omit-leaf-frame-pointer -fdebug-prefix-map=./machine=/usr/src/sys/amd64/include -fdebug-prefix-map=./x86=/usr/src/sys/x86/include   -MD  -MF.depend.nic_uio.o -MTnic_uio.o -mcmodel=kernel -mno-red-zone -mno-mmx -mno-sse -msoft-float  -fno-asynchronous-unwind-tables -ffreestanding -fwrapv -fstack-protector -Wall -Wredundant-decls -Wnested-externs -Wstrict-prototypes -Wmissing-prototypes -Wpointer-arith -Wcast-qual -Wundef -Wno-pointer-sign -D__printf__=__freebsd_kprintf__ -Wmissing-include-dirs -fdiagnostics-show-option -Wno-unknown-pragmas -Wno-error-tautological-compare -Wno-error-empty-body -Wno-error-parentheses-equality -Wno-error-unused-function -Wno-error-pointer-sign -Wno-error-shift-negative-value -Wno-address-of-packed-member  -mno-aes -mno-avx  -std=iso9899:1999 -c nic_uio.c -o nic_uio.o
== Build drivers/common/cpt
ld -m elf_x86_64_fbsd -L/root/FreeBSD1201-64_K12.1_Clang8.0.1/x86_64-native-bsdapp-clang/608fc020b86c4e05bcc0541c552e57ed/dpdk/x86_64-native-bsdapp-clang/lib -d -warn-common --build-id=sha1 -r -d -o nic_uio.ko nic_uio.o
:> export_syms
--
  CC dlb.o
In file included from /root/FreeBSD1201-64_K12.1_Clang8.0.1/x86_64-native-bsdapp-clang/608fc020b86c4e05bcc0541c552e57ed/dpdk/drivers/event/dlb/dlb.c:34:
In file included from /root/FreeBSD1201-64_K12.1_Clang8.0.1/x86_64-native-bsdapp-clang/608fc020b86c4e05bcc0541c552e57ed/dpdk/drivers/event/dlb/dlb_priv.h:12:
/root/FreeBSD1201-64_K12.1_Clang8.0.1/x86_64-native-bsdapp-clang/608fc020b86c4e05bcc0541c552e57ed/dpdk/drivers/event/dlb/dlb_user.h:10:10: fatal error: 'linux/types.h' file not found
#include <linux/types.h>
         ^~~~~~~~~~~~~~~
1 error generated.
gmake[6]: *** [/root/FreeBSD1201-64_K12.1_Clang8.0.1/x86_64-native-bsdapp-clang/608fc020b86c4e05bcc0541c552e57ed/dpdk/mk/internal/rte.compile-pre.mk:116: dlb.o] Error 1
gmake[5]: *** [/root/FreeBSD1201-64_K12.1_Clang8.0.1/x86_64-native-bsdapp-clang/608fc020b86c4e05bcc0541c552e57ed/dpdk/mk/rte.subdir.mk:37: dlb] Error 2
gmake[5]: *** Waiting for unfinished jobs....
  CC otx2_tim_worker.o
  CC otx2_evdev.o
--
  CC otx2_evdev_irq.o
  AR librte_pmd_octeontx2_event.a
  INSTALL-LIB librte_pmd_octeontx2_event.a
gmake[4]: *** [/root/FreeBSD1201-64_K12.1_Clang8.0.1/x86_64-native-bsdapp-clang/608fc020b86c4e05bcc0541c552e57ed/dpdk/mk/rte.subdir.mk:37: event] Error 2
gmake[3]: *** [/root/FreeBSD1201-64_K12.1_Clang8.0.1/x86_64-native-bsdapp-clang/608fc020b86c4e05bcc0541c552e57ed/dpdk/mk/rte.sdkbuild.mk:51: drivers] Error 2
gmake[2]: *** [/root/FreeBSD1201-64_K12.1_Clang8.0.1/x86_64-native-bsdapp-clang/608fc020b86c4e05bcc0541c552e57ed/dpdk/mk/rte.sdkroot.mk:99: all] Error 2
gmake[1]: *** [/root/FreeBSD1201-64_K12.1_Clang8.0.1/x86_64-native-bsdapp-clang/608fc020b86c4e05bcc0541c552e57ed/dpdk/mk/rte.sdkinstall.mk:61: pre_install] Error 2
gmake: *** [/root/FreeBSD1201-64_K12.1_Clang8.0.1/x86_64-native-bsdapp-clang/608fc020b86c4e05bcc0541c552e57ed/dpdk/mk/rte.sdkroot.mk:77: install] Error 2


*Build Build Failed #11:
OS: FreeBSD1201-64
Target: x86_64-native-bsdapp-gcc+shared
awk -f /usr/src/sys/tools/makeobjops.awk /usr/src/sys/kern/bus_if.m -h
awk -f /usr/src/sys/tools/makeobjops.awk /usr/src/sys/kern/bus_if.m -h
Warning: Object directory not changed from original /root/FreeBSD1201-64_K12.1_GCC7.3.0/x86_64-native-bsdapp-gcc+shared/608fc020b86c4e05bcc0541c552e57ed/dpdk/x86_64-native-bsdapp-gcc/build/kernel/freebsd/contigmem
cc  -Winline -Wall -Werror -include /root/FreeBSD1201-64_K12.1_GCC7.3.0/x86_64-native-bsdapp-gcc+shared/608fc020b86c4e05bcc0541c552e57ed/dpdk/x86_64-native-bsdapp-gcc/include/rte_config.h  -Werror -D_KERNEL -DKLD_MODULE -nostdinc  -I/root/FreeBSD1201-64_K12.1_GCC7.3.0/x86_64-native-bsdapp-gcc+shared/608fc020b86c4e05bcc0541c552e57ed/dpdk/kernel/freebsd/contigmem -I/root/FreeBSD1201-64_K12.1_GCC7.3.0/x86_64-native-bsdapp-gcc+shared/608fc020b86c4e05bcc0541c552e57ed/dpdk/x86_64-native-bsdapp-gcc/include -I. -I/usr/src/sys -I/usr/src/sys/contrib/ck/include -fno-common  -fno-omit-frame-pointer -mno-omit-leaf-frame-pointer -fdebug-prefix-map=./machine=/usr/src/sys/amd64/include -fdebug-prefix-map=./x86=/usr/src/sys/x86/include   -MD  -MF.depend.contigmem.o -MTcontigmem.o -mcmodel=kernel -mno-red-zone -mno-mmx -mno-sse -msoft-float  -fno-asynchronous-unwind-tables -ffreestanding -fwrapv -fstack-protector -Wall -Wredundant-decls -Wnested-externs -Wstrict-prototypes -Wmissing-prototypes -Wpointer-arith -Wcast-qual -Wundef -Wno-pointer-sign -D__printf__=__freebsd_kprintf__ -Wmissing-include-dirs -fdiagnostics-show-option -Wno-unknown-pragmas -Wno-error-tautological-compare -Wno-error-empty-body -Wno-error-parentheses-equality -Wno-error-unused-function -Wno-error-pointer-sign -Wno-error-shift-negative-value -Wno-address-of-packed-member  -mno-aes -mno-avx  -std=iso9899:1999 -c contigmem.c -o contigmem.o
awk -f /usr/src/sys/tools/makeobjops.awk /usr/src/sys/dev/pci/pci_if.m -h
== Build drivers/common
Warning: Object directory not changed from original /root/FreeBSD1201-64_K12.1_GCC7.3.0/x86_64-native-bsdapp-gcc+shared/608fc020b86c4e05bcc0541c552e57ed/dpdk/x86_64-native-bsdapp-gcc/build/kernel/freebsd/nic_uio
cc  -Winline -Wall -Werror -include /root/FreeBSD1201-64_K12.1_GCC7.3.0/x86_64-native-bsdapp-gcc+shared/608fc020b86c4e05bcc0541c552e57ed/dpdk/x86_64-native-bsdapp-gcc/include/rte_config.h  -Werror -D_KERNEL -DKLD_MODULE -nostdinc  -I/root/FreeBSD1201-64_K12.1_GCC7.3.0/x86_64-native-bsdapp-gcc+shared/608fc020b86c4e05bcc0541c552e57ed/dpdk/kernel/freebsd/nic_uio -I/root/FreeBSD1201-64_K12.1_GCC7.3.0/x86_64-native-bsdapp-gcc+shared/608fc020b86c4e05bcc0541c552e57ed/dpdk/x86_64-native-bsdapp-gcc/include -I. -I/usr/src/sys -I/usr/src/sys/contrib/ck/include -fno-common  -fno-omit-frame-pointer -mno-omit-leaf-frame-pointer -fdebug-prefix-map=./machine=/usr/src/sys/amd64/include -fdebug-prefix-map=./x86=/usr/src/sys/x86/include   -MD  -MF.depend.nic_uio.o -MTnic_uio.o -mcmodel=kernel -mno-red-zone -mno-mmx -mno-sse -msoft-float  -fno-asynchronous-unwind-tables -ffreestanding -fwrapv -fstack-protector -Wall -Wredundant-decls -Wnested-externs -Wstrict-prototypes -Wmissing-prototypes -Wpointer-arith -Wcast-qual -Wundef -Wno-pointer-sign -D__printf__=__freebsd_kprintf__ -Wmissing-include-dirs -fdiagnostics-show-option -Wno-unknown-pragmas -Wno-error-tautological-compare -Wno-error-empty-body -Wno-error-parentheses-equality -Wno-error-unused-function -Wno-error-pointer-sign -Wno-error-shift-negative-value -Wno-address-of-packed-member  -mno-aes -mno-avx  -std=iso9899:1999 -c nic_uio.c -o nic_uio.o
ld -m elf_x86_64_fbsd -L/root/FreeBSD1201-64_K12.1_GCC7.3.0/x86_64-native-bsdapp-gcc+shared/608fc020b86c4e05bcc0541c552e57ed/dpdk/x86_64-native-bsdapp-gcc/lib -d -warn-common --build-id=sha1 -r -d -o contigmem.ko contigmem.o
:> export_syms
awk -f /usr/src/sys/conf/kmod_syms.awk contigmem.ko  export_syms | xargs -J% objcopy % contigmem.ko
--
  CC dlb.o
In file included from /root/FreeBSD1201-64_K12.1_GCC7.3.0/x86_64-native-bsdapp-gcc+shared/608fc020b86c4e05bcc0541c552e57ed/dpdk/drivers/event/dlb/dlb_priv.h:12,
                 from /root/FreeBSD1201-64_K12.1_GCC7.3.0/x86_64-native-bsdapp-gcc+shared/608fc020b86c4e05bcc0541c552e57ed/dpdk/drivers/event/dlb/dlb.c:34:
/root/FreeBSD1201-64_K12.1_GCC7.3.0/x86_64-native-bsdapp-gcc+shared/608fc020b86c4e05bcc0541c552e57ed/dpdk/drivers/event/dlb/dlb_user.h:10:10: fatal error: linux/types.h: No such file or directory
   10 | #include <linux/types.h>
      |          ^~~~~~~~~~~~~~~
compilation terminated.
gmake[6]: *** [/root/FreeBSD1201-64_K12.1_GCC7.3.0/x86_64-native-bsdapp-gcc+shared/608fc020b86c4e05bcc0541c552e57ed/dpdk/mk/internal/rte.compile-pre.mk:116: dlb.o] Error 1
gmake[5]: *** [/root/FreeBSD1201-64_K12.1_GCC7.3.0/x86_64-native-bsdapp-gcc+shared/608fc020b86c4e05bcc0541c552e57ed/dpdk/mk/rte.subdir.mk:37: dlb] Error 2
gmake[5]: *** Waiting for unfinished jobs....
  CC opdl_evdev_init.o
  CC opdl_evdev_xstats.o
--
  CC otx2_evdev_irq.o
  LD librte_pmd_octeontx2_event.so.20.0.3
  INSTALL-LIB librte_pmd_octeontx2_event.so.20.0.3
gmake[4]: *** [/root/FreeBSD1201-64_K12.1_GCC7.3.0/x86_64-native-bsdapp-gcc+shared/608fc020b86c4e05bcc0541c552e57ed/dpdk/mk/rte.subdir.mk:37: event] Error 2
gmake[3]: *** [/root/FreeBSD1201-64_K12.1_GCC7.3.0/x86_64-native-bsdapp-gcc+shared/608fc020b86c4e05bcc0541c552e57ed/dpdk/mk/rte.sdkbuild.mk:51: drivers] Error 2
gmake[2]: *** [/root/FreeBSD1201-64_K12.1_GCC7.3.0/x86_64-native-bsdapp-gcc+shared/608fc020b86c4e05bcc0541c552e57ed/dpdk/mk/rte.sdkroot.mk:99: all] Error 2
gmake[1]: *** [/root/FreeBSD1201-64_K12.1_GCC7.3.0/x86_64-native-bsdapp-gcc+shared/608fc020b86c4e05bcc0541c552e57ed/dpdk/mk/rte.sdkinstall.mk:61: pre_install] Error 2
gmake: *** [/root/FreeBSD1201-64_K12.1_GCC7.3.0/x86_64-native-bsdapp-gcc+shared/608fc020b86c4e05bcc0541c552e57ed/dpdk/mk/rte.sdkroot.mk:77: install] Error 2


*Build Build Failed #12:
OS: FreeBSD1201-64
Target: x86_64-native-bsdapp-gcc+debug
awk -f /usr/src/sys/tools/makeobjops.awk /usr/src/sys/kern/bus_if.m -h
== Build drivers/common
Warning: Object directory not changed from original /root/FreeBSD1201-64_K12.1_GCC7.3.0/x86_64-native-bsdapp-gcc+debug/608fc020b86c4e05bcc0541c552e57ed/dpdk/x86_64-native-bsdapp-gcc/build/kernel/freebsd/nic_uio
cc  -Winline -Wall -Werror -include /root/FreeBSD1201-64_K12.1_GCC7.3.0/x86_64-native-bsdapp-gcc+debug/608fc020b86c4e05bcc0541c552e57ed/dpdk/x86_64-native-bsdapp-gcc/include/rte_config.h  -Werror -D_KERNEL -DKLD_MODULE -nostdinc  -I/root/FreeBSD1201-64_K12.1_GCC7.3.0/x86_64-native-bsdapp-gcc+debug/608fc020b86c4e05bcc0541c552e57ed/dpdk/kernel/freebsd/nic_uio -I/root/FreeBSD1201-64_K12.1_GCC7.3.0/x86_64-native-bsdapp-gcc+debug/608fc020b86c4e05bcc0541c552e57ed/dpdk/x86_64-native-bsdapp-gcc/include -I. -I/usr/src/sys -I/usr/src/sys/contrib/ck/include -fno-common  -fno-omit-frame-pointer -mno-omit-leaf-frame-pointer -fdebug-prefix-map=./machine=/usr/src/sys/amd64/include -fdebug-prefix-map=./x86=/usr/src/sys/x86/include   -MD  -MF.depend.nic_uio.o -MTnic_uio.o -mcmodel=kernel -mno-red-zone -mno-mmx -mno-sse -msoft-float  -fno-asynchronous-unwind-tables -ffreestanding -fwrapv -fstack-protector -Wall -Wredundant-decls -Wnested-externs -Wstrict-prototypes -Wmissing-prototypes -Wpointer-arith -Wcast-qual -Wundef -Wno-pointer-sign -D__printf__=__freebsd_kprintf__ -Wmissing-include-dirs -fdiagnostics-show-option -Wno-unknown-pragmas -Wno-error-tautological-compare -Wno-error-empty-body -Wno-error-parentheses-equality -Wno-error-unused-function -Wno-error-pointer-sign -Wno-error-shift-negative-value -Wno-address-of-packed-member  -mno-aes -mno-avx  -std=iso9899:1999 -c nic_uio.c -o nic_uio.o
Warning: Object directory not changed from original /root/FreeBSD1201-64_K12.1_GCC7.3.0/x86_64-native-bsdapp-gcc+debug/608fc020b86c4e05bcc0541c552e57ed/dpdk/x86_64-native-bsdapp-gcc/build/kernel/freebsd/contigmem
cc  -Winline -Wall -Werror -include /root/FreeBSD1201-64_K12.1_GCC7.3.0/x86_64-native-bsdapp-gcc+debug/608fc020b86c4e05bcc0541c552e57ed/dpdk/x86_64-native-bsdapp-gcc/include/rte_config.h  -Werror -D_KERNEL -DKLD_MODULE -nostdinc  -I/root/FreeBSD1201-64_K12.1_GCC7.3.0/x86_64-native-bsdapp-gcc+debug/608fc020b86c4e05bcc0541c552e57ed/dpdk/kernel/freebsd/contigmem -I/root/FreeBSD1201-64_K12.1_GCC7.3.0/x86_64-native-bsdapp-gcc+debug/608fc020b86c4e05bcc0541c552e57ed/dpdk/x86_64-native-bsdapp-gcc/include -I. -I/usr/src/sys -I/usr/src/sys/contrib/ck/include -fno-common  -fno-omit-frame-pointer -mno-omit-leaf-frame-pointer -fdebug-prefix-map=./machine=/usr/src/sys/amd64/include -fdebug-prefix-map=./x86=/usr/src/sys/x86/include   -MD  -MF.depend.contigmem.o -MTcontigmem.o -mcmodel=kernel -mno-red-zone -mno-mmx -mno-sse -msoft-float  -fno-asynchronous-unwind-tables -ffreestanding -fwrapv -fstack-protector -Wall -Wredundant-decls -Wnested-externs -Wstrict-prototypes -Wmissing-prototypes -Wpointer-arith -Wcast-qual -Wundef -Wno-pointer-sign -D__printf__=__freebsd_kprintf__ -Wmissing-include-dirs -fdiagnostics-show-option -Wno-unknown-pragmas -Wno-error-tautological-compare -Wno-error-empty-body -Wno-error-parentheses-equality -Wno-error-unused-function -Wno-error-pointer-sign -Wno-error-shift-negative-value -Wno-address-of-packed-member  -mno-aes -mno-avx  -std=iso9899:1999 -c contigmem.c -o contigmem.o
ld -m elf_x86_64_fbsd -L/root/FreeBSD1201-64_K12.1_GCC7.3.0/x86_64-native-bsdapp-gcc+debug/608fc020b86c4e05bcc0541c552e57ed/dpdk/x86_64-native-bsdapp-gcc/lib -d -warn-common --build-id=sha1 -r -d -o contigmem.ko contigmem.o
ld -m elf_x86_64_fbsd -L/root/FreeBSD1201-64_K12.1_GCC7.3.0/x86_64-native-bsdapp-gcc+debug/608fc020b86c4e05bcc0541c552e57ed/dpdk/x86_64-native-bsdapp-gcc/lib -d -warn-common --build-id=sha1 -r -d -o nic_uio.ko nic_uio.o
:> export_syms
--
  CC dlb.o
In file included from /root/FreeBSD1201-64_K12.1_GCC7.3.0/x86_64-native-bsdapp-gcc+debug/608fc020b86c4e05bcc0541c552e57ed/dpdk/drivers/event/dlb/dlb_priv.h:12,
                 from /root/FreeBSD1201-64_K12.1_GCC7.3.0/x86_64-native-bsdapp-gcc+debug/608fc020b86c4e05bcc0541c552e57ed/dpdk/drivers/event/dlb/dlb.c:34:
/root/FreeBSD1201-64_K12.1_GCC7.3.0/x86_64-native-bsdapp-gcc+debug/608fc020b86c4e05bcc0541c552e57ed/dpdk/drivers/event/dlb/dlb_user.h:10:10: fatal error: linux/types.h: No such file or directory
   10 | #include <linux/types.h>
      |          ^~~~~~~~~~~~~~~
compilation terminated.
gmake[6]: *** [/root/FreeBSD1201-64_K12.1_GCC7.3.0/x86_64-native-bsdapp-gcc+debug/608fc020b86c4e05bcc0541c552e57ed/dpdk/mk/internal/rte.compile-pre.mk:116: dlb.o] Error 1
gmake[5]: *** [/root/FreeBSD1201-64_K12.1_GCC7.3.0/x86_64-native-bsdapp-gcc+debug/608fc020b86c4e05bcc0541c552e57ed/dpdk/mk/rte.subdir.mk:37: dlb] Error 2
gmake[5]: *** Waiting for unfinished jobs....
  CC otx2_tim_worker.o
  CC otx2_evdev.o
--
  CC otx2_evdev_irq.o
  AR librte_pmd_octeontx2_event.a
  INSTALL-LIB librte_pmd_octeontx2_event.a
gmake[4]: *** [/root/FreeBSD1201-64_K12.1_GCC7.3.0/x86_64-native-bsdapp-gcc+debug/608fc020b86c4e05bcc0541c552e57ed/dpdk/mk/rte.subdir.mk:37: event] Error 2
gmake[3]: *** [/root/FreeBSD1201-64_K12.1_GCC7.3.0/x86_64-native-bsdapp-gcc+debug/608fc020b86c4e05bcc0541c552e57ed/dpdk/mk/rte.sdkbuild.mk:51: drivers] Error 2
gmake[2]: *** [/root/FreeBSD1201-64_K12.1_GCC7.3.0/x86_64-native-bsdapp-gcc+debug/608fc020b86c4e05bcc0541c552e57ed/dpdk/mk/rte.sdkroot.mk:99: all] Error 2
gmake[1]: *** [/root/FreeBSD1201-64_K12.1_GCC7.3.0/x86_64-native-bsdapp-gcc+debug/608fc020b86c4e05bcc0541c552e57ed/dpdk/mk/rte.sdkinstall.mk:61: pre_install] Error 2
gmake: *** [/root/FreeBSD1201-64_K12.1_GCC7.3.0/x86_64-native-bsdapp-gcc+debug/608fc020b86c4e05bcc0541c552e57ed/dpdk/mk/rte.sdkroot.mk:77: install] Error 2


*Build Build Failed #13:
OS: RHEL77-64
Target: x86_64-native-linuxapp-gcc
  SYMLINK-FILE include/rte_pmd_dlb.h
  CC dlb.o
/root/RHEL77-64_K3.10.0_GCC4.8.5/x86_64-native-linuxapp-gcc/608fc020b86c4e05bcc0541c552e57ed/dpdk/drivers/event/dlb/dlb.c: In function ‘dlb_event_dequeue_burst_sparse’:
/root/RHEL77-64_K3.10.0_GCC4.8.5/x86_64-native-linuxapp-gcc/608fc020b86c4e05bcc0541c552e57ed/dpdk/drivers/event/dlb/dlb.c:3062:11: error: ‘cnt’ may be used uninitialized in this function [-Werror=maybe-uninitialized]
  uint16_t cnt;
           ^
/root/RHEL77-64_K3.10.0_GCC4.8.5/x86_64-native-linuxapp-gcc/608fc020b86c4e05bcc0541c552e57ed/dpdk/drivers/event/dlb/dlb.c: At top level:
cc1: error: unrecognized command line option "-Wno-address-of-packed-member" [-Werror]
cc1: all warnings being treated as errors
make[6]: *** [dlb.o] Error 1
make[5]: *** [dlb] Error 2
make[5]: *** Waiting for unfinished jobs....
  AR librte_pmd_octeontx2_event.a
  INSTALL-LIB librte_pmd_octeontx2_event.a
make[4]: *** [event] Error 2
make[3]: *** [drivers] Error 2
make[2]: *** [all] Error 2
make[1]: *** [pre_install] Error 2
make: *** [install] Error 2


*Build Build Failed #14:
OS: RHEL80-64
Target: x86_64-native-linuxapp-gcc
  LD opdl_evdev.o
  CC opdl_evdev_init.o
/root/RHEL80-64_K3.10.0_GCC8.2.1/x86_64-native-linuxapp-gcc/608fc020b86c4e05bcc0541c552e57ed/dpdk/drivers/event/dlb/dlb.c: In function ‘dlb_event_dequeue_burst_sparse’:
/root/RHEL80-64_K3.10.0_GCC8.2.1/x86_64-native-linuxapp-gcc/608fc020b86c4e05bcc0541c552e57ed/dpdk/drivers/event/dlb/dlb.c:3062:11: error: ‘cnt’ may be used uninitialized in this function [-Werror=maybe-uninitialized]
  uint16_t cnt;
           ^~~
  CC opdl_evdev_xstats.o
--
  CC dlb_iface.o
  CC dlb_xstats.o
/root/RHEL80-64_K3.10.0_GCC8.2.1/x86_64-native-linuxapp-gcc/608fc020b86c4e05bcc0541c552e57ed/dpdk/drivers/event/dlb/dlb.c: At top level:
cc1: error: unrecognized command line option ‘-Wno-address-of-packed-member’ [-Werror]
cc1: all warnings being treated as errors
make[6]: *** [/root/RHEL80-64_K3.10.0_GCC8.2.1/x86_64-native-linuxapp-gcc/608fc020b86c4e05bcc0541c552e57ed/dpdk/mk/internal/rte.compile-pre.mk:116: dlb.o] Error 1
make[6]: *** Waiting for unfinished jobs....
  CC otx2_worker.o
make[5]: *** [/root/RHEL80-64_K3.10.0_GCC8.2.1/x86_64-native-linuxapp-gcc/608fc020b86c4e05bcc0541c552e57ed/dpdk/mk/rte.subdir.mk:35: dlb] Error 2
make[5]: *** Waiting for unfinished jobs....
  CC otx2_tim_worker.o
  CC otx2_evdev.o
--
  CC otx2_evdev_irq.o
  AR librte_pmd_octeontx2_event.a
  INSTALL-LIB librte_pmd_octeontx2_event.a
make[4]: *** [/root/RHEL80-64_K3.10.0_GCC8.2.1/x86_64-native-linuxapp-gcc/608fc020b86c4e05bcc0541c552e57ed/dpdk/mk/rte.subdir.mk:37: event] Error 2
make[3]: *** [/root/RHEL80-64_K3.10.0_GCC8.2.1/x86_64-native-linuxapp-gcc/608fc020b86c4e05bcc0541c552e57ed/dpdk/mk/rte.sdkbuild.mk:51: drivers] Error 2
make[2]: *** [/root/RHEL80-64_K3.10.0_GCC8.2.1/x86_64-native-linuxapp-gcc/608fc020b86c4e05bcc0541c552e57ed/dpdk/mk/rte.sdkroot.mk:99: all] Error 2
make[1]: *** [/root/RHEL80-64_K3.10.0_GCC8.2.1/x86_64-native-linuxapp-gcc/608fc020b86c4e05bcc0541c552e57ed/dpdk/mk/rte.sdkinstall.mk:61: pre_install] Error 2
make: *** [/root/RHEL80-64_K3.10.0_GCC8.2.1/x86_64-native-linuxapp-gcc/608fc020b86c4e05bcc0541c552e57ed/dpdk/mk/rte.sdkroot.mk:77: install] Error 2


*Build Build Failed #15:
OS: SUSE15-64
Target: x86_64-native-linuxapp-clang
  CC opdl_ring.o
  CC dlb.o
In file included from /root/SUSE15-64_K4.12.14_Clang5.0.1/x86_64-native-linuxapp-clang/608fc020b86c4e05bcc0541c552e57ed/dpdk/drivers/event/dlb/dlb.c:34:
/root/SUSE15-64_K4.12.14_Clang5.0.1/x86_64-native-linuxapp-clang/608fc020b86c4e05bcc0541c552e57ed/dpdk/drivers/event/dlb/dlb_priv.h:358:4: error: attribute '__aligned__' is ignored, place it after "struct" to apply attribute to type declaration [-Werror,-Wignored-attributes]
}; __rte_cache_aligned
   ^
/root/SUSE15-64_K4.12.14_Clang5.0.1/x86_64-native-linuxapp-clang/608fc020b86c4e05bcc0541c552e57ed/dpdk/x86_64-native-linuxapp-clang/include/rte_common.h:367:29: note: expanded from macro '__rte_cache_aligned'
--
#define __rte_aligned(a) __attribute__((__aligned__(a)))
                                        ^
In file included from /root/SUSE15-64_K4.12.14_Clang5.0.1/x86_64-native-linuxapp-clang/608fc020b86c4e05bcc0541c552e57ed/dpdk/drivers/event/dlb/dlb.c:36:
/root/SUSE15-64_K4.12.14_Clang5.0.1/x86_64-native-linuxapp-clang/608fc020b86c4e05bcc0541c552e57ed/dpdk/drivers/event/dlb/dlb_inline_fns.h:46:2: error: use of unknown builtin '__builtin_ia32_movntdq' [-Wimplicit-function-declaration]
        __builtin_ia32_movntdq((__v2di *)pp_addr + 0, (__v2di)src_data0);
        ^
/root/SUSE15-64_K4.12.14_Clang5.0.1/x86_64-native-linuxapp-clang/608fc020b86c4e05bcc0541c552e57ed/dpdk/drivers/event/dlb/dlb_inline_fns.h:46:2: note: did you mean '__builtin_ia32_movntq'?
--
  __builtin_ia32_movntq(__p, __a);
  ^
In file included from /root/SUSE15-64_K4.12.14_Clang5.0.1/x86_64-native-linuxapp-clang/608fc020b86c4e05bcc0541c552e57ed/dpdk/drivers/event/dlb/dlb.c:36:
/root/SUSE15-64_K4.12.14_Clang5.0.1/x86_64-native-linuxapp-clang/608fc020b86c4e05bcc0541c552e57ed/dpdk/drivers/event/dlb/dlb_inline_fns.h:46:2: error: this function declaration is not a prototype [-Werror,-Wstrict-prototypes]
        __builtin_ia32_movntdq((__v2di *)pp_addr + 0, (__v2di)src_data0);
        ^
3 errors generated.
make[6]: *** [/root/SUSE15-64_K4.12.14_Clang5.0.1/x86_64-native-linuxapp-clang/608fc020b86c4e05bcc0541c552e57ed/dpdk/mk/internal/rte.compile-pre.mk:116: dlb.o] Error 1
make[5]: *** [/root/SUSE15-64_K4.12.14_Clang5.0.1/x86_64-native-linuxapp-clang/608fc020b86c4e05bcc0541c552e57ed/dpdk/mk/rte.subdir.mk:37: dlb] Error 2
make[5]: *** Waiting for unfinished jobs....
  CC otx2_tim_worker.o
  CC opdl_evdev.o
--
  INSTALL-LIB librte_pmd_opdl_event.a
  AR librte_pmd_octeontx2_event.a
  INSTALL-LIB librte_pmd_octeontx2_event.a
make[4]: *** [/root/SUSE15-64_K4.12.14_Clang5.0.1/x86_64-native-linuxapp-clang/608fc020b86c4e05bcc0541c552e57ed/dpdk/mk/rte.subdir.mk:37: event] Error 2
make[3]: *** [/root/SUSE15-64_K4.12.14_Clang5.0.1/x86_64-native-linuxapp-clang/608fc020b86c4e05bcc0541c552e57ed/dpdk/mk/rte.sdkbuild.mk:51: drivers] Error 2
make[2]: *** [/root/SUSE15-64_K4.12.14_Clang5.0.1/x86_64-native-linuxapp-clang/608fc020b86c4e05bcc0541c552e57ed/dpdk/mk/rte.sdkroot.mk:99: all] Error 2
make[1]: *** [/root/SUSE15-64_K4.12.14_Clang5.0.1/x86_64-native-linuxapp-clang/608fc020b86c4e05bcc0541c552e57ed/dpdk/mk/rte.sdkinstall.mk:61: pre_install] Error 2
make: *** [/root/SUSE15-64_K4.12.14_Clang5.0.1/x86_64-native-linuxapp-clang/608fc020b86c4e05bcc0541c552e57ed/dpdk/mk/rte.sdkroot.mk:77: install] Error 2


*Build Build Failed #16:
OS: SUSE15-64
Target: x86_64-native-linuxapp-gcc
  CC dlb.o
  CC sw_evdev_scheduler.o
/root/SUSE15-64_K4.12.14_GCC7.3.1/x86_64-native-linuxapp-gcc/608fc020b86c4e05bcc0541c552e57ed/dpdk/drivers/event/dlb/dlb.c: In function ‘dlb_event_dequeue_sparse’:
/root/SUSE15-64_K4.12.14_GCC7.3.1/x86_64-native-linuxapp-gcc/608fc020b86c4e05bcc0541c552e57ed/dpdk/drivers/event/dlb/dlb.c:3062:11: error: ‘cnt’ may be used uninitialized in this function [-Werror=maybe-uninitialized]
  uint16_t cnt;
           ^~~
/root/SUSE15-64_K4.12.14_GCC7.3.1/x86_64-native-linuxapp-gcc/608fc020b86c4e05bcc0541c552e57ed/dpdk/drivers/event/dlb/dlb.c: In function ‘dlb_event_dequeue_burst_sparse’:
/root/SUSE15-64_K4.12.14_GCC7.3.1/x86_64-native-linuxapp-gcc/608fc020b86c4e05bcc0541c552e57ed/dpdk/drivers/event/dlb/dlb.c:3062:11: error: ‘cnt’ may be used uninitialized in this function [-Werror=maybe-uninitialized]
/root/SUSE15-64_K4.12.14_GCC7.3.1/x86_64-native-linuxapp-gcc/608fc020b86c4e05bcc0541c552e57ed/dpdk/drivers/event/dlb/dlb.c: At top level:
cc1: error: unrecognized command line option ‘-Wno-address-of-packed-member’ [-Werror]
cc1: all warnings being treated as errors
make[6]: *** [/root/SUSE15-64_K4.12.14_GCC7.3.1/x86_64-native-linuxapp-gcc/608fc020b86c4e05bcc0541c552e57ed/dpdk/mk/internal/rte.compile-pre.mk:116: dlb.o] Error 1
make[5]: *** [/root/SUSE15-64_K4.12.14_GCC7.3.1/x86_64-native-linuxapp-gcc/608fc020b86c4e05bcc0541c552e57ed/dpdk/mk/rte.subdir.mk:37: dlb] Error 2
make[5]: *** Waiting for unfinished jobs....
  CC sw_evdev_xstats.o
  CC otx2_tim_worker.o
--
  CC otx2_evdev_irq.o
  AR librte_pmd_octeontx2_event.a
  INSTALL-LIB librte_pmd_octeontx2_event.a
make[4]: *** [/root/SUSE15-64_K4.12.14_GCC7.3.1/x86_64-native-linuxapp-gcc/608fc020b86c4e05bcc0541c552e57ed/dpdk/mk/rte.subdir.mk:37: event] Error 2
make[3]: *** [/root/SUSE15-64_K4.12.14_GCC7.3.1/x86_64-native-linuxapp-gcc/608fc020b86c4e05bcc0541c552e57ed/dpdk/mk/rte.sdkbuild.mk:51: drivers] Error 2
make[2]: *** [/root/SUSE15-64_K4.12.14_GCC7.3.1/x86_64-native-linuxapp-gcc/608fc020b86c4e05bcc0541c552e57ed/dpdk/mk/rte.sdkroot.mk:99: all] Error 2
make[1]: *** [/root/SUSE15-64_K4.12.14_GCC7.3.1/x86_64-native-linuxapp-gcc/608fc020b86c4e05bcc0541c552e57ed/dpdk/mk/rte.sdkinstall.mk:61: pre_install] Error 2
make: *** [/root/SUSE15-64_K4.12.14_GCC7.3.1/x86_64-native-linuxapp-gcc/608fc020b86c4e05bcc0541c552e57ed/dpdk/mk/rte.sdkroot.mk:77: install] Error 2


*Build Build Failed #17:
OS: UB1804-32
Target: i686-native-linuxapp-gcc
  SYMLINK-FILE include/rte_pmd_dlb.h
  CC dlb.o
/root/UB1804-32_K4.15.0_GCC7.3.0/i686-native-linuxapp-gcc/608fc020b86c4e05bcc0541c552e57ed/dpdk/drivers/event/dlb/dlb.c: In function ‘dlb_event_dequeue_burst_sparse’:
/root/UB1804-32_K4.15.0_GCC7.3.0/i686-native-linuxapp-gcc/608fc020b86c4e05bcc0541c552e57ed/dpdk/drivers/event/dlb/dlb.c:3062:11: error: ‘cnt’ may be used uninitialized in this function [-Werror=maybe-uninitialized]
  uint16_t cnt;
           ^~~
/root/UB1804-32_K4.15.0_GCC7.3.0/i686-native-linuxapp-gcc/608fc020b86c4e05bcc0541c552e57ed/dpdk/drivers/event/dlb/dlb.c: At top level:
cc1: error: unrecognized command line option ‘-Wno-address-of-packed-member’ [-Werror]
cc1: all warnings being treated as errors
/root/UB1804-32_K4.15.0_GCC7.3.0/i686-native-linuxapp-gcc/608fc020b86c4e05bcc0541c552e57ed/dpdk/mk/internal/rte.compile-pre.mk:114: recipe for target 'dlb.o' failed
make[6]: *** [dlb.o] Error 1
/root/UB1804-32_K4.15.0_GCC7.3.0/i686-native-linuxapp-gcc/608fc020b86c4e05bcc0541c552e57ed/dpdk/mk/rte.subdir.mk:35: recipe for target 'dlb' failed
make[5]: *** [dlb] Error 2
make[5]: *** Waiting for unfinished jobs....
  CC otx2_evdev_selftest.o
  CC otx2_evdev_irq.o
  AR librte_pmd_octeontx2_event.a
  INSTALL-LIB librte_pmd_octeontx2_event.a
/root/UB1804-32_K4.15.0_GCC7.3.0/i686-native-linuxapp-gcc/608fc020b86c4e05bcc0541c552e57ed/dpdk/mk/rte.subdir.mk:35: recipe for target 'event' failed
make[4]: *** [event] Error 2
/root/UB1804-32_K4.15.0_GCC7.3.0/i686-native-linuxapp-gcc/608fc020b86c4e05bcc0541c552e57ed/dpdk/mk/rte.sdkbuild.mk:51: recipe for target 'drivers' failed
make[3]: *** [drivers] Error 2
/root/UB1804-32_K4.15.0_GCC7.3.0/i686-native-linuxapp-gcc/608fc020b86c4e05bcc0541c552e57ed/dpdk/mk/rte.sdkroot.mk:98: recipe for target 'all' failed
make[2]: *** [all] Error 2
/root/UB1804-32_K4.15.0_GCC7.3.0/i686-native-linuxapp-gcc/608fc020b86c4e05bcc0541c552e57ed/dpdk/mk/rte.sdkinstall.mk:60: recipe for target 'pre_install' failed
make[1]: *** [pre_install] Error 2
/root/UB1804-32_K4.15.0_GCC7.3.0/i686-native-linuxapp-gcc/608fc020b86c4e05bcc0541c552e57ed/dpdk/mk/rte.sdkroot.mk:77: recipe for target 'install' failed
make: *** [install] Error 2


*Build Build Failed #18:
OS: UB1804-64
Target: x86_64-native-linuxapp-clang
  SYMLINK-FILE include/rte_pmd_dlb.h
  CC dlb.o
In file included from /root/UB1804-64_K4.15.0_Clang6.0.0/x86_64-native-linuxapp-clang/608fc020b86c4e05bcc0541c552e57ed/dpdk/drivers/event/dlb/dlb.c:34:
/root/UB1804-64_K4.15.0_Clang6.0.0/x86_64-native-linuxapp-clang/608fc020b86c4e05bcc0541c552e57ed/dpdk/drivers/event/dlb/dlb_priv.h:358:4: error: attribute '__aligned__' is ignored, place it after "struct" to apply attribute to type declaration [-Werror,-Wignored-attributes]
}; __rte_cache_aligned
   ^
/root/UB1804-64_K4.15.0_Clang6.0.0/x86_64-native-linuxapp-clang/608fc020b86c4e05bcc0541c552e57ed/dpdk/x86_64-native-linuxapp-clang/include/rte_common.h:367:29: note: expanded from macro '__rte_cache_aligned'
--
#define __rte_aligned(a) __attribute__((__aligned__(a)))
                                        ^
In file included from /root/UB1804-64_K4.15.0_Clang6.0.0/x86_64-native-linuxapp-clang/608fc020b86c4e05bcc0541c552e57ed/dpdk/drivers/event/dlb/dlb.c:36:
/root/UB1804-64_K4.15.0_Clang6.0.0/x86_64-native-linuxapp-clang/608fc020b86c4e05bcc0541c552e57ed/dpdk/drivers/event/dlb/dlb_inline_fns.h:46:2: error: use of unknown builtin '__builtin_ia32_movntdq' [-Wimplicit-function-declaration]
        __builtin_ia32_movntdq((__v2di *)pp_addr + 0, (__v2di)src_data0);
        ^
/root/UB1804-64_K4.15.0_Clang6.0.0/x86_64-native-linuxapp-clang/608fc020b86c4e05bcc0541c552e57ed/dpdk/drivers/event/dlb/dlb_inline_fns.h:46:2: note: did you mean '__builtin_ia32_movntq'?
--
  __builtin_ia32_movntq(__p, __a);
  ^
In file included from /root/UB1804-64_K4.15.0_Clang6.0.0/x86_64-native-linuxapp-clang/608fc020b86c4e05bcc0541c552e57ed/dpdk/drivers/event/dlb/dlb.c:36:
/root/UB1804-64_K4.15.0_Clang6.0.0/x86_64-native-linuxapp-clang/608fc020b86c4e05bcc0541c552e57ed/dpdk/drivers/event/dlb/dlb_inline_fns.h:46:2: error: this function declaration is not a prototype [-Werror,-Wstrict-prototypes]
        __builtin_ia32_movntdq((__v2di *)pp_addr + 0, (__v2di)src_data0);
        ^
/root/UB1804-64_K4.15.0_Clang6.0.0/x86_64-native-linuxapp-clang/608fc020b86c4e05bcc0541c552e57ed/dpdk/drivers/event/dlb/dlb_inline_fns.h:62:2: error: use of unknown builtin '__builtin_ia32_movntdq' [-Wimplicit-function-declaration]
        __builtin_ia32_movntdq((__v2di *)pp_addr, (__v2di)src_data0);
        ^
4 errors generated.
/root/UB1804-64_K4.15.0_Clang6.0.0/x86_64-native-linuxapp-clang/608fc020b86c4e05bcc0541c552e57ed/dpdk/mk/internal/rte.compile-pre.mk:114: recipe for target 'dlb.o' failed
make[6]: *** [dlb.o] Error 1
/root/UB1804-64_K4.15.0_Clang6.0.0/x86_64-native-linuxapp-clang/608fc020b86c4e05bcc0541c552e57ed/dpdk/mk/rte.subdir.mk:35: recipe for target 'dlb' failed
make[5]: *** [dlb] Error 2
make[5]: *** Waiting for unfinished jobs....
  CC otx2_evdev_selftest.o
  CC otx2_evdev_irq.o
  AR librte_pmd_octeontx2_event.a
  INSTALL-LIB librte_pmd_octeontx2_event.a
/root/UB1804-64_K4.15.0_Clang6.0.0/x86_64-native-linuxapp-clang/608fc020b86c4e05bcc0541c552e57ed/dpdk/mk/rte.subdir.mk:35: recipe for target 'event' failed
make[4]: *** [event] Error 2
/root/UB1804-64_K4.15.0_Clang6.0.0/x86_64-native-linuxapp-clang/608fc020b86c4e05bcc0541c552e57ed/dpdk/mk/rte.sdkbuild.mk:51: recipe for target 'drivers' failed
make[3]: *** [drivers] Error 2
/root/UB1804-64_K4.15.0_Clang6.0.0/x86_64-native-linuxapp-clang/608fc020b86c4e05bcc0541c552e57ed/dpdk/mk/rte.sdkroot.mk:98: recipe for target 'all' failed
make[2]: *** [all] Error 2
/root/UB1804-64_K4.15.0_Clang6.0.0/x86_64-native-linuxapp-clang/608fc020b86c4e05bcc0541c552e57ed/dpdk/mk/rte.sdkinstall.mk:60: recipe for target 'pre_install' failed
make[1]: *** [pre_install] Error 2
/root/UB1804-64_K4.15.0_Clang6.0.0/x86_64-native-linuxapp-clang/608fc020b86c4e05bcc0541c552e57ed/dpdk/mk/rte.sdkroot.mk:77: recipe for target 'install' failed
make: *** [install] Error 2


*Build Build Failed #19:
OS: UB1804-64
Target: x86_64-native-linuxapp-gcc
  CC opdl_evdev_xstats.o
  CC opdl_test.o
/root/UB1804-64_K4.15.0_GCC7.3.0/x86_64-native-linuxapp-gcc/608fc020b86c4e05bcc0541c552e57ed/dpdk/drivers/event/dlb/dlb.c: In function ‘dlb_event_dequeue_sparse’:
/root/UB1804-64_K4.15.0_GCC7.3.0/x86_64-native-linuxapp-gcc/608fc020b86c4e05bcc0541c552e57ed/dpdk/drivers/event/dlb/dlb.c:3062:11: error: ‘cnt’ may be used uninitialized in this function [-Werror=maybe-uninitialized]
  uint16_t cnt;
           ^~~
/root/UB1804-64_K4.15.0_GCC7.3.0/x86_64-native-linuxapp-gcc/608fc020b86c4e05bcc0541c552e57ed/dpdk/drivers/event/dlb/dlb.c: In function ‘dlb_event_dequeue_burst_sparse’:
/root/UB1804-64_K4.15.0_GCC7.3.0/x86_64-native-linuxapp-gcc/608fc020b86c4e05bcc0541c552e57ed/dpdk/drivers/event/dlb/dlb.c:3062:11: error: ‘cnt’ may be used uninitialized in this function [-Werror=maybe-uninitialized]
/root/UB1804-64_K4.15.0_GCC7.3.0/x86_64-native-linuxapp-gcc/608fc020b86c4e05bcc0541c552e57ed/dpdk/drivers/event/dlb/dlb.c: At top level:
cc1: error: unrecognized command line option ‘-Wno-address-of-packed-member’ [-Werror]
cc1: all warnings being treated as errors
/root/UB1804-64_K4.15.0_GCC7.3.0/x86_64-native-linuxapp-gcc/608fc020b86c4e05bcc0541c552e57ed/dpdk/mk/internal/rte.compile-pre.mk:114: recipe for target 'dlb.o' failed
make[6]: *** [dlb.o] Error 1
/root/UB1804-64_K4.15.0_GCC7.3.0/x86_64-native-linuxapp-gcc/608fc020b86c4e05bcc0541c552e57ed/dpdk/mk/rte.subdir.mk:35: recipe for target 'dlb' failed
make[5]: *** [dlb] Error 2
make[5]: *** Waiting for unfinished jobs....
  CC otx2_worker.o
  AR librte_pmd_opdl_event.a
--
  CC otx2_evdev_irq.o
  AR librte_pmd_octeontx2_event.a
  INSTALL-LIB librte_pmd_octeontx2_event.a
/root/UB1804-64_K4.15.0_GCC7.3.0/x86_64-native-linuxapp-gcc/608fc020b86c4e05bcc0541c552e57ed/dpdk/mk/rte.subdir.mk:35: recipe for target 'event' failed
make[4]: *** [event] Error 2
/root/UB1804-64_K4.15.0_GCC7.3.0/x86_64-native-linuxapp-gcc/608fc020b86c4e05bcc0541c552e57ed/dpdk/mk/rte.sdkbuild.mk:51: recipe for target 'drivers' failed
make[3]: *** [drivers] Error 2
/root/UB1804-64_K4.15.0_GCC7.3.0/x86_64-native-linuxapp-gcc/608fc020b86c4e05bcc0541c552e57ed/dpdk/mk/rte.sdkroot.mk:98: recipe for target 'all' failed
make[2]: *** [all] Error 2
/root/UB1804-64_K4.15.0_GCC7.3.0/x86_64-native-linuxapp-gcc/608fc020b86c4e05bcc0541c552e57ed/dpdk/mk/rte.sdkinstall.mk:60: recipe for target 'pre_install' failed
make[1]: *** [pre_install] Error 2
/root/UB1804-64_K4.15.0_GCC7.3.0/x86_64-native-linuxapp-gcc/608fc020b86c4e05bcc0541c552e57ed/dpdk/mk/rte.sdkroot.mk:77: recipe for target 'install' failed
make: *** [install] Error 2


*Build Build Failed #20:
OS: UB1804-64
Target: x86_64-native-linuxapp-icc
  CC pf/dlb_pf.o.pmd.o
  LD pf/dlb_pf.o
  CC pf/dlb_main.o
/root/UB1804-64_K4.15.0_ICC19.0.0/x86_64-native-linuxapp-icc/608fc020b86c4e05bcc0541c552e57ed/dpdk/drivers/event/dlb/pf/dlb_main.c(86): error: identifier "__v2di" is undefined
  	__v2di src_data0 = (__v2di){_qe[0], _qe[1]};
  	^

/root/UB1804-64_K4.15.0_ICC19.0.0/x86_64-native-linuxapp-icc/608fc020b86c4e05bcc0541c552e57ed/dpdk/drivers/event/dlb/pf/dlb_main.c(86): error: identifier "__v2di" is undefined
  	__v2di src_data0 = (__v2di){_qe[0], _qe[1]};
  	                    ^

/root/UB1804-64_K4.15.0_ICC19.0.0/x86_64-native-linuxapp-icc/608fc020b86c4e05bcc0541c552e57ed/dpdk/drivers/event/dlb/pf/dlb_main.c(86): error: expected a ";"
  	__v2di src_data0 = (__v2di){_qe[0], _qe[1]};
  	                           ^

/root/UB1804-64_K4.15.0_ICC19.0.0/x86_64-native-linuxapp-icc/608fc020b86c4e05bcc0541c552e57ed/dpdk/drivers/event/dlb/pf/dlb_main.c(87): error: expected a ";"
  	__v2di src_data1 = (__v2di){_qe[2], _qe[3]};
  	       ^

/root/UB1804-64_K4.15.0_ICC19.0.0/x86_64-native-linuxapp-icc/608fc020b86c4e05bcc0541c552e57ed/dpdk/drivers/event/dlb/pf/dlb_main.c(88): error: expected a ";"
  	__v2di src_data2 = (__v2di){_qe[4], _qe[5]};
  	       ^

/root/UB1804-64_K4.15.0_ICC19.0.0/x86_64-native-linuxapp-icc/608fc020b86c4e05bcc0541c552e57ed/dpdk/drivers/event/dlb/pf/dlb_main.c(89): error: expected a ";"
  	__v2di src_data3 = (__v2di){_qe[6], _qe[7]};
  	       ^

/root/UB1804-64_K4.15.0_ICC19.0.0/x86_64-native-linuxapp-icc/608fc020b86c4e05bcc0541c552e57ed/dpdk/drivers/event/dlb/pf/dlb_main.c(90): error: expected an expression
  	__builtin_ia32_movntdq((__v2di *)pp_addr + 0, (__v2di)src_data0);
  	                                ^

--
  	__builtin_ia32_movntdq((__v2di *)pp_addr + 0, (__v2di)src_data0);
  	                                 ^

/root/UB1804-64_K4.15.0_ICC19.0.0/x86_64-native-linuxapp-icc/608fc020b86c4e05bcc0541c552e57ed/dpdk/drivers/event/dlb/pf/dlb_main.c(90): error: expected a ")"
  	__builtin_ia32_movntdq((__v2di *)pp_addr + 0, (__v2di)src_data0);
  	                                 ^

/root/UB1804-64_K4.15.0_ICC19.0.0/x86_64-native-linuxapp-icc/608fc020b86c4e05bcc0541c552e57ed/dpdk/drivers/event/dlb/pf/dlb_main.c(92): error: expected an expression
  	__builtin_ia32_movntdq((__v2di *)pp_addr + 1, (__v2di)src_data1);
  	                                ^

--
  	__builtin_ia32_movntdq((__v2di *)pp_addr + 1, (__v2di)src_data1);
  	                                 ^

/root/UB1804-64_K4.15.0_ICC19.0.0/x86_64-native-linuxapp-icc/608fc020b86c4e05bcc0541c552e57ed/dpdk/drivers/event/dlb/pf/dlb_main.c(92): error: expected a ")"
  	__builtin_ia32_movntdq((__v2di *)pp_addr + 1, (__v2di)src_data1);
  	                                 ^

/root/UB1804-64_K4.15.0_ICC19.0.0/x86_64-native-linuxapp-icc/608fc020b86c4e05bcc0541c552e57ed/dpdk/drivers/event/dlb/pf/dlb_main.c(94): error: expected an expression
  	__builtin_ia32_movntdq((__v2di *)pp_addr + 2, (__v2di)src_data2);
  	                                ^

--
  	__builtin_ia32_movntdq((__v2di *)pp_addr + 2, (__v2di)src_data2);
  	                                 ^

/root/UB1804-64_K4.15.0_ICC19.0.0/x86_64-native-linuxapp-icc/608fc020b86c4e05bcc0541c552e57ed/dpdk/drivers/event/dlb/pf/dlb_main.c(94): error: expected a ")"
  	__builtin_ia32_movntdq((__v2di *)pp_addr + 2, (__v2di)src_data2);
  	                                 ^

/root/UB1804-64_K4.15.0_ICC19.0.0/x86_64-native-linuxapp-icc/608fc020b86c4e05bcc0541c552e57ed/dpdk/drivers/event/dlb/pf/dlb_main.c(96): error: expected an expression
  	__builtin_ia32_movntdq((__v2di *)pp_addr + 3, (__v2di)src_data3);
  	                                ^

--
  	__builtin_ia32_movntdq((__v2di *)pp_addr + 3, (__v2di)src_data3);
  	                                 ^

/root/UB1804-64_K4.15.0_ICC19.0.0/x86_64-native-linuxapp-icc/608fc020b86c4e05bcc0541c552e57ed/dpdk/drivers/event/dlb/pf/dlb_main.c(96): error: expected a ")"
  	__builtin_ia32_movntdq((__v2di *)pp_addr + 3, (__v2di)src_data3);
  	                                 ^

compilation aborted for /root/UB1804-64_K4.15.0_ICC19.0.0/x86_64-native-linuxapp-icc/608fc020b86c4e05bcc0541c552e57ed/dpdk/drivers/event/dlb/pf/dlb_main.c (code 2)
/root/UB1804-64_K4.15.0_ICC19.0.0/x86_64-native-linuxapp-icc/608fc020b86c4e05bcc0541c552e57ed/dpdk/mk/internal/rte.compile-pre.mk:114: recipe for target 'pf/dlb_main.o' failed
make[6]: *** [pf/dlb_main.o] Error 2
/root/UB1804-64_K4.15.0_ICC19.0.0/x86_64-native-linuxapp-icc/608fc020b86c4e05bcc0541c552e57ed/dpdk/mk/rte.subdir.mk:35: recipe for target 'dlb' failed
make[5]: *** [dlb] Error 2
make[5]: *** Waiting for unfinished jobs....
  CC otx2_evdev_selftest.o
  CC otx2_evdev_irq.o
  AR librte_pmd_octeontx2_event.a
  INSTALL-LIB librte_pmd_octeontx2_event.a
/root/UB1804-64_K4.15.0_ICC19.0.0/x86_64-native-linuxapp-icc/608fc020b86c4e05bcc0541c552e57ed/dpdk/mk/rte.subdir.mk:35: recipe for target 'event' failed
make[4]: *** [event] Error 2
/root/UB1804-64_K4.15.0_ICC19.0.0/x86_64-native-linuxapp-icc/608fc020b86c4e05bcc0541c552e57ed/dpdk/mk/rte.sdkbuild.mk:51: recipe for target 'drivers' failed
make[3]: *** [drivers] Error 2
/root/UB1804-64_K4.15.0_ICC19.0.0/x86_64-native-linuxapp-icc/608fc020b86c4e05bcc0541c552e57ed/dpdk/mk/rte.sdkroot.mk:98: recipe for target 'all' failed
make[2]: *** [all] Error 2
/root/UB1804-64_K4.15.0_ICC19.0.0/x86_64-native-linuxapp-icc/608fc020b86c4e05bcc0541c552e57ed/dpdk/mk/rte.sdkinstall.mk:60: recipe for target 'pre_install' failed
make[1]: *** [pre_install] Error 2
/root/UB1804-64_K4.15.0_ICC19.0.0/x86_64-native-linuxapp-icc/608fc020b86c4e05bcc0541c552e57ed/dpdk/mk/rte.sdkroot.mk:77: recipe for target 'install' failed
make: *** [install] Error 2


*Build Build Failed #21:
OS: UB2004-64
Target: x86_64-native-linuxapp-clang
  CC dlb.o
  CC opdl_evdev.o
In file included from /root/UB2004-64_K5.4.0_Clang10.0.0/x86_64-native-linuxapp-clang/608fc020b86c4e05bcc0541c552e57ed/dpdk/drivers/event/dlb/dlb.c:34:
/root/UB2004-64_K5.4.0_Clang10.0.0/x86_64-native-linuxapp-clang/608fc020b86c4e05bcc0541c552e57ed/dpdk/drivers/event/dlb/dlb_priv.h:358:4: error: attribute '__aligned__' is ignored, place it after "struct" to apply attribute to type declaration [-Werror,-Wignored-attributes]
}; __rte_cache_aligned
   ^
/root/UB2004-64_K5.4.0_Clang10.0.0/x86_64-native-linuxapp-clang/608fc020b86c4e05bcc0541c552e57ed/dpdk/x86_64-native-linuxapp-clang/include/rte_common.h:367:29: note: expanded from macro '__rte_cache_aligned'
--
#define __rte_aligned(a) __attribute__((__aligned__(a)))
                                        ^
In file included from /root/UB2004-64_K5.4.0_Clang10.0.0/x86_64-native-linuxapp-clang/608fc020b86c4e05bcc0541c552e57ed/dpdk/drivers/event/dlb/dlb.c:36:
/root/UB2004-64_K5.4.0_Clang10.0.0/x86_64-native-linuxapp-clang/608fc020b86c4e05bcc0541c552e57ed/dpdk/drivers/event/dlb/dlb_inline_fns.h:46:2: error: use of unknown builtin '__builtin_ia32_movntdq' [-Wimplicit-function-declaration]
        __builtin_ia32_movntdq((__v2di *)pp_addr + 0, (__v2di)src_data0);
        ^
/root/UB2004-64_K5.4.0_Clang10.0.0/x86_64-native-linuxapp-clang/608fc020b86c4e05bcc0541c552e57ed/dpdk/drivers/event/dlb/dlb_inline_fns.h:46:2: note: did you mean '__builtin_ia32_movntq'?
--
  __builtin_ia32_movntq(__p, __a);
  ^
In file included from /root/UB2004-64_K5.4.0_Clang10.0.0/x86_64-native-linuxapp-clang/608fc020b86c4e05bcc0541c552e57ed/dpdk/drivers/event/dlb/dlb.c:36:
/root/UB2004-64_K5.4.0_Clang10.0.0/x86_64-native-linuxapp-clang/608fc020b86c4e05bcc0541c552e57ed/dpdk/drivers/event/dlb/dlb_inline_fns.h:62:2: error: use of unknown builtin '__builtin_ia32_movntdq' [-Wimplicit-function-declaration]
        __builtin_ia32_movntdq((__v2di *)pp_addr, (__v2di)src_data0);
        ^
3 errors generated.
make[6]: *** [/root/UB2004-64_K5.4.0_Clang10.0.0/x86_64-native-linuxapp-clang/608fc020b86c4e05bcc0541c552e57ed/dpdk/mk/internal/rte.compile-pre.mk:116: dlb.o] Error 1
make[5]: *** [/root/UB2004-64_K5.4.0_Clang10.0.0/x86_64-native-linuxapp-clang/608fc020b86c4e05bcc0541c552e57ed/dpdk/mk/rte.subdir.mk:37: dlb] Error 2
make[5]: *** Waiting for unfinished jobs....
  PMDINFO opdl_evdev.o.pmd.c
  CC opdl_evdev_init.o
--
  CC otx2_evdev_irq.o
  AR librte_pmd_octeontx2_event.a
  INSTALL-LIB librte_pmd_octeontx2_event.a
make[4]: *** [/root/UB2004-64_K5.4.0_Clang10.0.0/x86_64-native-linuxapp-clang/608fc020b86c4e05bcc0541c552e57ed/dpdk/mk/rte.subdir.mk:37: event] Error 2
make[3]: *** [/root/UB2004-64_K5.4.0_Clang10.0.0/x86_64-native-linuxapp-clang/608fc020b86c4e05bcc0541c552e57ed/dpdk/mk/rte.sdkbuild.mk:51: drivers] Error 2
make[2]: *** [/root/UB2004-64_K5.4.0_Clang10.0.0/x86_64-native-linuxapp-clang/608fc020b86c4e05bcc0541c552e57ed/dpdk/mk/rte.sdkroot.mk:99: all] Error 2
make[1]: *** [/root/UB2004-64_K5.4.0_Clang10.0.0/x86_64-native-linuxapp-clang/608fc020b86c4e05bcc0541c552e57ed/dpdk/mk/rte.sdkinstall.mk:61: pre_install] Error 2
make: *** [/root/UB2004-64_K5.4.0_Clang10.0.0/x86_64-native-linuxapp-clang/608fc020b86c4e05bcc0541c552e57ed/dpdk/mk/rte.sdkroot.mk:77: install] Error 2


*Build Build Failed #22:
OS: UB2004-64
Target: x86_64-native-linuxapp-gcc
  SYMLINK-FILE include/rte_pmd_dlb.h
  CC dlb.o
/root/UB2004-64_K5.4.0_GCC9.3.0/x86_64-native-linuxapp-gcc/608fc020b86c4e05bcc0541c552e57ed/dpdk/drivers/event/dlb/dlb.c: In function ‘dlb_event_dequeue_burst_sparse’:
/root/UB2004-64_K5.4.0_GCC9.3.0/x86_64-native-linuxapp-gcc/608fc020b86c4e05bcc0541c552e57ed/dpdk/drivers/event/dlb/dlb.c:3062:11: error: ‘cnt’ may be used uninitialized in this function [-Werror=maybe-uninitialized]
 3062 |  uint16_t cnt;
      |           ^~~
cc1: all warnings being treated as errors
make[6]: *** [/root/UB2004-64_K5.4.0_GCC9.3.0/x86_64-native-linuxapp-gcc/608fc020b86c4e05bcc0541c552e57ed/dpdk/mk/internal/rte.compile-pre.mk:116: dlb.o] Error 1
make[5]: *** [/root/UB2004-64_K5.4.0_GCC9.3.0/x86_64-native-linuxapp-gcc/608fc020b86c4e05bcc0541c552e57ed/dpdk/mk/rte.subdir.mk:37: dlb] Error 2
make[5]: *** Waiting for unfinished jobs....
  CC otx2_tim_worker.o
  CC otx2_evdev.o
--
  CC otx2_evdev_irq.o
  AR librte_pmd_octeontx2_event.a
  INSTALL-LIB librte_pmd_octeontx2_event.a
make[4]: *** [/root/UB2004-64_K5.4.0_GCC9.3.0/x86_64-native-linuxapp-gcc/608fc020b86c4e05bcc0541c552e57ed/dpdk/mk/rte.subdir.mk:37: event] Error 2
make[3]: *** [/root/UB2004-64_K5.4.0_GCC9.3.0/x86_64-native-linuxapp-gcc/608fc020b86c4e05bcc0541c552e57ed/dpdk/mk/rte.sdkbuild.mk:51: drivers] Error 2
make[2]: *** [/root/UB2004-64_K5.4.0_GCC9.3.0/x86_64-native-linuxapp-gcc/608fc020b86c4e05bcc0541c552e57ed/dpdk/mk/rte.sdkroot.mk:99: all] Error 2
make[1]: *** [/root/UB2004-64_K5.4.0_GCC9.3.0/x86_64-native-linuxapp-gcc/608fc020b86c4e05bcc0541c552e57ed/dpdk/mk/rte.sdkinstall.mk:61: pre_install] Error 2
make: *** [/root/UB2004-64_K5.4.0_GCC9.3.0/x86_64-native-linuxapp-gcc/608fc020b86c4e05bcc0541c552e57ed/dpdk/mk/rte.sdkroot.mk:77: install] Error 2


*Build Build Failed #23:
OS: UB2004-64
Target: x86_64-native-linuxapp-icc
  CC pf/dlb_pf.o.pmd.o
  CC pf/dlb_main.o
  LD pf/dlb_pf.o
/root/UB2004-64_K5.4.0_ICC19.0.0/x86_64-native-linuxapp-icc/608fc020b86c4e05bcc0541c552e57ed/dpdk/drivers/event/dlb/pf/dlb_main.c(86): error: identifier "__v2di" is undefined
  	__v2di src_data0 = (__v2di){_qe[0], _qe[1]};
  	^

/root/UB2004-64_K5.4.0_ICC19.0.0/x86_64-native-linuxapp-icc/608fc020b86c4e05bcc0541c552e57ed/dpdk/drivers/event/dlb/pf/dlb_main.c(86): error: identifier "__v2di" is undefined
  	__v2di src_data0 = (__v2di){_qe[0], _qe[1]};
  	                    ^

/root/UB2004-64_K5.4.0_ICC19.0.0/x86_64-native-linuxapp-icc/608fc020b86c4e05bcc0541c552e57ed/dpdk/drivers/event/dlb/pf/dlb_main.c(86): error: expected a ";"
  	__v2di src_data0 = (__v2di){_qe[0], _qe[1]};
  	                           ^

/root/UB2004-64_K5.4.0_ICC19.0.0/x86_64-native-linuxapp-icc/608fc020b86c4e05bcc0541c552e57ed/dpdk/drivers/event/dlb/pf/dlb_main.c(87): error: expected a ";"
  	__v2di src_data1 = (__v2di){_qe[2], _qe[3]};
  	       ^

/root/UB2004-64_K5.4.0_ICC19.0.0/x86_64-native-linuxapp-icc/608fc020b86c4e05bcc0541c552e57ed/dpdk/drivers/event/dlb/pf/dlb_main.c(88): error: expected a ";"
  	__v2di src_data2 = (__v2di){_qe[4], _qe[5]};
  	       ^

/root/UB2004-64_K5.4.0_ICC19.0.0/x86_64-native-linuxapp-icc/608fc020b86c4e05bcc0541c552e57ed/dpdk/drivers/event/dlb/pf/dlb_main.c(89): error: expected a ";"
  	__v2di src_data3 = (__v2di){_qe[6], _qe[7]};
  	       ^

/root/UB2004-64_K5.4.0_ICC19.0.0/x86_64-native-linuxapp-icc/608fc020b86c4e05bcc0541c552e57ed/dpdk/drivers/event/dlb/pf/dlb_main.c(90): error: expected an expression
  	__builtin_ia32_movntdq((__v2di *)pp_addr + 0, (__v2di)src_data0);
  	                                ^

--
  	__builtin_ia32_movntdq((__v2di *)pp_addr + 0, (__v2di)src_data0);
  	                                 ^

/root/UB2004-64_K5.4.0_ICC19.0.0/x86_64-native-linuxapp-icc/608fc020b86c4e05bcc0541c552e57ed/dpdk/drivers/event/dlb/pf/dlb_main.c(90): error: expected a ")"
  	__builtin_ia32_movntdq((__v2di *)pp_addr + 0, (__v2di)src_data0);
  	                                 ^

/root/UB2004-64_K5.4.0_ICC19.0.0/x86_64-native-linuxapp-icc/608fc020b86c4e05bcc0541c552e57ed/dpdk/drivers/event/dlb/pf/dlb_main.c(92): error: expected an expression
  	__builtin_ia32_movntdq((__v2di *)pp_addr + 1, (__v2di)src_data1);
  	                                ^

--
  	__builtin_ia32_movntdq((__v2di *)pp_addr + 1, (__v2di)src_data1);
  	                                 ^

/root/UB2004-64_K5.4.0_ICC19.0.0/x86_64-native-linuxapp-icc/608fc020b86c4e05bcc0541c552e57ed/dpdk/drivers/event/dlb/pf/dlb_main.c(92): error: expected a ")"
  	__builtin_ia32_movntdq((__v2di *)pp_addr + 1, (__v2di)src_data1);
  	                                 ^

/root/UB2004-64_K5.4.0_ICC19.0.0/x86_64-native-linuxapp-icc/608fc020b86c4e05bcc0541c552e57ed/dpdk/drivers/event/dlb/pf/dlb_main.c(94): error: expected an expression
  	__builtin_ia32_movntdq((__v2di *)pp_addr + 2, (__v2di)src_data2);
  	                                ^

--
  	__builtin_ia32_movntdq((__v2di *)pp_addr + 2, (__v2di)src_data2);
  	                                 ^

/root/UB2004-64_K5.4.0_ICC19.0.0/x86_64-native-linuxapp-icc/608fc020b86c4e05bcc0541c552e57ed/dpdk/drivers/event/dlb/pf/dlb_main.c(94): error: expected a ")"
  	__builtin_ia32_movntdq((__v2di *)pp_addr + 2, (__v2di)src_data2);
  	                                 ^

/root/UB2004-64_K5.4.0_ICC19.0.0/x86_64-native-linuxapp-icc/608fc020b86c4e05bcc0541c552e57ed/dpdk/drivers/event/dlb/pf/dlb_main.c(96): error: expected an expression
  	__builtin_ia32_movntdq((__v2di *)pp_addr + 3, (__v2di)src_data3);
  	                                ^

--
  	__builtin_ia32_movntdq((__v2di *)pp_addr + 3, (__v2di)src_data3);
  	                                 ^

/root/UB2004-64_K5.4.0_ICC19.0.0/x86_64-native-linuxapp-icc/608fc020b86c4e05bcc0541c552e57ed/dpdk/drivers/event/dlb/pf/dlb_main.c(96): error: expected a ")"
  	__builtin_ia32_movntdq((__v2di *)pp_addr + 3, (__v2di)src_data3);
  	                                 ^

compilation aborted for /root/UB2004-64_K5.4.0_ICC19.0.0/x86_64-native-linuxapp-icc/608fc020b86c4e05bcc0541c552e57ed/dpdk/drivers/event/dlb/pf/dlb_main.c (code 2)
make[6]: *** [/root/UB2004-64_K5.4.0_ICC19.0.0/x86_64-native-linuxapp-icc/608fc020b86c4e05bcc0541c552e57ed/dpdk/mk/internal/rte.compile-pre.mk:116: pf/dlb_main.o] Error 2
make[6]: *** Waiting for unfinished jobs....
  CC otx2_worker.o
make[5]: *** [/root/UB2004-64_K5.4.0_ICC19.0.0/x86_64-native-linuxapp-icc/608fc020b86c4e05bcc0541c552e57ed/dpdk/mk/rte.subdir.mk:35: dlb] Error 2
make[5]: *** Waiting for unfinished jobs....
  CC otx2_tim_worker.o
  CC otx2_evdev.o
--
  CC otx2_evdev_irq.o
  AR librte_pmd_octeontx2_event.a
  INSTALL-LIB librte_pmd_octeontx2_event.a
make[4]: *** [/root/UB2004-64_K5.4.0_ICC19.0.0/x86_64-native-linuxapp-icc/608fc020b86c4e05bcc0541c552e57ed/dpdk/mk/rte.subdir.mk:37: event] Error 2
make[3]: *** [/root/UB2004-64_K5.4.0_ICC19.0.0/x86_64-native-linuxapp-icc/608fc020b86c4e05bcc0541c552e57ed/dpdk/mk/rte.sdkbuild.mk:51: drivers] Error 2
make[2]: *** [/root/UB2004-64_K5.4.0_ICC19.0.0/x86_64-native-linuxapp-icc/608fc020b86c4e05bcc0541c552e57ed/dpdk/mk/rte.sdkroot.mk:99: all] Error 2
make[1]: *** [/root/UB2004-64_K5.4.0_ICC19.0.0/x86_64-native-linuxapp-icc/608fc020b86c4e05bcc0541c552e57ed/dpdk/mk/rte.sdkinstall.mk:61: pre_install] Error 2
make: *** [/root/UB2004-64_K5.4.0_ICC19.0.0/x86_64-native-linuxapp-icc/608fc020b86c4e05bcc0541c552e57ed/dpdk/mk/rte.sdkroot.mk:77: install] Error 2
DPDK STV team


More information about the test-report mailing list