[dpdk-test-report] |FAILURE| pw(71969) [v3, 1/9] eal: relocate per thread symbols to common

sys_stv at intel.com sys_stv at intel.com
Mon Jun 22 16:23:11 CEST 2020


Test-Label: Intel-compilation
Test-Status: FAILURE
http://dpdk.org/patch/71969

_Compilation issues_

Submitter: David Marchand <david.marchand at redhat.com>
Date: 2020-06-22 13:25:23
Reply_mail: 20200622132531.21857-2-david.marchand at redhat.com

DPDK git baseline: Repo:dpdk, CommitID: 2e40fdc2d305e6864c8840a0985018edc94562d5


Meson build Summary: 9 Builds Done, 2 Successful, 7 Failures, 0 Blocked

Makefile build Summary: 23 Builds Done, 0 Successful, 23 Failures, 0 Blocked

                +==============================================+===========+==========+
                |                   Makefile                   |   Meson   | Document |
+----------------+------+-------+------+------------+-----------+-----------+----------+
| os             | gcc  | clang | icc  | gcc+shared | gcc+debug | gcc/clang | pdf/html |
+----------------+------+-------+------+------------+-----------+-----------+----------+
| UB2004-64      | FAIL | FAIL  | FAIL |            |           | FAIL      |          |
| UB1804-64      | FAIL | FAIL  | FAIL |            |           | FAIL      | pass     |
| FC32-64        | FAIL | FAIL  |      |            |           |           |          |
| CENTOS77-64    | FAIL |       |      |            |           |           |          |
| FC31-64        |      |       |      |            |           | FAIL      |          |
| WIN10-64       |      |       |      |            |           | pass      |          |
| CENTOS80-64    | FAIL | FAIL  | FAIL | FAIL       | FAIL      | FAIL      |          |
| UB1804-32      | FAIL |       |      |            |           | FAIL      |          |
| RHEL80-64      | FAIL |       |      |            |           |           |          |
| FreeBSD1201-64 | FAIL | FAIL  |      | FAIL       | FAIL      | FAIL      |          |
| RHEL77-64      | FAIL |       |      |            |           |           |          |
| SUSE15-64      | FAIL | FAIL  |      |            |           | FAIL      |          |
+----------------+------+-------+------+------------+-----------+-----------+----------+
Test environment and configuration as below:

** Makefile build **


OS: UB2004-64
	Kernel Version: 5.4.0-26-generic
	CPU info: Intel(R) Xeon(R) Platinum 8180 CPU @ 2.50GHz
	GCC Version: gcc (Ubuntu 9.3.0-10ubuntu2) 9.3.0
	Clang Version: 10.0.0-4ubuntu1
	x86_64-native-linuxapp-clang
	x86_64-native-linuxapp-gcc
	x86_64-native-linuxapp-icc


OS: UB1804-64
	Kernel Version: 4.15.0-20-generic
	CPU info: Intel(R) Xeon(R) CPU E5-2699 v3 @ 2.30GHz
	GCC Version: gcc (Ubuntu 7.3.0-16ubuntu3) 7.3.0
	Clang Version: 6.0.0-1ubuntu2 (tags/RELEASE_600/final)
	x86_64-native-linuxapp-clang
	x86_64-native-linuxapp-gcc
	x86_64-native-linuxapp-icc


OS: FC32-64
	Kernel Version: 5.6.0-0.rc7.git0.2.fc32.x86_64
	CPU info: Intel(R) Xeon(R) Platinum 8280M CPU @ 2.70GHz
	GCC Version: gcc (GCC) 10.0.1 20200311 (Red Hat 10.0.1-0.9)
	Clang Version: 10.0.0 (Fedora 10.0.0-0.3.rc4.fc32)
	x86_64-native-linuxapp-gcc
	x86_64-native-linuxapp-clang


OS: CENTOS77-64
	Kernel Version: 3.10.0-1062.9.1.el7.x86_64
	CPU info: Intel(R) Xeon(R) Platinum 8280M CPU @ 2.70GHz
	GCC Version: gcc (GCC) 4.8.5 20150623 (Red Hat 4.8.5-39)
	Clang Version: 3.4.2 (tags/RELEASE_34/dot2-final)
	x86_64-native-linuxapp-gcc


OS: CENTOS80-64
	Kernel Version: 4.18.0-80.11.2.el8_0.x86_64
	CPU info: Intel(R) Xeon(R) Platinum 8280M CPU @ 2.70GHz
	GCC Version: gcc (GCC) 8.2.1 20180905 (Red Hat 8.2.1-3)
	Clang Version: 7.0.1 (tags/RELEASE_701/final)
	x86_64-native-linuxapp-gcc
	x86_64-native-linuxapp-clang
	x86_64-native-linuxapp-icc
	x86_64-native-linuxapp-gcc+shared
	x86_64-native-linuxapp-gcc+debug


OS: UB1804-32
	Kernel Version: 4.15.0-20-generic
	CPU info: Intel(R) Xeon(R) Platinum 8180 CPU @ 2.50GHz
	GCC Version: gcc (Ubuntu 7.5.0-3ubuntu1~18.04) 7.5.0
	Clang Version: 6.0.0-1ubuntu2 (tags/RELEASE_600/final)
	i686-native-linuxapp-gcc


OS: RHEL80-64
	Kernel Version: 4.18.0-80.el8.x86_64
	CPU info: Intel(R) Xeon(R) Platinum 8280M CPU @ 2.70GHz
	GCC Version: gcc (GCC) 8.2.1 20180905 (Red Hat 8.2.1-3)
	Clang Version: 6.0.1 (tags/RELEASE_601/final)
	x86_64-native-linuxapp-gcc


OS: FreeBSD1201-64
	Kernel Version: 12.1-RELEASE
	CPU info: Intel(R) Xeon(R) CPU E5-2699 v3 @ 2.30GHz (2294.74-MHz K8-class CPU)
	GCC Version: gcc (FreeBSD Ports Collection) 9.2.0
	Clang Version: 8.0.1 (tags/RELEASE_801/final 366581) (based on LLVM 8.0.1)
	x86_64-native-bsdapp-gcc
	x86_64-native-bsdapp-clang
	x86_64-native-bsdapp-gcc+shared
	x86_64-native-bsdapp-gcc+debug


OS: RHEL77-64
	Kernel Version: 3.10.0-1062.9.1.el7.x86_64
	CPU info: Intel(R) Xeon(R) CPU E5-2699 v3 @ 2.30GHz
	GCC Version: gcc (GCC) 4.8.5 20150623 (Red Hat 4.8.5-39)
	Clang Version: 3.4.2 (tags/RELEASE_34/dot2-final)
	x86_64-native-linuxapp-gcc


OS: SUSE15-64
	Kernel Version: 4.12.14-lp150.11-default
	CPU info: Intel(R) Xeon(R) CPU E5-2699 v4 @ 2.20GHz
	GCC Version: gcc (SUSE Linux) 7.3.1 20180323 [gcc-7-branch revision 258812]
	Clang Version: 5.0.1 (tags/RELEASE_501/final 312548)
	x86_64-native-linuxapp-clang
	x86_64-native-linuxapp-gcc

** Meson build **


OS: UB2004-64
	Kernel Version: 5.4.0-26-generic
	CPU info: Intel(R) Xeon(R) CPU E5-2699 v4 @ 2.20GHz
	GCC Version: gcc (Ubuntu 9.3.0-10ubuntu2) 9.3.0
	Clang Version: 10.0.0-4ubuntu1
	./build-gcc-static
	./build-gcc-shared
	./build-clang-static
	./build-clang-shared
	./build-x86-default


OS: UB1804-64
	Kernel Version: 4.15.0-20-generic
	CPU info: Intel(R) Xeon(R) Platinum 8180 CPU @ 2.50GHz
	GCC Version: gcc (Ubuntu 7.3.0-16ubuntu3) 7.3.0
	Clang Version: 6.0.0-1ubuntu2 (tags/RELEASE_600/final)
	x86_64-native-linuxapp-doc
	./build-gcc-static
	./build-gcc-shared
	./build-clang-static
	./build-clang-shared
	./build-x86-default


OS: WIN10-64
	Kernel Version: N/A
	CPU info: N/A
	GCC Version: N/A
	Clang Version: Clang 8.0.0
	x86_64-windows-clang


OS: CENTOS80-64
	Kernel Version: 4.18.0-147.8.1.el8_1.x86_64
	CPU info: Intel(R) Xeon(R) CPU E5-2699 v4 @ 2.20GHz
	GCC Version: gcc (GCC) 8.3.1 20190507 (Red Hat 8.3.1-4)
	Clang Version: 8.0.1 (Red Hat 8.0.1-1.module_el8.1.0+215+a01033fb)
	./build-gcc-static
	./build-gcc-shared
	./build-clang-static
	./build-clang-shared
	./build-x86-default


OS: FC31-64
	Kernel Version: 5.4.18-200.fc31.x86_64
	CPU info: Intel(R) Xeon(R) Platinum 8180 CPU @ 2.50GHz
	GCC Version: gcc (GCC) 9.2.1 20190827 (Red Hat 9.2.1-1)
	Clang Version: 9.0.0 (Fedora 9.0.0-1.fc31)
	./build-gcc-static
	./build-gcc-shared
	./build-clang-static
	./build-clang-shared
	./build-x86-default


OS: UB1804-32
	Kernel Version: 4.15.0-20-generic
	CPU info: Intel(R) Xeon(R) CPU E5-2699 v4 @ 2.20GHz
	GCC Version: gcc (Ubuntu 7.5.0-3ubuntu1~18.04) 7.5.0
	Clang Version: 6.0.0-1ubuntu2 (tags/RELEASE_600/final)
	./build-gcc-static
	./build-gcc-shared
	./build-clang-static
	./build-clang-shared
	./build-x86-default


OS: FreeBSD1201-64
	Kernel Version: 12.1-RELEASE
	CPU info: Intel(R) Xeon(R) CPU E5-2699 v4 @ 2.20GHz (2194.97-MHz K8-class CPU)
	GCC Version: gcc (FreeBSD Ports Collection) 9.2.0
	Clang Version: 8.0.1 (tags/RELEASE_801/final 366581) (based on LLVM 8.0.1)
	./build-gcc-static
	./build-gcc-shared
	./build-clang-static
	./build-clang-shared
	./build-x86-default


OS: SUSE15-64
	Kernel Version: 4.12.14-lp150.12.82-default
	CPU info: Intel(R) Xeon(R) CPU E5-2699 v4 @ 2.20GHz
	GCC Version: gcc (SUSE Linux) 7.4.1 20190905 [gcc-7-branch revision 275407]
	Clang Version: 5.0.1 (tags/RELEASE_501/final 312548)
	./build-gcc-static
	./build-gcc-shared
	./build-clang-static
	./build-clang-shared
	./build-x86-default



*Meson Build Failed #1:
OS: CENTOS80-64
Target:./build-gcc-static
FAILED: drivers/a715181@@tmp_rte_mempool_bucket at sta/mempool_bucket_rte_mempool_bucket.c.o 
gcc -Idrivers/a715181@@tmp_rte_mempool_bucket at sta -Idrivers -I../drivers -Idrivers/mempool/bucket -I../drivers/mempool/bucket -Ilib/librte_mempool -I../lib/librte_mempool -I. -I../ -Iconfig -I../config -Ilib/librte_eal/include -I../lib/librte_eal/include -Ilib/librte_eal/linux/include -I../lib/librte_eal/linux/include -Ilib/librte_eal/x86/include -I../lib/librte_eal/x86/include -Ilib/librte_eal/common -I../lib/librte_eal/common -Ilib/librte_eal -I../lib/librte_eal -Ilib/librte_kvargs -I../lib/librte_kvargs -Ilib/librte_telemetry/../librte_metrics -I../lib/librte_telemetry/../librte_metrics -Ilib/librte_telemetry -I../lib/librte_telemetry -Ilib/librte_ring -I../lib/librte_ring -fdiagnostics-color=always -pipe -D_FILE_OFFSET_BITS=64 -Wall -Winvalid-pch -Werror -O2 -g -include rte_config.h -Wextra -Wcast-qual -Wdeprecated -Wformat-nonliteral -Wformat-security -Wmissing-declarations -Wmissing-prototypes -Wnested-externs -Wold-style-definition -Wpointer-arith -Wsign-compare -Wstrict-prototypes -Wundef -Wwrite-strings -Wno-packed-not-aligned -Wno-missing-field-initializers -D_GNU_SOURCE -fPIC -march=native -mno-avx512f -DALLOW_EXPERIMENTAL_API -DALLOW_INTERNAL_API -Wno-format-truncation -MD -MQ 'drivers/a715181@@tmp_rte_mempool_bucket at sta/mempool_bucket_rte_mempool_bucket.c.o' -MF 'drivers/a715181@@tmp_rte_mempool_bucket at sta/mempool_bucket_rte_mempool_bucket.c.o.d' -o 'drivers/a715181@@tmp_rte_mempool_bucket at sta/mempool_bucket_rte_mempool_bucket.c.o' -c ../drivers/mempool/bucket/rte_mempool_bucket.c
../drivers/mempool/bucket/rte_mempool_bucket.c: In function ‘bucket_get_count’:
../drivers/mempool/bucket/rte_mempool_bucket.c:400:2: error: implicit declaration of function ‘rte_lcore_iterate’; did you mean ‘rte_lcore_is_enabled’? [-Werror=implicit-function-declaration]
  rte_lcore_iterate(count_per_lcore, &ctx);
  ^~~~~~~~~~~~~~~~~
  rte_lcore_is_enabled
../drivers/mempool/bucket/rte_mempool_bucket.c:400:2: error: nested extern declaration of ‘rte_lcore_iterate’ [-Werror=nested-externs]
cc1: all warnings being treated as errors
[655/2198] Generating rte_mempool_octeontx.sym_chk with a meson_exe.py custom command.
[656/2198] Compiling C object 'drivers/a715181@@tmp_rte_mempool_octeontx2 at sta/mempool_octeontx2_otx2_mempool_irq.c.o'.
[657/2198] Compiling C object 'drivers/a715181@@tmp_rte_mempool_octeontx2 at sta/mempool_octeontx2_otx2_mempool_debug.c.o'.
[658/2198] Compiling C object 'drivers/a715181@@tmp_rte_mempool_stack at sta/mempool_stack_rte_mempool_stack.c.o'.
[659/2198] Compiling C object 'drivers/a715181@@tmp_rte_mempool_ring at sta/mempool_ring_rte_mempool_ring.c.o'.
[660/2198] Generating rte_bus_fslmc.sym_chk with a meson_exe.py custom command.
[661/2198] Compiling C object 'drivers/a715181@@tmp_rte_pmd_ark at sta/net_ark_ark_ethdev.c.o'.
[662/2198] Generating rte_bus_dpaa.sym_chk with a meson_exe.py custom command.
[663/2198] Compiling C object 'drivers/a715181@@tmp_rte_pmd_ark at sta/net_ark_ark_ethdev_rx.c.o'.
[664/2198] Compiling C object 'drivers/a715181@@tmp_rte_pmd_af_packet at sta/net_af_packet_rte_eth_af_packet.c.o'.
[665/2198] Compiling C object 'lib/76b5a35@@rte_pipeline at sta/librte_pipeline_rte_table_action.c.o'.
ninja: build stopped: subcommand failed




*Meson Build Failed #2:
OS: FC31-64
Target:./build-gcc-static
FAILED: drivers/a715181@@tmp_rte_mempool_bucket at sta/mempool_bucket_rte_mempool_bucket.c.o 
gcc -Idrivers/a715181@@tmp_rte_mempool_bucket at sta -Idrivers -I../drivers -Idrivers/mempool/bucket -I../drivers/mempool/bucket -Ilib/librte_mempool -I../lib/librte_mempool -I. -I../ -Iconfig -I../config -Ilib/librte_eal/include -I../lib/librte_eal/include -Ilib/librte_eal/linux/include -I../lib/librte_eal/linux/include -Ilib/librte_eal/x86/include -I../lib/librte_eal/x86/include -Ilib/librte_eal/common -I../lib/librte_eal/common -Ilib/librte_eal -I../lib/librte_eal -Ilib/librte_kvargs -I../lib/librte_kvargs -Ilib/librte_telemetry/../librte_metrics -I../lib/librte_telemetry/../librte_metrics -Ilib/librte_telemetry -I../lib/librte_telemetry -Ilib/librte_ring -I../lib/librte_ring -fdiagnostics-color=always -pipe -D_FILE_OFFSET_BITS=64 -Wall -Winvalid-pch -Werror -O2 -g -include rte_config.h -Wextra -Wcast-qual -Wdeprecated -Wformat-nonliteral -Wformat-security -Wmissing-declarations -Wmissing-prototypes -Wnested-externs -Wold-style-definition -Wpointer-arith -Wsign-compare -Wstrict-prototypes -Wundef -Wwrite-strings -Wno-address-of-packed-member -Wno-packed-not-aligned -Wno-missing-field-initializers -D_GNU_SOURCE -fPIC -march=native -DALLOW_EXPERIMENTAL_API -DALLOW_INTERNAL_API -Wno-format-truncation -MD -MQ 'drivers/a715181@@tmp_rte_mempool_bucket at sta/mempool_bucket_rte_mempool_bucket.c.o' -MF 'drivers/a715181@@tmp_rte_mempool_bucket at sta/mempool_bucket_rte_mempool_bucket.c.o.d' -o 'drivers/a715181@@tmp_rte_mempool_bucket at sta/mempool_bucket_rte_mempool_bucket.c.o' -c ../drivers/mempool/bucket/rte_mempool_bucket.c
../drivers/mempool/bucket/rte_mempool_bucket.c: In function ‘bucket_get_count’:
../drivers/mempool/bucket/rte_mempool_bucket.c:400:2: error: implicit declaration of function ‘rte_lcore_iterate’; did you mean ‘rte_lcore_is_enabled’? [-Werror=implicit-function-declaration]
  400 |  rte_lcore_iterate(count_per_lcore, &ctx);
      |  ^~~~~~~~~~~~~~~~~
      |  rte_lcore_is_enabled
../drivers/mempool/bucket/rte_mempool_bucket.c:400:2: error: nested extern declaration of ‘rte_lcore_iterate’ [-Werror=nested-externs]
cc1: all warnings being treated as errors
[674/2199] Compiling C object 'drivers/a715181@@rte_mempool_ring at sta/meson-generated_.._rte_mempool_ring.pmd.c.o'.
[675/2199] Generating symbol file 'drivers/a715181@@rte_mempool_octeontx at sha/librte_mempool_octeontx.so.20.0.3.symbols'.
[676/2199] Generating rte_mempool_octeontx2.sym_chk with a meson_exe.py custom command.
[677/2199] Generating rte_mempool_stack.sym_chk with a meson_exe.py custom command.
[678/2199] Compiling C object 'drivers/a715181@@tmp_rte_pmd_af_packet at sta/net_af_packet_rte_eth_af_packet.c.o'.
[679/2199] Generating rte_bus_fslmc.sym_chk with a meson_exe.py custom command.
[680/2199] Generating rte_bus_dpaa.sym_chk with a meson_exe.py custom command.
[681/2199] Compiling C object 'drivers/a715181@@tmp_rte_pmd_ark at sta/net_ark_ark_ethdev_rx.c.o'.
[682/2199] Compiling C object 'lib/76b5a35@@rte_pipeline at sta/librte_pipeline_rte_table_action.c.o'.
ninja: build stopped: subcommand failed




*Meson Build Failed #3:
OS: FreeBSD1201-64
Target:./build-gcc-static
FAILED: drivers/a715181@@tmp_rte_mempool_bucket at sta/mempool_bucket_rte_mempool_bucket.c.o 
gcc -Idrivers/a715181@@tmp_rte_mempool_bucket at sta -Idrivers -I../drivers -Idrivers/mempool/bucket -I../drivers/mempool/bucket -Ilib/librte_mempool -I../lib/librte_mempool -I. -I.. -Iconfig -I../config -Ilib/librte_eal/include -I../lib/librte_eal/include -Ilib/librte_eal/freebsd/include -I../lib/librte_eal/freebsd/include -Ilib/librte_eal/x86/include -I../lib/librte_eal/x86/include -Ilib/librte_eal/common -I../lib/librte_eal/common -Ilib/librte_eal -I../lib/librte_eal -Ilib/librte_kvargs -I../lib/librte_kvargs -Ilib/librte_metrics -I../lib/librte_metrics -Ilib/librte_telemetry -I../lib/librte_telemetry -Ilib/librte_ring -I../lib/librte_ring -fdiagnostics-color=always -pipe -D_FILE_OFFSET_BITS=64 -Wall -Winvalid-pch -Werror -O2 -g -include rte_config.h -Wextra -Wcast-qual -Wdeprecated -Wformat-nonliteral -Wformat-security -Wmissing-declarations -Wmissing-prototypes -Wnested-externs -Wold-style-definition -Wpointer-arith -Wsign-compare -Wstrict-prototypes -Wundef -Wwrite-strings -Wno-address-of-packed-member -Wno-packed-not-aligned -Wno-missing-field-initializers -D_GNU_SOURCE -D__BSD_VISIBLE -fPIC -march=native -DALLOW_EXPERIMENTAL_API -DALLOW_INTERNAL_API -Wno-format-truncation -MD -MQ 'drivers/a715181@@tmp_rte_mempool_bucket at sta/mempool_bucket_rte_mempool_bucket.c.o' -MF 'drivers/a715181@@tmp_rte_mempool_bucket at sta/mempool_bucket_rte_mempool_bucket.c.o.d' -o 'drivers/a715181@@tmp_rte_mempool_bucket at sta/mempool_bucket_rte_mempool_bucket.c.o' -c ../drivers/mempool/bucket/rte_mempool_bucket.c
../drivers/mempool/bucket/rte_mempool_bucket.c: In function 'bucket_get_count':
../drivers/mempool/bucket/rte_mempool_bucket.c:400:2: error: implicit declaration of function 'rte_lcore_iterate'; did you mean 'rte_lcore_is_enabled'? [-Werror=implicit-function-declaration]
  400 |  rte_lcore_iterate(count_per_lcore, &ctx);
      |  ^~~~~~~~~~~~~~~~~
      |  rte_lcore_is_enabled
../drivers/mempool/bucket/rte_mempool_bucket.c:400:2: error: nested extern declaration of 'rte_lcore_iterate' [-Werror=nested-externs]
cc1: all warnings being treated as errors
[539/1632] Compiling C object 'drivers/a715181@@tmp_rte_mempool_stack at sta/mempool_stack_rte_mempool_stack.c.o'
[540/1632] Generating rte_mempool_ring.pmd.c with a custom command
[541/1632] Generating rte_common_octeontx2.sym_chk with a meson_exe.py custom command
[542/1632] Generating rte_mempool_octeontx2.sym_chk with a meson_exe.py custom command
[543/1632] Compiling C object 'drivers/a715181@@tmp_rte_pmd_ark at sta/net_ark_ark_ethdev.c.o'
[544/1632] Generating symbol file 'drivers/a715181@@rte_mempool_octeontx at sha/librte_mempool_octeontx.so.20.0.3.symbols'
[545/1632] Compiling C object 'drivers/a715181@@tmp_rte_pmd_ark at sta/net_ark_ark_ethdev_tx.c.o'
[546/1632] Compiling C object 'drivers/a715181@@tmp_rte_pmd_ark at sta/net_ark_ark_ethdev_rx.c.o'
[547/1632] Compiling C object 'lib/76b5a35@@rte_pipeline at sta/librte_pipeline_rte_table_action.c.o'
ninja: build stopped: subcommand failed




*Meson Build Failed #4:
OS: SUSE15-64
Target:./build-gcc-static
FAILED: drivers/a715181@@tmp_rte_mempool_bucket at sta/mempool_bucket_rte_mempool_bucket.c.o 
gcc -Idrivers/a715181@@tmp_rte_mempool_bucket at sta -Idrivers -I../drivers -Idrivers/mempool/bucket -I../drivers/mempool/bucket -Ilib/librte_mempool -I../lib/librte_mempool -I. -I../ -Iconfig -I../config -Ilib/librte_eal/include -I../lib/librte_eal/include -Ilib/librte_eal/linux/include -I../lib/librte_eal/linux/include -Ilib/librte_eal/x86/include -I../lib/librte_eal/x86/include -Ilib/librte_eal/common -I../lib/librte_eal/common -Ilib/librte_eal -I../lib/librte_eal -Ilib/librte_kvargs -I../lib/librte_kvargs -Ilib/librte_telemetry/../librte_metrics -I../lib/librte_telemetry/../librte_metrics -Ilib/librte_telemetry -I../lib/librte_telemetry -Ilib/librte_ring -I../lib/librte_ring -fdiagnostics-color=always -pipe -D_FILE_OFFSET_BITS=64 -Wall -Winvalid-pch -Werror -O2 -g -include rte_config.h -Wextra -Wcast-qual -Wdeprecated -Wformat-nonliteral -Wformat-security -Wmissing-declarations -Wmissing-prototypes -Wnested-externs -Wold-style-definition -Wpointer-arith -Wsign-compare -Wstrict-prototypes -Wundef -Wwrite-strings -Wno-missing-field-initializers -D_GNU_SOURCE -fPIC -march=native -DALLOW_EXPERIMENTAL_API -DALLOW_INTERNAL_API -Wno-format-truncation -MD -MQ 'drivers/a715181@@tmp_rte_mempool_bucket at sta/mempool_bucket_rte_mempool_bucket.c.o' -MF 'drivers/a715181@@tmp_rte_mempool_bucket at sta/mempool_bucket_rte_mempool_bucket.c.o.d' -o 'drivers/a715181@@tmp_rte_mempool_bucket at sta/mempool_bucket_rte_mempool_bucket.c.o' -c ../drivers/mempool/bucket/rte_mempool_bucket.c
../drivers/mempool/bucket/rte_mempool_bucket.c: In function ‘bucket_get_count’:
../drivers/mempool/bucket/rte_mempool_bucket.c:400:2: error: implicit declaration of function ‘rte_lcore_iterate’; did you mean ‘rte_lcore_is_enabled’? [-Werror=implicit-function-declaration]
  rte_lcore_iterate(count_per_lcore, &ctx);
  ^~~~~~~~~~~~~~~~~
  rte_lcore_is_enabled
../drivers/mempool/bucket/rte_mempool_bucket.c:400:2: error: nested extern declaration of ‘rte_lcore_iterate’ [-Werror=nested-externs]
cc1: all warnings being treated as errors
[650/2102] Compiling C object 'drivers/a715181@@rte_mempool_octeontx at sta/meson-generated_.._rte_mempool_octeontx.pmd.c.o'.
[651/2102] Compiling C object 'drivers/a715181@@tmp_rte_mempool_octeontx2 at sta/mempool_octeontx2_otx2_mempool_irq.c.o'.
[652/2102] Compiling C object 'drivers/a715181@@tmp_rte_mempool_octeontx2 at sta/mempool_octeontx2_otx2_mempool_debug.c.o'.
[653/2102] Compiling C object 'drivers/a715181@@tmp_rte_mempool_ring at sta/mempool_ring_rte_mempool_ring.c.o'.
[654/2102] Compiling C object 'drivers/a715181@@tmp_rte_mempool_stack at sta/mempool_stack_rte_mempool_stack.c.o'.
[655/2102] Compiling C object 'drivers/a715181@@tmp_rte_mempool_octeontx2 at sta/mempool_octeontx2_otx2_mempool_ops.c.o'.
[656/2102] Generating rte_bus_fslmc.sym_chk with a meson_exe.py custom command.
[657/2102] Generating rte_bus_dpaa.sym_chk with a meson_exe.py custom command.
[658/2102] Compiling C object 'lib/76b5a35@@rte_pipeline at sta/librte_pipeline_rte_table_action.c.o'.
ninja: build stopped: subcommand failed




*Meson Build Failed #5:
OS: UB1804-32
Target:./build-gcc-static
FAILED: drivers/a715181@@tmp_rte_mempool_bucket at sta/mempool_bucket_rte_mempool_bucket.c.o 
gcc -Idrivers/a715181@@tmp_rte_mempool_bucket at sta -Idrivers -I../drivers -Idrivers/mempool/bucket -I../drivers/mempool/bucket -Ilib/librte_mempool -I../lib/librte_mempool -I. -I../ -Iconfig -I../config -Ilib/librte_eal/include -I../lib/librte_eal/include -Ilib/librte_eal/linux/include -I../lib/librte_eal/linux/include -Ilib/librte_eal/x86/include -I../lib/librte_eal/x86/include -Ilib/librte_eal/common -I../lib/librte_eal/common -Ilib/librte_eal -I../lib/librte_eal -Ilib/librte_kvargs -I../lib/librte_kvargs -Ilib/librte_telemetry/../librte_metrics -I../lib/librte_telemetry/../librte_metrics -Ilib/librte_telemetry -I../lib/librte_telemetry -Ilib/librte_ring -I../lib/librte_ring -fdiagnostics-color=always -pipe -D_FILE_OFFSET_BITS=64 -Wall -Winvalid-pch -Werror -O2 -g -include rte_config.h -Wextra -Wcast-qual -Wdeprecated -Wformat-nonliteral -Wformat-security -Wmissing-declarations -Wmissing-prototypes -Wnested-externs -Wold-style-definition -Wpointer-arith -Wsign-compare -Wstrict-prototypes -Wundef -Wwrite-strings -Wno-missing-field-initializers -Wno-pointer-to-int-cast -D_GNU_SOURCE -m32 -fPIC -march=native -DALLOW_EXPERIMENTAL_API -DALLOW_INTERNAL_API -Wno-format-truncation -MD -MQ 'drivers/a715181@@tmp_rte_mempool_bucket at sta/mempool_bucket_rte_mempool_bucket.c.o' -MF 'drivers/a715181@@tmp_rte_mempool_bucket at sta/mempool_bucket_rte_mempool_bucket.c.o.d' -o 'drivers/a715181@@tmp_rte_mempool_bucket at sta/mempool_bucket_rte_mempool_bucket.c.o' -c ../drivers/mempool/bucket/rte_mempool_bucket.c
../drivers/mempool/bucket/rte_mempool_bucket.c: In function ‘bucket_get_count’:
../drivers/mempool/bucket/rte_mempool_bucket.c:400:2: error: implicit declaration of function ‘rte_lcore_iterate’; did you mean ‘rte_lcore_is_enabled’? [-Werror=implicit-function-declaration]
  rte_lcore_iterate(count_per_lcore, &ctx);
  ^~~~~~~~~~~~~~~~~
  rte_lcore_is_enabled
../drivers/mempool/bucket/rte_mempool_bucket.c:400:2: error: nested extern declaration of ‘rte_lcore_iterate’ [-Werror=nested-externs]
cc1: all warnings being treated as errors
[666/1954] Linking static target drivers/librte_mempool_ring.a.
[667/1954] Compiling C object 'drivers/a715181@@rte_mempool_ring at sha/meson-generated_.._rte_mempool_ring.pmd.c.o'.
[668/1954] Generating rte_mempool_stack.sym_chk with a meson_exe.py custom command.
[669/1954] Generating rte_mempool_octeontx2.sym_chk with a meson_exe.py custom command.
[670/1954] Compiling C object 'drivers/a715181@@tmp_rte_pmd_ark at sta/net_ark_ark_ethdev.c.o'.
[671/1954] Generating rte_bus_fslmc.sym_chk with a meson_exe.py custom command.
[672/1954] Generating rte_bus_dpaa.sym_chk with a meson_exe.py custom command.
[673/1954] Compiling C object 'drivers/a715181@@tmp_rte_pmd_ark at sta/net_ark_ark_ethdev_tx.c.o'.
[674/1954] Compiling C object 'drivers/a715181@@tmp_rte_pmd_ark at sta/net_ark_ark_ethdev_rx.c.o'.
[675/1954] Compiling C object 'drivers/a715181@@tmp_rte_pmd_af_packet at sta/net_af_packet_rte_eth_af_packet.c.o'.
[676/1954] Compiling C object 'lib/76b5a35@@rte_pipeline at sta/librte_pipeline_rte_table_action.c.o'.
ninja: build stopped: subcommand failed




*Meson Build Failed #6:
OS: UB1804-64
Target:./build-gcc-static
FAILED: drivers/a715181@@tmp_rte_mempool_bucket at sta/mempool_bucket_rte_mempool_bucket.c.o 
gcc -Idrivers/a715181@@tmp_rte_mempool_bucket at sta -Idrivers -I../drivers -Idrivers/mempool/bucket -I../drivers/mempool/bucket -Ilib/librte_mempool -I../lib/librte_mempool -I. -I../ -Iconfig -I../config -Ilib/librte_eal/include -I../lib/librte_eal/include -Ilib/librte_eal/linux/include -I../lib/librte_eal/linux/include -Ilib/librte_eal/x86/include -I../lib/librte_eal/x86/include -Ilib/librte_eal/common -I../lib/librte_eal/common -Ilib/librte_eal -I../lib/librte_eal -Ilib/librte_kvargs -I../lib/librte_kvargs -Ilib/librte_telemetry/../librte_metrics -I../lib/librte_telemetry/../librte_metrics -Ilib/librte_telemetry -I../lib/librte_telemetry -Ilib/librte_ring -I../lib/librte_ring -fdiagnostics-color=always -pipe -D_FILE_OFFSET_BITS=64 -Wall -Winvalid-pch -Werror -O2 -g -include rte_config.h -Wextra -Wcast-qual -Wdeprecated -Wformat-nonliteral -Wformat-security -Wmissing-declarations -Wmissing-prototypes -Wnested-externs -Wold-style-definition -Wpointer-arith -Wsign-compare -Wstrict-prototypes -Wundef -Wwrite-strings -Wno-missing-field-initializers -D_GNU_SOURCE -fPIC -march=native -mno-avx512f -DALLOW_EXPERIMENTAL_API -DALLOW_INTERNAL_API -Wno-format-truncation -MD -MQ 'drivers/a715181@@tmp_rte_mempool_bucket at sta/mempool_bucket_rte_mempool_bucket.c.o' -MF 'drivers/a715181@@tmp_rte_mempool_bucket at sta/mempool_bucket_rte_mempool_bucket.c.o.d' -o 'drivers/a715181@@tmp_rte_mempool_bucket at sta/mempool_bucket_rte_mempool_bucket.c.o' -c ../drivers/mempool/bucket/rte_mempool_bucket.c
../drivers/mempool/bucket/rte_mempool_bucket.c: In function ‘bucket_get_count’:
../drivers/mempool/bucket/rte_mempool_bucket.c:400:2: error: implicit declaration of function ‘rte_lcore_iterate’; did you mean ‘rte_lcore_is_enabled’? [-Werror=implicit-function-declaration]
  rte_lcore_iterate(count_per_lcore, &ctx);
  ^~~~~~~~~~~~~~~~~
  rte_lcore_is_enabled
../drivers/mempool/bucket/rte_mempool_bucket.c:400:2: error: nested extern declaration of ‘rte_lcore_iterate’ [-Werror=nested-externs]
cc1: all warnings being treated as errors
[649/2074] Linking static target drivers/libtmp_rte_mempool_octeontx.a.
[650/2074] Compiling C object 'drivers/a715181@@tmp_rte_mempool_octeontx2 at sta/mempool_octeontx2_otx2_mempool_ops.c.o'.
[651/2074] Compiling C object 'drivers/a715181@@tmp_rte_mempool_octeontx2 at sta/mempool_octeontx2_otx2_mempool_debug.c.o'.
[652/2074] Compiling C object 'drivers/a715181@@tmp_rte_mempool_stack at sta/mempool_stack_rte_mempool_stack.c.o'.
[653/2074] Generating rte_bus_dpaa.sym_chk with a meson_exe.py custom command.
[654/2074] Compiling C object 'drivers/a715181@@tmp_rte_mempool_ring at sta/mempool_ring_rte_mempool_ring.c.o'.
[655/2074] Generating rte_bus_fslmc.sym_chk with a meson_exe.py custom command.
[656/2074] Compiling C object 'drivers/a715181@@tmp_rte_pmd_af_packet at sta/net_af_packet_rte_eth_af_packet.c.o'.
[657/2074] Compiling C object 'lib/76b5a35@@rte_pipeline at sta/librte_pipeline_rte_table_action.c.o'.
ninja: build stopped: subcommand failed




*Meson Build Failed #7:
OS: UB2004-64
Target:./build-gcc-static
FAILED: drivers/a715181@@tmp_rte_mempool_bucket at sta/mempool_bucket_rte_mempool_bucket.c.o 
gcc -Idrivers/a715181@@tmp_rte_mempool_bucket at sta -Idrivers -I../drivers -Idrivers/mempool/bucket -I../drivers/mempool/bucket -Ilib/librte_mempool -I../lib/librte_mempool -I. -I../ -Iconfig -I../config -Ilib/librte_eal/include -I../lib/librte_eal/include -Ilib/librte_eal/linux/include -I../lib/librte_eal/linux/include -Ilib/librte_eal/x86/include -I../lib/librte_eal/x86/include -Ilib/librte_eal/common -I../lib/librte_eal/common -Ilib/librte_eal -I../lib/librte_eal -Ilib/librte_kvargs -I../lib/librte_kvargs -Ilib/librte_telemetry/../librte_metrics -I../lib/librte_telemetry/../librte_metrics -Ilib/librte_telemetry -I../lib/librte_telemetry -Ilib/librte_ring -I../lib/librte_ring -fdiagnostics-color=always -pipe -D_FILE_OFFSET_BITS=64 -Wall -Winvalid-pch -Werror -O2 -g -include rte_config.h -Wextra -Wcast-qual -Wdeprecated -Wformat-nonliteral -Wformat-security -Wmissing-declarations -Wmissing-prototypes -Wnested-externs -Wold-style-definition -Wpointer-arith -Wsign-compare -Wstrict-prototypes -Wundef -Wwrite-strings -Wno-address-of-packed-member -Wno-packed-not-aligned -Wno-missing-field-initializers -D_GNU_SOURCE -fPIC -march=native -DALLOW_EXPERIMENTAL_API -DALLOW_INTERNAL_API -Wno-format-truncation -MD -MQ 'drivers/a715181@@tmp_rte_mempool_bucket at sta/mempool_bucket_rte_mempool_bucket.c.o' -MF 'drivers/a715181@@tmp_rte_mempool_bucket at sta/mempool_bucket_rte_mempool_bucket.c.o.d' -o 'drivers/a715181@@tmp_rte_mempool_bucket at sta/mempool_bucket_rte_mempool_bucket.c.o' -c ../drivers/mempool/bucket/rte_mempool_bucket.c
../drivers/mempool/bucket/rte_mempool_bucket.c: In function ‘bucket_get_count’:
../drivers/mempool/bucket/rte_mempool_bucket.c:400:2: error: implicit declaration of function ‘rte_lcore_iterate’; did you mean ‘rte_lcore_is_enabled’? [-Werror=implicit-function-declaration]
  400 |  rte_lcore_iterate(count_per_lcore, &ctx);
      |  ^~~~~~~~~~~~~~~~~
      |  rte_lcore_is_enabled
../drivers/mempool/bucket/rte_mempool_bucket.c:400:2: error: nested extern declaration of ‘rte_lcore_iterate’ [-Werror=nested-externs]
cc1: all warnings being treated as errors
[699/2190] Compiling C object 'drivers/a715181@@tmp_rte_pmd_ark at sta/net_ark_ark_pktdir.c.o'.
[700/2190] Compiling C object 'drivers/a715181@@tmp_rte_pmd_atlantic at sta/net_atlantic_atl_hw_regs.c.o'.
[701/2190] Generating rte_bus_fslmc.sym_chk with a meson_exe.py custom command.
[702/2190] Generating rte_pmd_af_packet.sym_chk with a meson_exe.py custom command.
[703/2190] Compiling C object 'drivers/a715181@@tmp_rte_pmd_ark at sta/net_ark_ark_pktgen.c.o'.
[704/2190] Generating symbol file 'drivers/a715181@@rte_bus_dpaa at sha/librte_bus_dpaa.so.20.0.3.symbols'.
[705/2190] Compiling C object 'drivers/a715181@@tmp_rte_pmd_ark at sta/net_ark_ark_pktchkr.c.o'.
[706/2190] Compiling C object 'drivers/a715181@@tmp_rte_pmd_ark at sta/net_ark_ark_ethdev_tx.c.o'.
[707/2190] Compiling C object 'drivers/a715181@@tmp_rte_pmd_atlantic at sta/net_atlantic_atl_ethdev.c.o'.
[708/2190] Compiling C object 'drivers/a715181@@tmp_rte_pmd_octeontx2_crypto at sta/crypto_octeontx2_otx2_cryptodev_ops.c.o'.
[709/2190] Compiling C object 'lib/76b5a35@@rte_pipeline at sta/librte_pipeline_rte_table_action.c.o'.
ninja: build stopped: subcommand failed



*Build Build Failed #1:
OS: CENTOS77-64
Target: x86_64-native-linuxapp-gcc
  CC rte_mempool_bucket.o
  CC dpaa2_hw_mempool.o
/root/CENTOS77-64_K3.10.0_GCC4.8.5/x86_64-native-linuxapp-gcc/a9ff3ac1706949508d601399fcea8d52/dpdk/drivers/mempool/bucket/rte_mempool_bucket.c: In function ‘bucket_get_count’:
/root/CENTOS77-64_K3.10.0_GCC4.8.5/x86_64-native-linuxapp-gcc/a9ff3ac1706949508d601399fcea8d52/dpdk/drivers/mempool/bucket/rte_mempool_bucket.c:400:2: error: implicit declaration of function ‘rte_lcore_iterate’ [-Werror=implicit-function-declaration]
  rte_lcore_iterate(count_per_lcore, &ctx);
  ^
/root/CENTOS77-64_K3.10.0_GCC4.8.5/x86_64-native-linuxapp-gcc/a9ff3ac1706949508d601399fcea8d52/dpdk/drivers/mempool/bucket/rte_mempool_bucket.c:400:2: error: nested extern declaration of ‘rte_lcore_iterate’ [-Werror=nested-externs]
/root/CENTOS77-64_K3.10.0_GCC4.8.5/x86_64-native-linuxapp-gcc/a9ff3ac1706949508d601399fcea8d52/dpdk/drivers/mempool/bucket/rte_mempool_bucket.c: At top level:
cc1: error: unrecognized command line option "-Wno-address-of-packed-member" [-Werror]
cc1: all warnings being treated as errors
make[6]: *** [rte_mempool_bucket.o] Error 1
make[5]: *** [bucket] Error 2
make[5]: *** Waiting for unfinished jobs....
  AR librte_mempool_dpaa2.a
  INSTALL-LIB librte_mempool_dpaa2.a
  AR librte_mempool_dpaa.a
  INSTALL-LIB librte_mempool_dpaa.a
make[4]: *** [mempool] Error 2
make[3]: *** [drivers] Error 2
make[2]: *** [all] Error 2
make[1]: *** [pre_install] Error 2
make: *** [install] Error 2


*Build Build Failed #2:
OS: CENTOS80-64
Target: x86_64-native-linuxapp-gcc
make[6]: Warning: File 'rte_mempool_bucket.c' has modification time 42351 s in the future
  CC rte_mempool_bucket.o
/root/CENTOS80-64_K4.18.0_GCC8.2.1/x86_64-native-linuxapp-gcc/a9ff3ac1706949508d601399fcea8d52/dpdk/drivers/mempool/bucket/rte_mempool_bucket.c: In function ‘bucket_get_count’:
/root/CENTOS80-64_K4.18.0_GCC8.2.1/x86_64-native-linuxapp-gcc/a9ff3ac1706949508d601399fcea8d52/dpdk/drivers/mempool/bucket/rte_mempool_bucket.c:400:2: error: implicit declaration of function ‘rte_lcore_iterate’; did you mean ‘rte_lcore_is_enabled’? [-Werror=implicit-function-declaration]
  rte_lcore_iterate(count_per_lcore, &ctx);
  ^~~~~~~~~~~~~~~~~
  rte_lcore_is_enabled
/root/CENTOS80-64_K4.18.0_GCC8.2.1/x86_64-native-linuxapp-gcc/a9ff3ac1706949508d601399fcea8d52/dpdk/drivers/mempool/bucket/rte_mempool_bucket.c:400:2: error: nested extern declaration of ‘rte_lcore_iterate’ [-Werror=nested-externs]
  AR librte_mempool_dpaa2.a
  INSTALL-LIB librte_mempool_dpaa2.a
  AR librte_mempool_dpaa.a
--
  CC rte_mempool_ring.o
  CC rte_mempool_stack.o
/root/CENTOS80-64_K4.18.0_GCC8.2.1/x86_64-native-linuxapp-gcc/a9ff3ac1706949508d601399fcea8d52/dpdk/drivers/mempool/bucket/rte_mempool_bucket.c: At top level:
cc1: error: unrecognized command line option ‘-Wno-address-of-packed-member’ [-Werror]
cc1: all warnings being treated as errors
  AR librte_mempool_stack.a
make[6]: *** [/root/CENTOS80-64_K4.18.0_GCC8.2.1/x86_64-native-linuxapp-gcc/a9ff3ac1706949508d601399fcea8d52/dpdk/mk/internal/rte.compile-pre.mk:116: rte_mempool_bucket.o] Error 1
make[5]: *** [/root/CENTOS80-64_K4.18.0_GCC8.2.1/x86_64-native-linuxapp-gcc/a9ff3ac1706949508d601399fcea8d52/dpdk/mk/rte.subdir.mk:37: bucket] Error 2
make[5]: *** Waiting for unfinished jobs....
  INSTALL-LIB librte_mempool_stack.a
  AR librte_mempool_ring.a
  INSTALL-LIB librte_mempool_ring.a
make[4]: *** [/root/CENTOS80-64_K4.18.0_GCC8.2.1/x86_64-native-linuxapp-gcc/a9ff3ac1706949508d601399fcea8d52/dpdk/mk/rte.subdir.mk:37: mempool] Error 2
make[3]: *** [/root/CENTOS80-64_K4.18.0_GCC8.2.1/x86_64-native-linuxapp-gcc/a9ff3ac1706949508d601399fcea8d52/dpdk/mk/rte.sdkbuild.mk:51: drivers] Error 2
make[2]: *** [/root/CENTOS80-64_K4.18.0_GCC8.2.1/x86_64-native-linuxapp-gcc/a9ff3ac1706949508d601399fcea8d52/dpdk/mk/rte.sdkroot.mk:99: all] Error 2
make[1]: *** [/root/CENTOS80-64_K4.18.0_GCC8.2.1/x86_64-native-linuxapp-gcc/a9ff3ac1706949508d601399fcea8d52/dpdk/mk/rte.sdkinstall.mk:61: pre_install] Error 2
make: *** [/root/CENTOS80-64_K4.18.0_GCC8.2.1/x86_64-native-linuxapp-gcc/a9ff3ac1706949508d601399fcea8d52/dpdk/mk/rte.sdkroot.mk:77: install] Error 2


*Build Build Failed #3:
OS: CENTOS80-64
Target: x86_64-native-linuxapp-clang
  CC dpaa_mempool.o
  SYMLINK-FILE include/rte_dpaa2_mempool.h
  CC dpaa2_hw_mempool.o
/root/CENTOS80-64_K4.18.0_Clang7.0.1/x86_64-native-linuxapp-clang/a9ff3ac1706949508d601399fcea8d52/dpdk/drivers/mempool/bucket/rte_mempool_bucket.c:400:2: error: implicit declaration of function 'rte_lcore_iterate' is invalid in C99 [-Werror,-Wimplicit-function-declaration]
        rte_lcore_iterate(count_per_lcore, &ctx);
        ^
/root/CENTOS80-64_K4.18.0_Clang7.0.1/x86_64-native-linuxapp-clang/a9ff3ac1706949508d601399fcea8d52/dpdk/drivers/mempool/bucket/rte_mempool_bucket.c:400:2: error: this function declaration is not a prototype [-Werror,-Wstrict-prototypes]
2 errors generated.
make[6]: *** [/root/CENTOS80-64_K4.18.0_Clang7.0.1/x86_64-native-linuxapp-clang/a9ff3ac1706949508d601399fcea8d52/dpdk/mk/internal/rte.compile-pre.mk:116: rte_mempool_bucket.o] Error 1
make[5]: *** [/root/CENTOS80-64_K4.18.0_Clang7.0.1/x86_64-native-linuxapp-clang/a9ff3ac1706949508d601399fcea8d52/dpdk/mk/rte.subdir.mk:37: bucket] Error 2
make[5]: *** Waiting for unfinished jobs....
  AR librte_mempool_dpaa.a
  INSTALL-LIB librte_mempool_dpaa.a
  AR librte_mempool_dpaa2.a
  INSTALL-LIB librte_mempool_dpaa2.a
make[4]: *** [/root/CENTOS80-64_K4.18.0_Clang7.0.1/x86_64-native-linuxapp-clang/a9ff3ac1706949508d601399fcea8d52/dpdk/mk/rte.subdir.mk:37: mempool] Error 2
make[3]: *** [/root/CENTOS80-64_K4.18.0_Clang7.0.1/x86_64-native-linuxapp-clang/a9ff3ac1706949508d601399fcea8d52/dpdk/mk/rte.sdkbuild.mk:51: drivers] Error 2
make[2]: *** [/root/CENTOS80-64_K4.18.0_Clang7.0.1/x86_64-native-linuxapp-clang/a9ff3ac1706949508d601399fcea8d52/dpdk/mk/rte.sdkroot.mk:99: all] Error 2
make[1]: *** [/root/CENTOS80-64_K4.18.0_Clang7.0.1/x86_64-native-linuxapp-clang/a9ff3ac1706949508d601399fcea8d52/dpdk/mk/rte.sdkinstall.mk:61: pre_install] Error 2
make: *** [/root/CENTOS80-64_K4.18.0_Clang7.0.1/x86_64-native-linuxapp-clang/a9ff3ac1706949508d601399fcea8d52/dpdk/mk/rte.sdkroot.mk:77: install] Error 2


*Build Build Failed #4:
OS: CENTOS80-64
Target: x86_64-native-linuxapp-icc
/root/CENTOS80-64_K4.18.0_ICC19.0.0/x86_64-native-linuxapp-icc/a9ff3ac1706949508d601399fcea8d52/dpdk/x86_64-native-linuxapp-icc/lib/librte_mempool_bucket.a(rte_mempool_bucket.o): In function `bucket_get_count':
rte_mempool_bucket.c:(.text+0xdad2): undefined reference to `rte_lcore_iterate'
  CC test_atomic.o
make[5]: *** [/root/CENTOS80-64_K4.18.0_ICC19.0.0/x86_64-native-linuxapp-icc/a9ff3ac1706949508d601399fcea8d52/dpdk/mk/rte.app.mk:454: dpdk-procinfo] Error 1
make[4]: *** [/root/CENTOS80-64_K4.18.0_ICC19.0.0/x86_64-native-linuxapp-icc/a9ff3ac1706949508d601399fcea8d52/dpdk/mk/rte.subdir.mk:37: proc-info] Error 2
make[4]: *** Waiting for unfinished jobs....
  CC test_barrier.o
  CC test_malloc.o
--
  LD testpmd
/root/CENTOS80-64_K4.18.0_ICC19.0.0/x86_64-native-linuxapp-icc/a9ff3ac1706949508d601399fcea8d52/dpdk/x86_64-native-linuxapp-icc/lib/librte_mempool_bucket.a(rte_mempool_bucket.o): In function `bucket_get_count':
rte_mempool_bucket.c:(.text+0xdad2): undefined reference to `rte_lcore_iterate'
make[5]: *** [/root/CENTOS80-64_K4.18.0_ICC19.0.0/x86_64-native-linuxapp-icc/a9ff3ac1706949508d601399fcea8d52/dpdk/mk/rte.app.mk:454: testpmd] Error 1
make[4]: *** [/root/CENTOS80-64_K4.18.0_ICC19.0.0/x86_64-native-linuxapp-icc/a9ff3ac1706949508d601399fcea8d52/dpdk/mk/rte.subdir.mk:37: test-pmd] Error 2
  CC test_ring_peek_stress.o
  CC test_ring_rts_stress.o
  CC test_ring_stress.o
--
  LD test
/root/CENTOS80-64_K4.18.0_ICC19.0.0/x86_64-native-linuxapp-icc/a9ff3ac1706949508d601399fcea8d52/dpdk/x86_64-native-linuxapp-icc/lib/librte_mempool_bucket.a(rte_mempool_bucket.o): In function `bucket_get_count':
rte_mempool_bucket.c:(.text+0xdad2): undefined reference to `rte_lcore_iterate'
make[5]: *** [/root/CENTOS80-64_K4.18.0_ICC19.0.0/x86_64-native-linuxapp-icc/a9ff3ac1706949508d601399fcea8d52/dpdk/mk/rte.app.mk:454: test] Error 1
make[4]: *** [/root/CENTOS80-64_K4.18.0_ICC19.0.0/x86_64-native-linuxapp-icc/a9ff3ac1706949508d601399fcea8d52/dpdk/mk/rte.subdir.mk:37: test] Error 2
make[3]: *** [/root/CENTOS80-64_K4.18.0_ICC19.0.0/x86_64-native-linuxapp-icc/a9ff3ac1706949508d601399fcea8d52/dpdk/mk/rte.sdkbuild.mk:53: app] Error 2
make[2]: *** [/root/CENTOS80-64_K4.18.0_ICC19.0.0/x86_64-native-linuxapp-icc/a9ff3ac1706949508d601399fcea8d52/dpdk/mk/rte.sdkroot.mk:99: all] Error 2
make[1]: *** [/root/CENTOS80-64_K4.18.0_ICC19.0.0/x86_64-native-linuxapp-icc/a9ff3ac1706949508d601399fcea8d52/dpdk/mk/rte.sdkinstall.mk:61: pre_install] Error 2
make: *** [/root/CENTOS80-64_K4.18.0_ICC19.0.0/x86_64-native-linuxapp-icc/a9ff3ac1706949508d601399fcea8d52/dpdk/mk/rte.sdkroot.mk:77: install] Error 2


*Build Build Failed #5:
OS: CENTOS80-64
Target: x86_64-native-linuxapp-gcc+shared
  CC dpaa2_hw_mempool.o
  CC rte_mempool_bucket.o
/root/CENTOS80-64_K4.18.0_GCC8.2.1/x86_64-native-linuxapp-gcc+shared/a9ff3ac1706949508d601399fcea8d52/dpdk/drivers/mempool/bucket/rte_mempool_bucket.c: In function ‘bucket_get_count’:
/root/CENTOS80-64_K4.18.0_GCC8.2.1/x86_64-native-linuxapp-gcc+shared/a9ff3ac1706949508d601399fcea8d52/dpdk/drivers/mempool/bucket/rte_mempool_bucket.c:400:2: error: implicit declaration of function ‘rte_lcore_iterate’; did you mean ‘rte_lcore_is_enabled’? [-Werror=implicit-function-declaration]
  rte_lcore_iterate(count_per_lcore, &ctx);
  ^~~~~~~~~~~~~~~~~
  rte_lcore_is_enabled
/root/CENTOS80-64_K4.18.0_GCC8.2.1/x86_64-native-linuxapp-gcc+shared/a9ff3ac1706949508d601399fcea8d52/dpdk/drivers/mempool/bucket/rte_mempool_bucket.c:400:2: error: nested extern declaration of ‘rte_lcore_iterate’ [-Werror=nested-externs]
  LD librte_mempool_dpaa.so.20.0.3
  LD librte_mempool_dpaa2.so.20.0.3
  INSTALL-LIB librte_mempool_dpaa.so.20.0.3
--
  INSTALL-LIB librte_mempool_stack.so.20.0.3
== Build drivers/mempool/octeontx
/root/CENTOS80-64_K4.18.0_GCC8.2.1/x86_64-native-linuxapp-gcc+shared/a9ff3ac1706949508d601399fcea8d52/dpdk/drivers/mempool/bucket/rte_mempool_bucket.c: At top level:
cc1: error: unrecognized command line option ‘-Wno-address-of-packed-member’ [-Werror]
cc1: all warnings being treated as errors
make[6]: *** [/root/CENTOS80-64_K4.18.0_GCC8.2.1/x86_64-native-linuxapp-gcc+shared/a9ff3ac1706949508d601399fcea8d52/dpdk/mk/internal/rte.compile-pre.mk:116: rte_mempool_bucket.o] Error 1
make[5]: *** [/root/CENTOS80-64_K4.18.0_GCC8.2.1/x86_64-native-linuxapp-gcc+shared/a9ff3ac1706949508d601399fcea8d52/dpdk/mk/rte.subdir.mk:37: bucket] Error 2
make[5]: *** Waiting for unfinished jobs....
  LD librte_mempool_ring.so.20.0.3
  INSTALL-LIB librte_mempool_ring.so.20.0.3
--
  LD octeontx_fpavf.o
  LD librte_mempool_octeontx.so.20.0.3
  INSTALL-LIB librte_mempool_octeontx.so.20.0.3
make[4]: *** [/root/CENTOS80-64_K4.18.0_GCC8.2.1/x86_64-native-linuxapp-gcc+shared/a9ff3ac1706949508d601399fcea8d52/dpdk/mk/rte.subdir.mk:37: mempool] Error 2
make[3]: *** [/root/CENTOS80-64_K4.18.0_GCC8.2.1/x86_64-native-linuxapp-gcc+shared/a9ff3ac1706949508d601399fcea8d52/dpdk/mk/rte.sdkbuild.mk:51: drivers] Error 2
make[2]: *** [/root/CENTOS80-64_K4.18.0_GCC8.2.1/x86_64-native-linuxapp-gcc+shared/a9ff3ac1706949508d601399fcea8d52/dpdk/mk/rte.sdkroot.mk:99: all] Error 2
make[1]: *** [/root/CENTOS80-64_K4.18.0_GCC8.2.1/x86_64-native-linuxapp-gcc+shared/a9ff3ac1706949508d601399fcea8d52/dpdk/mk/rte.sdkinstall.mk:61: pre_install] Error 2
make: *** [/root/CENTOS80-64_K4.18.0_GCC8.2.1/x86_64-native-linuxapp-gcc+shared/a9ff3ac1706949508d601399fcea8d52/dpdk/mk/rte.sdkroot.mk:77: install] Error 2


*Build Build Failed #6:
OS: CENTOS80-64
Target: x86_64-native-linuxapp-gcc+debug
  CC rte_mempool_bucket.o
  CC dpaa2_hw_mempool.o
/root/CENTOS80-64_K4.18.0_GCC8.2.1/x86_64-native-linuxapp-gcc+debug/a9ff3ac1706949508d601399fcea8d52/dpdk/drivers/mempool/bucket/rte_mempool_bucket.c: In function ‘bucket_get_count’:
/root/CENTOS80-64_K4.18.0_GCC8.2.1/x86_64-native-linuxapp-gcc+debug/a9ff3ac1706949508d601399fcea8d52/dpdk/drivers/mempool/bucket/rte_mempool_bucket.c:400:2: error: implicit declaration of function ‘rte_lcore_iterate’; did you mean ‘rte_lcore_is_enabled’? [-Werror=implicit-function-declaration]
  rte_lcore_iterate(count_per_lcore, &ctx);
  ^~~~~~~~~~~~~~~~~
  rte_lcore_is_enabled
/root/CENTOS80-64_K4.18.0_GCC8.2.1/x86_64-native-linuxapp-gcc+debug/a9ff3ac1706949508d601399fcea8d52/dpdk/drivers/mempool/bucket/rte_mempool_bucket.c:400:2: error: nested extern declaration of ‘rte_lcore_iterate’ [-Werror=nested-externs]
  AR librte_mempool_dpaa.a
  INSTALL-LIB librte_mempool_dpaa.a
== Build drivers/mempool/ring
--
  INSTALL-LIB librte_mempool_stack.a
== Build drivers/mempool/octeontx
/root/CENTOS80-64_K4.18.0_GCC8.2.1/x86_64-native-linuxapp-gcc+debug/a9ff3ac1706949508d601399fcea8d52/dpdk/drivers/mempool/bucket/rte_mempool_bucket.c: At top level:
cc1: error: unrecognized command line option ‘-Wno-address-of-packed-member’ [-Werror]
cc1: all warnings being treated as errors
  AR librte_mempool_ring.a
  INSTALL-LIB librte_mempool_ring.a
make[6]: *** [/root/CENTOS80-64_K4.18.0_GCC8.2.1/x86_64-native-linuxapp-gcc+debug/a9ff3ac1706949508d601399fcea8d52/dpdk/mk/internal/rte.compile-pre.mk:116: rte_mempool_bucket.o] Error 1
make[5]: *** [/root/CENTOS80-64_K4.18.0_GCC8.2.1/x86_64-native-linuxapp-gcc+debug/a9ff3ac1706949508d601399fcea8d52/dpdk/mk/rte.subdir.mk:35: bucket] Error 2
make[5]: *** Waiting for unfinished jobs....
  CC octeontx_fpavf.o
  CC rte_mempool_octeontx.o
--
  LD octeontx_fpavf.o
  AR librte_mempool_octeontx.a
  INSTALL-LIB librte_mempool_octeontx.a
make[4]: *** [/root/CENTOS80-64_K4.18.0_GCC8.2.1/x86_64-native-linuxapp-gcc+debug/a9ff3ac1706949508d601399fcea8d52/dpdk/mk/rte.subdir.mk:37: mempool] Error 2
make[3]: *** [/root/CENTOS80-64_K4.18.0_GCC8.2.1/x86_64-native-linuxapp-gcc+debug/a9ff3ac1706949508d601399fcea8d52/dpdk/mk/rte.sdkbuild.mk:51: drivers] Error 2
make[2]: *** [/root/CENTOS80-64_K4.18.0_GCC8.2.1/x86_64-native-linuxapp-gcc+debug/a9ff3ac1706949508d601399fcea8d52/dpdk/mk/rte.sdkroot.mk:99: all] Error 2
make[1]: *** [/root/CENTOS80-64_K4.18.0_GCC8.2.1/x86_64-native-linuxapp-gcc+debug/a9ff3ac1706949508d601399fcea8d52/dpdk/mk/rte.sdkinstall.mk:61: pre_install] Error 2
make: *** [/root/CENTOS80-64_K4.18.0_GCC8.2.1/x86_64-native-linuxapp-gcc+debug/a9ff3ac1706949508d601399fcea8d52/dpdk/mk/rte.sdkroot.mk:77: install] Error 2


*Build Build Failed #7:
OS: FC32-64
Target: x86_64-native-linuxapp-gcc
  CC dpaa_mempool.o
  CC dpaa2_hw_mempool.o
/root/FC32-64_K5.6.0_GCC10.0.1/x86_64-native-linuxapp-gcc/a9ff3ac1706949508d601399fcea8d52/dpdk/drivers/mempool/bucket/rte_mempool_bucket.c: In function ‘bucket_get_count’:
/root/FC32-64_K5.6.0_GCC10.0.1/x86_64-native-linuxapp-gcc/a9ff3ac1706949508d601399fcea8d52/dpdk/drivers/mempool/bucket/rte_mempool_bucket.c:400:2: error: implicit declaration of function ‘rte_lcore_iterate’; did you mean ‘rte_lcore_is_enabled’? [-Werror=implicit-function-declaration]
  400 |  rte_lcore_iterate(count_per_lcore, &ctx);
      |  ^~~~~~~~~~~~~~~~~
      |  rte_lcore_is_enabled
/root/FC32-64_K5.6.0_GCC10.0.1/x86_64-native-linuxapp-gcc/a9ff3ac1706949508d601399fcea8d52/dpdk/drivers/mempool/bucket/rte_mempool_bucket.c:400:2: error: nested extern declaration of ‘rte_lcore_iterate’ [-Werror=nested-externs]
  AR librte_mempool_dpaa.a
  INSTALL-LIB librte_mempool_dpaa.a
== Build drivers/mempool/ring
--
  INSTALL-LIB librte_mempool_ring.a
== Build drivers/mempool/octeontx2
cc1: all warnings being treated as errors
make[6]: *** [/root/FC32-64_K5.6.0_GCC10.0.1/x86_64-native-linuxapp-gcc/a9ff3ac1706949508d601399fcea8d52/dpdk/mk/internal/rte.compile-pre.mk:116: rte_mempool_bucket.o] Error 1
make[5]: *** [/root/FC32-64_K5.6.0_GCC10.0.1/x86_64-native-linuxapp-gcc/a9ff3ac1706949508d601399fcea8d52/dpdk/mk/rte.subdir.mk:37: bucket] Error 2
make[5]: *** Waiting for unfinished jobs....
  CC octeontx_fpavf.o
  CC rte_mempool_octeontx.o
--
  LD otx2_mempool.o
  AR librte_mempool_octeontx2.a
  INSTALL-LIB librte_mempool_octeontx2.a
make[4]: *** [/root/FC32-64_K5.6.0_GCC10.0.1/x86_64-native-linuxapp-gcc/a9ff3ac1706949508d601399fcea8d52/dpdk/mk/rte.subdir.mk:37: mempool] Error 2
make[3]: *** [/root/FC32-64_K5.6.0_GCC10.0.1/x86_64-native-linuxapp-gcc/a9ff3ac1706949508d601399fcea8d52/dpdk/mk/rte.sdkbuild.mk:51: drivers] Error 2
make[2]: *** [/root/FC32-64_K5.6.0_GCC10.0.1/x86_64-native-linuxapp-gcc/a9ff3ac1706949508d601399fcea8d52/dpdk/mk/rte.sdkroot.mk:99: all] Error 2
make[1]: *** [/root/FC32-64_K5.6.0_GCC10.0.1/x86_64-native-linuxapp-gcc/a9ff3ac1706949508d601399fcea8d52/dpdk/mk/rte.sdkinstall.mk:61: pre_install] Error 2
make: *** [/root/FC32-64_K5.6.0_GCC10.0.1/x86_64-native-linuxapp-gcc/a9ff3ac1706949508d601399fcea8d52/dpdk/mk/rte.sdkroot.mk:77: install] Error 2


*Build Build Failed #8:
OS: FC32-64
Target: x86_64-native-linuxapp-clang
  CC rte_mempool_bucket.o
  SYMLINK-FILE include/rte_dpaa2_mempool.h
  CC dpaa2_hw_mempool.o
/root/FC32-64_K5.6.0_Clang10.0.0/x86_64-native-linuxapp-clang/a9ff3ac1706949508d601399fcea8d52/dpdk/drivers/mempool/bucket/rte_mempool_bucket.c:400:2: error: implicit declaration of function 'rte_lcore_iterate' is invalid in C99 [-Werror,-Wimplicit-function-declaration]
        rte_lcore_iterate(count_per_lcore, &ctx);
        ^
1 error generated.
make[6]: *** [/root/FC32-64_K5.6.0_Clang10.0.0/x86_64-native-linuxapp-clang/a9ff3ac1706949508d601399fcea8d52/dpdk/mk/internal/rte.compile-pre.mk:116: rte_mempool_bucket.o] Error 1
make[5]: *** [/root/FC32-64_K5.6.0_Clang10.0.0/x86_64-native-linuxapp-clang/a9ff3ac1706949508d601399fcea8d52/dpdk/mk/rte.subdir.mk:37: bucket] Error 2
make[5]: *** Waiting for unfinished jobs....
  AR librte_mempool_dpaa.a
  INSTALL-LIB librte_mempool_dpaa.a
  AR librte_mempool_dpaa2.a
  INSTALL-LIB librte_mempool_dpaa2.a
make[4]: *** [/root/FC32-64_K5.6.0_Clang10.0.0/x86_64-native-linuxapp-clang/a9ff3ac1706949508d601399fcea8d52/dpdk/mk/rte.subdir.mk:37: mempool] Error 2
make[3]: *** [/root/FC32-64_K5.6.0_Clang10.0.0/x86_64-native-linuxapp-clang/a9ff3ac1706949508d601399fcea8d52/dpdk/mk/rte.sdkbuild.mk:51: drivers] Error 2
make[2]: *** [/root/FC32-64_K5.6.0_Clang10.0.0/x86_64-native-linuxapp-clang/a9ff3ac1706949508d601399fcea8d52/dpdk/mk/rte.sdkroot.mk:99: all] Error 2
make[1]: *** [/root/FC32-64_K5.6.0_Clang10.0.0/x86_64-native-linuxapp-clang/a9ff3ac1706949508d601399fcea8d52/dpdk/mk/rte.sdkinstall.mk:61: pre_install] Error 2
make: *** [/root/FC32-64_K5.6.0_Clang10.0.0/x86_64-native-linuxapp-clang/a9ff3ac1706949508d601399fcea8d52/dpdk/mk/rte.sdkroot.mk:77: install] Error 2


*Build Build Failed #9:
OS: FreeBSD1201-64
Target: x86_64-native-bsdapp-gcc
awk -f /usr/src/sys/tools/makeobjops.awk /usr/src/sys/kern/bus_if.m -h
awk -f /usr/src/sys/tools/makeobjops.awk /usr/src/sys/dev/pci/pci_if.m -h
Warning: Object directory not changed from original /root/FreeBSD1201-64_K12.1_GCC9.2.0/x86_64-native-bsdapp-gcc/a9ff3ac1706949508d601399fcea8d52/dpdk/x86_64-native-bsdapp-gcc/build/kernel/freebsd/contigmem
cc  -Winline -Wall -Werror -include /root/FreeBSD1201-64_K12.1_GCC9.2.0/x86_64-native-bsdapp-gcc/a9ff3ac1706949508d601399fcea8d52/dpdk/x86_64-native-bsdapp-gcc/include/rte_config.h  -Werror -D_KERNEL -DKLD_MODULE -nostdinc  -I/root/FreeBSD1201-64_K12.1_GCC9.2.0/x86_64-native-bsdapp-gcc/a9ff3ac1706949508d601399fcea8d52/dpdk/kernel/freebsd/contigmem -I/root/FreeBSD1201-64_K12.1_GCC9.2.0/x86_64-native-bsdapp-gcc/a9ff3ac1706949508d601399fcea8d52/dpdk/x86_64-native-bsdapp-gcc/include -I. -I/usr/src/sys -I/usr/src/sys/contrib/ck/include -fno-common  -fno-omit-frame-pointer -mno-omit-leaf-frame-pointer -fdebug-prefix-map=./machine=/usr/src/sys/amd64/include -fdebug-prefix-map=./x86=/usr/src/sys/x86/include   -MD  -MF.depend.contigmem.o -MTcontigmem.o -mcmodel=kernel -mno-red-zone -mno-mmx -mno-sse -msoft-float  -fno-asynchronous-unwind-tables -ffreestanding -fwrapv -fstack-protector -Wall -Wredundant-decls -Wnested-externs -Wstrict-prototypes -Wmissing-prototypes -Wpointer-arith -Wcast-qual -Wundef -Wno-pointer-sign -D__printf__=__freebsd_kprintf__ -Wmissing-include-dirs -fdiagnostics-show-option -Wno-unknown-pragmas -Wno-error-tautological-compare -Wno-error-empty-body -Wno-error-parentheses-equality -Wno-error-unused-function -Wno-error-pointer-sign -Wno-error-shift-negative-value -Wno-address-of-packed-member  -mno-aes -mno-avx  -std=iso9899:1999 -c contigmem.c -o contigmem.o
Warning: Object directory not changed from original /root/FreeBSD1201-64_K12.1_GCC9.2.0/x86_64-native-bsdapp-gcc/a9ff3ac1706949508d601399fcea8d52/dpdk/x86_64-native-bsdapp-gcc/build/kernel/freebsd/nic_uio
cc  -Winline -Wall -Werror -include /root/FreeBSD1201-64_K12.1_GCC9.2.0/x86_64-native-bsdapp-gcc/a9ff3ac1706949508d601399fcea8d52/dpdk/x86_64-native-bsdapp-gcc/include/rte_config.h  -Werror -D_KERNEL -DKLD_MODULE -nostdinc  -I/root/FreeBSD1201-64_K12.1_GCC9.2.0/x86_64-native-bsdapp-gcc/a9ff3ac1706949508d601399fcea8d52/dpdk/kernel/freebsd/nic_uio -I/root/FreeBSD1201-64_K12.1_GCC9.2.0/x86_64-native-bsdapp-gcc/a9ff3ac1706949508d601399fcea8d52/dpdk/x86_64-native-bsdapp-gcc/include -I. -I/usr/src/sys -I/usr/src/sys/contrib/ck/include -fno-common  -fno-omit-frame-pointer -mno-omit-leaf-frame-pointer -fdebug-prefix-map=./machine=/usr/src/sys/amd64/include -fdebug-prefix-map=./x86=/usr/src/sys/x86/include   -MD  -MF.depend.nic_uio.o -MTnic_uio.o -mcmodel=kernel -mno-red-zone -mno-mmx -mno-sse -msoft-float  -fno-asynchronous-unwind-tables -ffreestanding -fwrapv -fstack-protector -Wall -Wredundant-decls -Wnested-externs -Wstrict-prototypes -Wmissing-prototypes -Wpointer-arith -Wcast-qual -Wundef -Wno-pointer-sign -D__printf__=__freebsd_kprintf__ -Wmissing-include-dirs -fdiagnostics-show-option -Wno-unknown-pragmas -Wno-error-tautological-compare -Wno-error-empty-body -Wno-error-parentheses-equality -Wno-error-unused-function -Wno-error-pointer-sign -Wno-error-shift-negative-value -Wno-address-of-packed-member  -mno-aes -mno-avx  -std=iso9899:1999 -c nic_uio.c -o nic_uio.o
== Build drivers/common
ld -m elf_x86_64_fbsd -L/root/FreeBSD1201-64_K12.1_GCC9.2.0/x86_64-native-bsdapp-gcc/a9ff3ac1706949508d601399fcea8d52/dpdk/x86_64-native-bsdapp-gcc/lib -d -warn-common --build-id=sha1 -r -d -o contigmem.ko contigmem.o
:> export_syms
--
  CC rte_mempool_ring.o
  CC rte_mempool_stack.o
/root/FreeBSD1201-64_K12.1_GCC9.2.0/x86_64-native-bsdapp-gcc/a9ff3ac1706949508d601399fcea8d52/dpdk/drivers/mempool/bucket/rte_mempool_bucket.c: In function 'bucket_get_count':
/root/FreeBSD1201-64_K12.1_GCC9.2.0/x86_64-native-bsdapp-gcc/a9ff3ac1706949508d601399fcea8d52/dpdk/drivers/mempool/bucket/rte_mempool_bucket.c:400:2: error: implicit declaration of function 'rte_lcore_iterate'; did you mean 'rte_lcore_is_enabled'? [-Werror=implicit-function-declaration]
  400 |  rte_lcore_iterate(count_per_lcore, &ctx);
      |  ^~~~~~~~~~~~~~~~~
      |  rte_lcore_is_enabled
/root/FreeBSD1201-64_K12.1_GCC9.2.0/x86_64-native-bsdapp-gcc/a9ff3ac1706949508d601399fcea8d52/dpdk/drivers/mempool/bucket/rte_mempool_bucket.c:400:2: error: nested extern declaration of 'rte_lcore_iterate' [-Werror=nested-externs]
  AR librte_mempool_stack.a
  INSTALL-LIB librte_mempool_stack.a
== Build drivers/mempool/octeontx
--
  CC rte_mempool_octeontx.o
  CC otx2_mempool.o
cc1: all warnings being treated as errors
gmake[6]: *** [/root/FreeBSD1201-64_K12.1_GCC9.2.0/x86_64-native-bsdapp-gcc/a9ff3ac1706949508d601399fcea8d52/dpdk/mk/internal/rte.compile-pre.mk:116: rte_mempool_bucket.o] Error 1
gmake[5]: *** [/root/FreeBSD1201-64_K12.1_GCC9.2.0/x86_64-native-bsdapp-gcc/a9ff3ac1706949508d601399fcea8d52/dpdk/mk/rte.subdir.mk:37: bucket] Error 2
gmake[5]: *** Waiting for unfinished jobs....
  CC otx2_mempool_irq.o
  AR librte_mempool_octeontx.a
--
  LD otx2_mempool.o
  AR librte_mempool_octeontx2.a
  INSTALL-LIB librte_mempool_octeontx2.a
gmake[4]: *** [/root/FreeBSD1201-64_K12.1_GCC9.2.0/x86_64-native-bsdapp-gcc/a9ff3ac1706949508d601399fcea8d52/dpdk/mk/rte.subdir.mk:37: mempool] Error 2
gmake[3]: *** [/root/FreeBSD1201-64_K12.1_GCC9.2.0/x86_64-native-bsdapp-gcc/a9ff3ac1706949508d601399fcea8d52/dpdk/mk/rte.sdkbuild.mk:51: drivers] Error 2
gmake[2]: *** [/root/FreeBSD1201-64_K12.1_GCC9.2.0/x86_64-native-bsdapp-gcc/a9ff3ac1706949508d601399fcea8d52/dpdk/mk/rte.sdkroot.mk:99: all] Error 2
gmake[1]: *** [/root/FreeBSD1201-64_K12.1_GCC9.2.0/x86_64-native-bsdapp-gcc/a9ff3ac1706949508d601399fcea8d52/dpdk/mk/rte.sdkinstall.mk:61: pre_install] Error 2
gmake: *** [/root/FreeBSD1201-64_K12.1_GCC9.2.0/x86_64-native-bsdapp-gcc/a9ff3ac1706949508d601399fcea8d52/dpdk/mk/rte.sdkroot.mk:77: install] Error 2


*Build Build Failed #10:
OS: FreeBSD1201-64
Target: x86_64-native-bsdapp-clang
awk -f /usr/src/sys/tools/makeobjops.awk /usr/src/sys/kern/bus_if.m -h
awk -f /usr/src/sys/tools/makeobjops.awk /usr/src/sys/dev/pci/pci_if.m -h
Warning: Object directory not changed from original /root/FreeBSD1201-64_K12.1_Clang8.0.1/x86_64-native-bsdapp-clang/a9ff3ac1706949508d601399fcea8d52/dpdk/x86_64-native-bsdapp-clang/build/kernel/freebsd/contigmem
cc  -Winline -Wall -Werror -include /root/FreeBSD1201-64_K12.1_Clang8.0.1/x86_64-native-bsdapp-clang/a9ff3ac1706949508d601399fcea8d52/dpdk/x86_64-native-bsdapp-clang/include/rte_config.h  -Werror -D_KERNEL -DKLD_MODULE -nostdinc  -I/root/FreeBSD1201-64_K12.1_Clang8.0.1/x86_64-native-bsdapp-clang/a9ff3ac1706949508d601399fcea8d52/dpdk/kernel/freebsd/contigmem -I/root/FreeBSD1201-64_K12.1_Clang8.0.1/x86_64-native-bsdapp-clang/a9ff3ac1706949508d601399fcea8d52/dpdk/x86_64-native-bsdapp-clang/include -I. -I/usr/src/sys -I/usr/src/sys/contrib/ck/include -fno-common  -fno-omit-frame-pointer -mno-omit-leaf-frame-pointer -fdebug-prefix-map=./machine=/usr/src/sys/amd64/include -fdebug-prefix-map=./x86=/usr/src/sys/x86/include   -MD  -MF.depend.contigmem.o -MTcontigmem.o -mcmodel=kernel -mno-red-zone -mno-mmx -mno-sse -msoft-float  -fno-asynchronous-unwind-tables -ffreestanding -fwrapv -fstack-protector -Wall -Wredundant-decls -Wnested-externs -Wstrict-prototypes -Wmissing-prototypes -Wpointer-arith -Wcast-qual -Wundef -Wno-pointer-sign -D__printf__=__freebsd_kprintf__ -Wmissing-include-dirs -fdiagnostics-show-option -Wno-unknown-pragmas -Wno-error-tautological-compare -Wno-error-empty-body -Wno-error-parentheses-equality -Wno-error-unused-function -Wno-error-pointer-sign -Wno-error-shift-negative-value -Wno-address-of-packed-member  -mno-aes -mno-avx  -std=iso9899:1999 -c contigmem.c -o contigmem.o
== Build drivers/common
Warning: Object directory not changed from original /root/FreeBSD1201-64_K12.1_Clang8.0.1/x86_64-native-bsdapp-clang/a9ff3ac1706949508d601399fcea8d52/dpdk/x86_64-native-bsdapp-clang/build/kernel/freebsd/nic_uio
cc  -Winline -Wall -Werror -include /root/FreeBSD1201-64_K12.1_Clang8.0.1/x86_64-native-bsdapp-clang/a9ff3ac1706949508d601399fcea8d52/dpdk/x86_64-native-bsdapp-clang/include/rte_config.h  -Werror -D_KERNEL -DKLD_MODULE -nostdinc  -I/root/FreeBSD1201-64_K12.1_Clang8.0.1/x86_64-native-bsdapp-clang/a9ff3ac1706949508d601399fcea8d52/dpdk/kernel/freebsd/nic_uio -I/root/FreeBSD1201-64_K12.1_Clang8.0.1/x86_64-native-bsdapp-clang/a9ff3ac1706949508d601399fcea8d52/dpdk/x86_64-native-bsdapp-clang/include -I. -I/usr/src/sys -I/usr/src/sys/contrib/ck/include -fno-common  -fno-omit-frame-pointer -mno-omit-leaf-frame-pointer -fdebug-prefix-map=./machine=/usr/src/sys/amd64/include -fdebug-prefix-map=./x86=/usr/src/sys/x86/include   -MD  -MF.depend.nic_uio.o -MTnic_uio.o -mcmodel=kernel -mno-red-zone -mno-mmx -mno-sse -msoft-float  -fno-asynchronous-unwind-tables -ffreestanding -fwrapv -fstack-protector -Wall -Wredundant-decls -Wnested-externs -Wstrict-prototypes -Wmissing-prototypes -Wpointer-arith -Wcast-qual -Wundef -Wno-pointer-sign -D__printf__=__freebsd_kprintf__ -Wmissing-include-dirs -fdiagnostics-show-option -Wno-unknown-pragmas -Wno-error-tautological-compare -Wno-error-empty-body -Wno-error-parentheses-equality -Wno-error-unused-function -Wno-error-pointer-sign -Wno-error-shift-negative-value -Wno-address-of-packed-member  -mno-aes -mno-avx  -std=iso9899:1999 -c nic_uio.c -o nic_uio.o
== Build drivers/common/cpt
ld -m elf_x86_64_fbsd -L/root/FreeBSD1201-64_K12.1_Clang8.0.1/x86_64-native-bsdapp-clang/a9ff3ac1706949508d601399fcea8d52/dpdk/x86_64-native-bsdapp-clang/lib -d -warn-common --build-id=sha1 -r -d -o contigmem.ko contigmem.o
:> export_syms
--
  CC rte_mempool_bucket.o
  CC rte_mempool_ring.o
  CC rte_mempool_stack.o
/root/FreeBSD1201-64_K12.1_Clang8.0.1/x86_64-native-bsdapp-clang/a9ff3ac1706949508d601399fcea8d52/dpdk/drivers/mempool/bucket/rte_mempool_bucket.c:400:2: error: implicit declaration of function 'rte_lcore_iterate' is invalid in C99 [-Werror,-Wimplicit-function-declaration]
        rte_lcore_iterate(count_per_lcore, &ctx);
        ^
/root/FreeBSD1201-64_K12.1_Clang8.0.1/x86_64-native-bsdapp-clang/a9ff3ac1706949508d601399fcea8d52/dpdk/drivers/mempool/bucket/rte_mempool_bucket.c:400:2: error: this function declaration is not a prototype [-Werror,-Wstrict-prototypes]
2 errors generated.
gmake[6]: *** [/root/FreeBSD1201-64_K12.1_Clang8.0.1/x86_64-native-bsdapp-clang/a9ff3ac1706949508d601399fcea8d52/dpdk/mk/internal/rte.compile-pre.mk:116: rte_mempool_bucket.o] Error 1
gmake[5]: *** [/root/FreeBSD1201-64_K12.1_Clang8.0.1/x86_64-native-bsdapp-clang/a9ff3ac1706949508d601399fcea8d52/dpdk/mk/rte.subdir.mk:37: bucket] Error 2
gmake[5]: *** Waiting for unfinished jobs....
  AR librte_mempool_stack.a
  INSTALL-LIB librte_mempool_stack.a
  AR librte_mempool_ring.a
  INSTALL-LIB librte_mempool_ring.a
gmake[4]: *** [/root/FreeBSD1201-64_K12.1_Clang8.0.1/x86_64-native-bsdapp-clang/a9ff3ac1706949508d601399fcea8d52/dpdk/mk/rte.subdir.mk:37: mempool] Error 2
gmake[3]: *** [/root/FreeBSD1201-64_K12.1_Clang8.0.1/x86_64-native-bsdapp-clang/a9ff3ac1706949508d601399fcea8d52/dpdk/mk/rte.sdkbuild.mk:51: drivers] Error 2
gmake[2]: *** [/root/FreeBSD1201-64_K12.1_Clang8.0.1/x86_64-native-bsdapp-clang/a9ff3ac1706949508d601399fcea8d52/dpdk/mk/rte.sdkroot.mk:99: all] Error 2
gmake[1]: *** [/root/FreeBSD1201-64_K12.1_Clang8.0.1/x86_64-native-bsdapp-clang/a9ff3ac1706949508d601399fcea8d52/dpdk/mk/rte.sdkinstall.mk:61: pre_install] Error 2
gmake: *** [/root/FreeBSD1201-64_K12.1_Clang8.0.1/x86_64-native-bsdapp-clang/a9ff3ac1706949508d601399fcea8d52/dpdk/mk/rte.sdkroot.mk:77: install] Error 2


*Build Build Failed #11:
OS: FreeBSD1201-64
Target: x86_64-native-bsdapp-gcc+shared
awk -f /usr/src/sys/tools/makeobjops.awk /usr/src/sys/kern/bus_if.m -h
awk -f /usr/src/sys/tools/makeobjops.awk /usr/src/sys/dev/pci/pci_if.m -h
Warning: Object directory not changed from original /root/FreeBSD1201-64_K12.1_GCC7.3.0/x86_64-native-bsdapp-gcc+shared/a9ff3ac1706949508d601399fcea8d52/dpdk/x86_64-native-bsdapp-gcc/build/kernel/freebsd/contigmem
cc  -Winline -Wall -Werror -include /root/FreeBSD1201-64_K12.1_GCC7.3.0/x86_64-native-bsdapp-gcc+shared/a9ff3ac1706949508d601399fcea8d52/dpdk/x86_64-native-bsdapp-gcc/include/rte_config.h  -Werror -D_KERNEL -DKLD_MODULE -nostdinc  -I/root/FreeBSD1201-64_K12.1_GCC7.3.0/x86_64-native-bsdapp-gcc+shared/a9ff3ac1706949508d601399fcea8d52/dpdk/kernel/freebsd/contigmem -I/root/FreeBSD1201-64_K12.1_GCC7.3.0/x86_64-native-bsdapp-gcc+shared/a9ff3ac1706949508d601399fcea8d52/dpdk/x86_64-native-bsdapp-gcc/include -I. -I/usr/src/sys -I/usr/src/sys/contrib/ck/include -fno-common  -fno-omit-frame-pointer -mno-omit-leaf-frame-pointer -fdebug-prefix-map=./machine=/usr/src/sys/amd64/include -fdebug-prefix-map=./x86=/usr/src/sys/x86/include   -MD  -MF.depend.contigmem.o -MTcontigmem.o -mcmodel=kernel -mno-red-zone -mno-mmx -mno-sse -msoft-float  -fno-asynchronous-unwind-tables -ffreestanding -fwrapv -fstack-protector -Wall -Wredundant-decls -Wnested-externs -Wstrict-prototypes -Wmissing-prototypes -Wpointer-arith -Wcast-qual -Wundef -Wno-pointer-sign -D__printf__=__freebsd_kprintf__ -Wmissing-include-dirs -fdiagnostics-show-option -Wno-unknown-pragmas -Wno-error-tautological-compare -Wno-error-empty-body -Wno-error-parentheses-equality -Wno-error-unused-function -Wno-error-pointer-sign -Wno-error-shift-negative-value -Wno-address-of-packed-member  -mno-aes -mno-avx  -std=iso9899:1999 -c contigmem.c -o contigmem.o
Warning: Object directory not changed from original /root/FreeBSD1201-64_K12.1_GCC7.3.0/x86_64-native-bsdapp-gcc+shared/a9ff3ac1706949508d601399fcea8d52/dpdk/x86_64-native-bsdapp-gcc/build/kernel/freebsd/nic_uio
cc  -Winline -Wall -Werror -include /root/FreeBSD1201-64_K12.1_GCC7.3.0/x86_64-native-bsdapp-gcc+shared/a9ff3ac1706949508d601399fcea8d52/dpdk/x86_64-native-bsdapp-gcc/include/rte_config.h  -Werror -D_KERNEL -DKLD_MODULE -nostdinc  -I/root/FreeBSD1201-64_K12.1_GCC7.3.0/x86_64-native-bsdapp-gcc+shared/a9ff3ac1706949508d601399fcea8d52/dpdk/kernel/freebsd/nic_uio -I/root/FreeBSD1201-64_K12.1_GCC7.3.0/x86_64-native-bsdapp-gcc+shared/a9ff3ac1706949508d601399fcea8d52/dpdk/x86_64-native-bsdapp-gcc/include -I. -I/usr/src/sys -I/usr/src/sys/contrib/ck/include -fno-common  -fno-omit-frame-pointer -mno-omit-leaf-frame-pointer -fdebug-prefix-map=./machine=/usr/src/sys/amd64/include -fdebug-prefix-map=./x86=/usr/src/sys/x86/include   -MD  -MF.depend.nic_uio.o -MTnic_uio.o -mcmodel=kernel -mno-red-zone -mno-mmx -mno-sse -msoft-float  -fno-asynchronous-unwind-tables -ffreestanding -fwrapv -fstack-protector -Wall -Wredundant-decls -Wnested-externs -Wstrict-prototypes -Wmissing-prototypes -Wpointer-arith -Wcast-qual -Wundef -Wno-pointer-sign -D__printf__=__freebsd_kprintf__ -Wmissing-include-dirs -fdiagnostics-show-option -Wno-unknown-pragmas -Wno-error-tautological-compare -Wno-error-empty-body -Wno-error-parentheses-equality -Wno-error-unused-function -Wno-error-pointer-sign -Wno-error-shift-negative-value -Wno-address-of-packed-member  -mno-aes -mno-avx  -std=iso9899:1999 -c nic_uio.c -o nic_uio.o
== Build drivers/common
ld -m elf_x86_64_fbsd -L/root/FreeBSD1201-64_K12.1_GCC7.3.0/x86_64-native-bsdapp-gcc+shared/a9ff3ac1706949508d601399fcea8d52/dpdk/x86_64-native-bsdapp-gcc/lib -d -warn-common --build-id=sha1 -r -d -o contigmem.ko contigmem.o
:> export_syms
--
  CC rte_mempool_bucket.o
  CC rte_mempool_stack.o
/root/FreeBSD1201-64_K12.1_GCC7.3.0/x86_64-native-bsdapp-gcc+shared/a9ff3ac1706949508d601399fcea8d52/dpdk/drivers/mempool/bucket/rte_mempool_bucket.c: In function 'bucket_get_count':
/root/FreeBSD1201-64_K12.1_GCC7.3.0/x86_64-native-bsdapp-gcc+shared/a9ff3ac1706949508d601399fcea8d52/dpdk/drivers/mempool/bucket/rte_mempool_bucket.c:400:2: error: implicit declaration of function 'rte_lcore_iterate'; did you mean 'rte_lcore_is_enabled'? [-Werror=implicit-function-declaration]
  400 |  rte_lcore_iterate(count_per_lcore, &ctx);
      |  ^~~~~~~~~~~~~~~~~
      |  rte_lcore_is_enabled
/root/FreeBSD1201-64_K12.1_GCC7.3.0/x86_64-native-bsdapp-gcc+shared/a9ff3ac1706949508d601399fcea8d52/dpdk/drivers/mempool/bucket/rte_mempool_bucket.c:400:2: error: nested extern declaration of 'rte_lcore_iterate' [-Werror=nested-externs]
  LD librte_mempool_stack.so.20.0.3
  INSTALL-LIB librte_mempool_stack.so.20.0.3
== Build drivers/mempool/octeontx
--
  LD octeontx_fpavf.o
  CC rte_mempool_octeontx.o
cc1: all warnings being treated as errors
gmake[6]: *** [/root/FreeBSD1201-64_K12.1_GCC7.3.0/x86_64-native-bsdapp-gcc+shared/a9ff3ac1706949508d601399fcea8d52/dpdk/mk/internal/rte.compile-pre.mk:116: rte_mempool_bucket.o] Error 1
gmake[5]: *** [/root/FreeBSD1201-64_K12.1_GCC7.3.0/x86_64-native-bsdapp-gcc+shared/a9ff3ac1706949508d601399fcea8d52/dpdk/mk/rte.subdir.mk:37: bucket] Error 2
gmake[5]: *** Waiting for unfinished jobs....
  CC otx2_mempool.o
  CC otx2_mempool_irq.o
--
  LD otx2_mempool.o
  LD librte_mempool_octeontx2.so.20.0.3
  INSTALL-LIB librte_mempool_octeontx2.so.20.0.3
gmake[4]: *** [/root/FreeBSD1201-64_K12.1_GCC7.3.0/x86_64-native-bsdapp-gcc+shared/a9ff3ac1706949508d601399fcea8d52/dpdk/mk/rte.subdir.mk:37: mempool] Error 2
gmake[3]: *** [/root/FreeBSD1201-64_K12.1_GCC7.3.0/x86_64-native-bsdapp-gcc+shared/a9ff3ac1706949508d601399fcea8d52/dpdk/mk/rte.sdkbuild.mk:51: drivers] Error 2
gmake[2]: *** [/root/FreeBSD1201-64_K12.1_GCC7.3.0/x86_64-native-bsdapp-gcc+shared/a9ff3ac1706949508d601399fcea8d52/dpdk/mk/rte.sdkroot.mk:99: all] Error 2
gmake[1]: *** [/root/FreeBSD1201-64_K12.1_GCC7.3.0/x86_64-native-bsdapp-gcc+shared/a9ff3ac1706949508d601399fcea8d52/dpdk/mk/rte.sdkinstall.mk:61: pre_install] Error 2
gmake: *** [/root/FreeBSD1201-64_K12.1_GCC7.3.0/x86_64-native-bsdapp-gcc+shared/a9ff3ac1706949508d601399fcea8d52/dpdk/mk/rte.sdkroot.mk:77: install] Error 2


*Build Build Failed #12:
OS: FreeBSD1201-64
Target: x86_64-native-bsdapp-gcc+debug
awk -f /usr/src/sys/tools/makeobjops.awk /usr/src/sys/kern/bus_if.m -h
awk -f /usr/src/sys/tools/makeobjops.awk /usr/src/sys/dev/pci/pci_if.m -h
Warning: Object directory not changed from original /root/FreeBSD1201-64_K12.1_GCC7.3.0/x86_64-native-bsdapp-gcc+debug/a9ff3ac1706949508d601399fcea8d52/dpdk/x86_64-native-bsdapp-gcc/build/kernel/freebsd/contigmem
cc  -Winline -Wall -Werror -include /root/FreeBSD1201-64_K12.1_GCC7.3.0/x86_64-native-bsdapp-gcc+debug/a9ff3ac1706949508d601399fcea8d52/dpdk/x86_64-native-bsdapp-gcc/include/rte_config.h  -Werror -D_KERNEL -DKLD_MODULE -nostdinc  -I/root/FreeBSD1201-64_K12.1_GCC7.3.0/x86_64-native-bsdapp-gcc+debug/a9ff3ac1706949508d601399fcea8d52/dpdk/kernel/freebsd/contigmem -I/root/FreeBSD1201-64_K12.1_GCC7.3.0/x86_64-native-bsdapp-gcc+debug/a9ff3ac1706949508d601399fcea8d52/dpdk/x86_64-native-bsdapp-gcc/include -I. -I/usr/src/sys -I/usr/src/sys/contrib/ck/include -fno-common  -fno-omit-frame-pointer -mno-omit-leaf-frame-pointer -fdebug-prefix-map=./machine=/usr/src/sys/amd64/include -fdebug-prefix-map=./x86=/usr/src/sys/x86/include   -MD  -MF.depend.contigmem.o -MTcontigmem.o -mcmodel=kernel -mno-red-zone -mno-mmx -mno-sse -msoft-float  -fno-asynchronous-unwind-tables -ffreestanding -fwrapv -fstack-protector -Wall -Wredundant-decls -Wnested-externs -Wstrict-prototypes -Wmissing-prototypes -Wpointer-arith -Wcast-qual -Wundef -Wno-pointer-sign -D__printf__=__freebsd_kprintf__ -Wmissing-include-dirs -fdiagnostics-show-option -Wno-unknown-pragmas -Wno-error-tautological-compare -Wno-error-empty-body -Wno-error-parentheses-equality -Wno-error-unused-function -Wno-error-pointer-sign -Wno-error-shift-negative-value -Wno-address-of-packed-member  -mno-aes -mno-avx  -std=iso9899:1999 -c contigmem.c -o contigmem.o
== Build drivers/common
Warning: Object directory not changed from original /root/FreeBSD1201-64_K12.1_GCC7.3.0/x86_64-native-bsdapp-gcc+debug/a9ff3ac1706949508d601399fcea8d52/dpdk/x86_64-native-bsdapp-gcc/build/kernel/freebsd/nic_uio
cc  -Winline -Wall -Werror -include /root/FreeBSD1201-64_K12.1_GCC7.3.0/x86_64-native-bsdapp-gcc+debug/a9ff3ac1706949508d601399fcea8d52/dpdk/x86_64-native-bsdapp-gcc/include/rte_config.h  -Werror -D_KERNEL -DKLD_MODULE -nostdinc  -I/root/FreeBSD1201-64_K12.1_GCC7.3.0/x86_64-native-bsdapp-gcc+debug/a9ff3ac1706949508d601399fcea8d52/dpdk/kernel/freebsd/nic_uio -I/root/FreeBSD1201-64_K12.1_GCC7.3.0/x86_64-native-bsdapp-gcc+debug/a9ff3ac1706949508d601399fcea8d52/dpdk/x86_64-native-bsdapp-gcc/include -I. -I/usr/src/sys -I/usr/src/sys/contrib/ck/include -fno-common  -fno-omit-frame-pointer -mno-omit-leaf-frame-pointer -fdebug-prefix-map=./machine=/usr/src/sys/amd64/include -fdebug-prefix-map=./x86=/usr/src/sys/x86/include   -MD  -MF.depend.nic_uio.o -MTnic_uio.o -mcmodel=kernel -mno-red-zone -mno-mmx -mno-sse -msoft-float  -fno-asynchronous-unwind-tables -ffreestanding -fwrapv -fstack-protector -Wall -Wredundant-decls -Wnested-externs -Wstrict-prototypes -Wmissing-prototypes -Wpointer-arith -Wcast-qual -Wundef -Wno-pointer-sign -D__printf__=__freebsd_kprintf__ -Wmissing-include-dirs -fdiagnostics-show-option -Wno-unknown-pragmas -Wno-error-tautological-compare -Wno-error-empty-body -Wno-error-parentheses-equality -Wno-error-unused-function -Wno-error-pointer-sign -Wno-error-shift-negative-value -Wno-address-of-packed-member  -mno-aes -mno-avx  -std=iso9899:1999 -c nic_uio.c -o nic_uio.o
ld -m elf_x86_64_fbsd -L/root/FreeBSD1201-64_K12.1_GCC7.3.0/x86_64-native-bsdapp-gcc+debug/a9ff3ac1706949508d601399fcea8d52/dpdk/x86_64-native-bsdapp-gcc/lib -d -warn-common --build-id=sha1 -r -d -o contigmem.ko contigmem.o
:> export_syms
awk -f /usr/src/sys/conf/kmod_syms.awk contigmem.ko  export_syms | xargs -J% objcopy % contigmem.ko
--
  CC rte_mempool_ring.o
  CC rte_mempool_stack.o
/root/FreeBSD1201-64_K12.1_GCC7.3.0/x86_64-native-bsdapp-gcc+debug/a9ff3ac1706949508d601399fcea8d52/dpdk/drivers/mempool/bucket/rte_mempool_bucket.c: In function 'bucket_get_count':
/root/FreeBSD1201-64_K12.1_GCC7.3.0/x86_64-native-bsdapp-gcc+debug/a9ff3ac1706949508d601399fcea8d52/dpdk/drivers/mempool/bucket/rte_mempool_bucket.c:400:2: error: implicit declaration of function 'rte_lcore_iterate'; did you mean 'rte_lcore_is_enabled'? [-Werror=implicit-function-declaration]
  400 |  rte_lcore_iterate(count_per_lcore, &ctx);
      |  ^~~~~~~~~~~~~~~~~
      |  rte_lcore_is_enabled
/root/FreeBSD1201-64_K12.1_GCC7.3.0/x86_64-native-bsdapp-gcc+debug/a9ff3ac1706949508d601399fcea8d52/dpdk/drivers/mempool/bucket/rte_mempool_bucket.c:400:2: error: nested extern declaration of 'rte_lcore_iterate' [-Werror=nested-externs]
  AR librte_mempool_stack.a
  INSTALL-LIB librte_mempool_stack.a
== Build drivers/mempool/octeontx
--
  LD octeontx_fpavf.o
  CC rte_mempool_octeontx.o
cc1: all warnings being treated as errors
gmake[6]: *** [/root/FreeBSD1201-64_K12.1_GCC7.3.0/x86_64-native-bsdapp-gcc+debug/a9ff3ac1706949508d601399fcea8d52/dpdk/mk/internal/rte.compile-pre.mk:116: rte_mempool_bucket.o] Error 1
gmake[5]: *** [/root/FreeBSD1201-64_K12.1_GCC7.3.0/x86_64-native-bsdapp-gcc+debug/a9ff3ac1706949508d601399fcea8d52/dpdk/mk/rte.subdir.mk:37: bucket] Error 2
gmake[5]: *** Waiting for unfinished jobs....
  CC otx2_mempool.o
  CC otx2_mempool_irq.o
--
  LD otx2_mempool.o
  AR librte_mempool_octeontx2.a
  INSTALL-LIB librte_mempool_octeontx2.a
gmake[4]: *** [/root/FreeBSD1201-64_K12.1_GCC7.3.0/x86_64-native-bsdapp-gcc+debug/a9ff3ac1706949508d601399fcea8d52/dpdk/mk/rte.subdir.mk:37: mempool] Error 2
gmake[3]: *** [/root/FreeBSD1201-64_K12.1_GCC7.3.0/x86_64-native-bsdapp-gcc+debug/a9ff3ac1706949508d601399fcea8d52/dpdk/mk/rte.sdkbuild.mk:51: drivers] Error 2
gmake[2]: *** [/root/FreeBSD1201-64_K12.1_GCC7.3.0/x86_64-native-bsdapp-gcc+debug/a9ff3ac1706949508d601399fcea8d52/dpdk/mk/rte.sdkroot.mk:99: all] Error 2
gmake[1]: *** [/root/FreeBSD1201-64_K12.1_GCC7.3.0/x86_64-native-bsdapp-gcc+debug/a9ff3ac1706949508d601399fcea8d52/dpdk/mk/rte.sdkinstall.mk:61: pre_install] Error 2
gmake: *** [/root/FreeBSD1201-64_K12.1_GCC7.3.0/x86_64-native-bsdapp-gcc+debug/a9ff3ac1706949508d601399fcea8d52/dpdk/mk/rte.sdkroot.mk:77: install] Error 2


*Build Build Failed #13:
OS: RHEL77-64
Target: x86_64-native-linuxapp-gcc
  SYMLINK-FILE include/rte_dpaa2_mempool.h
  CC dpaa2_hw_mempool.o
/root/RHEL77-64_K3.10.0_GCC4.8.5/x86_64-native-linuxapp-gcc/a9ff3ac1706949508d601399fcea8d52/dpdk/drivers/mempool/bucket/rte_mempool_bucket.c: In function ‘bucket_get_count’:
/root/RHEL77-64_K3.10.0_GCC4.8.5/x86_64-native-linuxapp-gcc/a9ff3ac1706949508d601399fcea8d52/dpdk/drivers/mempool/bucket/rte_mempool_bucket.c:400:2: error: implicit declaration of function ‘rte_lcore_iterate’ [-Werror=implicit-function-declaration]
  rte_lcore_iterate(count_per_lcore, &ctx);
  ^
/root/RHEL77-64_K3.10.0_GCC4.8.5/x86_64-native-linuxapp-gcc/a9ff3ac1706949508d601399fcea8d52/dpdk/drivers/mempool/bucket/rte_mempool_bucket.c:400:2: error: nested extern declaration of ‘rte_lcore_iterate’ [-Werror=nested-externs]
/root/RHEL77-64_K3.10.0_GCC4.8.5/x86_64-native-linuxapp-gcc/a9ff3ac1706949508d601399fcea8d52/dpdk/drivers/mempool/bucket/rte_mempool_bucket.c: At top level:
cc1: error: unrecognized command line option "-Wno-address-of-packed-member" [-Werror]
cc1: all warnings being treated as errors
make[6]: *** [rte_mempool_bucket.o] Error 1
make[5]: *** [bucket] Error 2
make[5]: *** Waiting for unfinished jobs....
  AR librte_mempool_dpaa.a
  INSTALL-LIB librte_mempool_dpaa.a
  AR librte_mempool_dpaa2.a
  INSTALL-LIB librte_mempool_dpaa2.a
make[4]: *** [mempool] Error 2
make[3]: *** [drivers] Error 2
make[2]: *** [all] Error 2
make[1]: *** [pre_install] Error 2
make: *** [install] Error 2


*Build Build Failed #14:
OS: RHEL80-64
Target: x86_64-native-linuxapp-gcc
  CC dpaa_mempool.o
  CC dpaa2_hw_mempool.o
/root/RHEL80-64_K3.10.0_GCC8.2.1/x86_64-native-linuxapp-gcc/a9ff3ac1706949508d601399fcea8d52/dpdk/drivers/mempool/bucket/rte_mempool_bucket.c: In function ‘bucket_get_count’:
/root/RHEL80-64_K3.10.0_GCC8.2.1/x86_64-native-linuxapp-gcc/a9ff3ac1706949508d601399fcea8d52/dpdk/drivers/mempool/bucket/rte_mempool_bucket.c:400:2: error: implicit declaration of function ‘rte_lcore_iterate’; did you mean ‘rte_lcore_is_enabled’? [-Werror=implicit-function-declaration]
  rte_lcore_iterate(count_per_lcore, &ctx);
  ^~~~~~~~~~~~~~~~~
  rte_lcore_is_enabled
/root/RHEL80-64_K3.10.0_GCC8.2.1/x86_64-native-linuxapp-gcc/a9ff3ac1706949508d601399fcea8d52/dpdk/drivers/mempool/bucket/rte_mempool_bucket.c:400:2: error: nested extern declaration of ‘rte_lcore_iterate’ [-Werror=nested-externs]
  AR librte_mempool_dpaa.a
  INSTALL-LIB librte_mempool_dpaa.a
== Build drivers/mempool/ring
--
  INSTALL-LIB librte_mempool_ring.a
== Build drivers/mempool/octeontx2
/root/RHEL80-64_K3.10.0_GCC8.2.1/x86_64-native-linuxapp-gcc/a9ff3ac1706949508d601399fcea8d52/dpdk/drivers/mempool/bucket/rte_mempool_bucket.c: At top level:
cc1: error: unrecognized command line option ‘-Wno-address-of-packed-member’ [-Werror]
cc1: all warnings being treated as errors
make[6]: *** [/root/RHEL80-64_K3.10.0_GCC8.2.1/x86_64-native-linuxapp-gcc/a9ff3ac1706949508d601399fcea8d52/dpdk/mk/internal/rte.compile-pre.mk:116: rte_mempool_bucket.o] Error 1
make[5]: *** [/root/RHEL80-64_K3.10.0_GCC8.2.1/x86_64-native-linuxapp-gcc/a9ff3ac1706949508d601399fcea8d52/dpdk/mk/rte.subdir.mk:37: bucket] Error 2
make[5]: *** Waiting for unfinished jobs....
  CC otx2_mempool_ops.o
  CC octeontx_fpavf.o
--
  AR librte_mempool_octeontx2.a
  INSTALL-LIB librte_mempool_octeontx2.a
  INSTALL-LIB librte_mempool_octeontx.a
make[4]: *** [/root/RHEL80-64_K3.10.0_GCC8.2.1/x86_64-native-linuxapp-gcc/a9ff3ac1706949508d601399fcea8d52/dpdk/mk/rte.subdir.mk:37: mempool] Error 2
make[3]: *** [/root/RHEL80-64_K3.10.0_GCC8.2.1/x86_64-native-linuxapp-gcc/a9ff3ac1706949508d601399fcea8d52/dpdk/mk/rte.sdkbuild.mk:51: drivers] Error 2
make[2]: *** [/root/RHEL80-64_K3.10.0_GCC8.2.1/x86_64-native-linuxapp-gcc/a9ff3ac1706949508d601399fcea8d52/dpdk/mk/rte.sdkroot.mk:99: all] Error 2
make[1]: *** [/root/RHEL80-64_K3.10.0_GCC8.2.1/x86_64-native-linuxapp-gcc/a9ff3ac1706949508d601399fcea8d52/dpdk/mk/rte.sdkinstall.mk:61: pre_install] Error 2
make: *** [/root/RHEL80-64_K3.10.0_GCC8.2.1/x86_64-native-linuxapp-gcc/a9ff3ac1706949508d601399fcea8d52/dpdk/mk/rte.sdkroot.mk:77: install] Error 2


*Build Build Failed #15:
OS: SUSE15-64
Target: x86_64-native-linuxapp-clang
  SYMLINK-FILE include/rte_dpaa2_mempool.h
  CC rte_mempool_bucket.o
  CC dpaa2_hw_mempool.o
/root/SUSE15-64_K4.12.14_Clang5.0.1/x86_64-native-linuxapp-clang/a9ff3ac1706949508d601399fcea8d52/dpdk/drivers/mempool/bucket/rte_mempool_bucket.c:400:2: error: implicit declaration of function 'rte_lcore_iterate' is invalid in C99 [-Werror,-Wimplicit-function-declaration]
        rte_lcore_iterate(count_per_lcore, &ctx);
        ^
/root/SUSE15-64_K4.12.14_Clang5.0.1/x86_64-native-linuxapp-clang/a9ff3ac1706949508d601399fcea8d52/dpdk/drivers/mempool/bucket/rte_mempool_bucket.c:400:2: error: this function declaration is not a prototype [-Werror,-Wstrict-prototypes]
2 errors generated.
make[6]: *** [/root/SUSE15-64_K4.12.14_Clang5.0.1/x86_64-native-linuxapp-clang/a9ff3ac1706949508d601399fcea8d52/dpdk/mk/internal/rte.compile-pre.mk:116: rte_mempool_bucket.o] Error 1
make[5]: *** [/root/SUSE15-64_K4.12.14_Clang5.0.1/x86_64-native-linuxapp-clang/a9ff3ac1706949508d601399fcea8d52/dpdk/mk/rte.subdir.mk:37: bucket] Error 2
make[5]: *** Waiting for unfinished jobs....
  AR librte_mempool_dpaa.a
  INSTALL-LIB librte_mempool_dpaa.a
  AR librte_mempool_dpaa2.a
  INSTALL-LIB librte_mempool_dpaa2.a
make[4]: *** [/root/SUSE15-64_K4.12.14_Clang5.0.1/x86_64-native-linuxapp-clang/a9ff3ac1706949508d601399fcea8d52/dpdk/mk/rte.subdir.mk:37: mempool] Error 2
make[3]: *** [/root/SUSE15-64_K4.12.14_Clang5.0.1/x86_64-native-linuxapp-clang/a9ff3ac1706949508d601399fcea8d52/dpdk/mk/rte.sdkbuild.mk:51: drivers] Error 2
make[2]: *** [/root/SUSE15-64_K4.12.14_Clang5.0.1/x86_64-native-linuxapp-clang/a9ff3ac1706949508d601399fcea8d52/dpdk/mk/rte.sdkroot.mk:99: all] Error 2
make[1]: *** [/root/SUSE15-64_K4.12.14_Clang5.0.1/x86_64-native-linuxapp-clang/a9ff3ac1706949508d601399fcea8d52/dpdk/mk/rte.sdkinstall.mk:61: pre_install] Error 2
make: *** [/root/SUSE15-64_K4.12.14_Clang5.0.1/x86_64-native-linuxapp-clang/a9ff3ac1706949508d601399fcea8d52/dpdk/mk/rte.sdkroot.mk:77: install] Error 2


*Build Build Failed #16:
OS: SUSE15-64
Target: x86_64-native-linuxapp-gcc
  CC rte_mempool_bucket.o
  CC dpaa2_hw_mempool.o
/root/SUSE15-64_K4.12.14_GCC7.3.1/x86_64-native-linuxapp-gcc/a9ff3ac1706949508d601399fcea8d52/dpdk/drivers/mempool/bucket/rte_mempool_bucket.c: In function ‘bucket_get_count’:
/root/SUSE15-64_K4.12.14_GCC7.3.1/x86_64-native-linuxapp-gcc/a9ff3ac1706949508d601399fcea8d52/dpdk/drivers/mempool/bucket/rte_mempool_bucket.c:400:2: error: implicit declaration of function ‘rte_lcore_iterate’; did you mean ‘rte_lcore_is_enabled’? [-Werror=implicit-function-declaration]
  rte_lcore_iterate(count_per_lcore, &ctx);
  ^~~~~~~~~~~~~~~~~
  rte_lcore_is_enabled
/root/SUSE15-64_K4.12.14_GCC7.3.1/x86_64-native-linuxapp-gcc/a9ff3ac1706949508d601399fcea8d52/dpdk/drivers/mempool/bucket/rte_mempool_bucket.c:400:2: error: nested extern declaration of ‘rte_lcore_iterate’ [-Werror=nested-externs]
  AR librte_mempool_dpaa2.a
  INSTALL-LIB librte_mempool_dpaa2.a
== Build drivers/mempool/ring
--
  CC octeontx_fpavf.o
  CC otx2_mempool_ops.o
/root/SUSE15-64_K4.12.14_GCC7.3.1/x86_64-native-linuxapp-gcc/a9ff3ac1706949508d601399fcea8d52/dpdk/drivers/mempool/bucket/rte_mempool_bucket.c: At top level:
cc1: error: unrecognized command line option ‘-Wno-address-of-packed-member’ [-Werror]
cc1: all warnings being treated as errors
make[6]: *** [/root/SUSE15-64_K4.12.14_GCC7.3.1/x86_64-native-linuxapp-gcc/a9ff3ac1706949508d601399fcea8d52/dpdk/mk/internal/rte.compile-pre.mk:116: rte_mempool_bucket.o] Error 1
make[5]: *** [/root/SUSE15-64_K4.12.14_GCC7.3.1/x86_64-native-linuxapp-gcc/a9ff3ac1706949508d601399fcea8d52/dpdk/mk/rte.subdir.mk:37: bucket] Error 2
make[5]: *** Waiting for unfinished jobs....
  CC otx2_mempool.o
  PMDINFO octeontx_fpavf.o.pmd.c
--
  INSTALL-LIB librte_mempool_octeontx.a
  AR librte_mempool_octeontx2.a
  INSTALL-LIB librte_mempool_octeontx2.a
make[4]: *** [/root/SUSE15-64_K4.12.14_GCC7.3.1/x86_64-native-linuxapp-gcc/a9ff3ac1706949508d601399fcea8d52/dpdk/mk/rte.subdir.mk:37: mempool] Error 2
make[3]: *** [/root/SUSE15-64_K4.12.14_GCC7.3.1/x86_64-native-linuxapp-gcc/a9ff3ac1706949508d601399fcea8d52/dpdk/mk/rte.sdkbuild.mk:51: drivers] Error 2
make[2]: *** [/root/SUSE15-64_K4.12.14_GCC7.3.1/x86_64-native-linuxapp-gcc/a9ff3ac1706949508d601399fcea8d52/dpdk/mk/rte.sdkroot.mk:99: all] Error 2
make[1]: *** [/root/SUSE15-64_K4.12.14_GCC7.3.1/x86_64-native-linuxapp-gcc/a9ff3ac1706949508d601399fcea8d52/dpdk/mk/rte.sdkinstall.mk:61: pre_install] Error 2
make: *** [/root/SUSE15-64_K4.12.14_GCC7.3.1/x86_64-native-linuxapp-gcc/a9ff3ac1706949508d601399fcea8d52/dpdk/mk/rte.sdkroot.mk:77: install] Error 2


*Build Build Failed #17:
OS: UB1804-32
Target: i686-native-linuxapp-gcc
  SYMLINK-FILE include/rte_dpaa2_mempool.h
  CC dpaa2_hw_mempool.o
/root/UB1804-32_K4.15.0_GCC7.3.0/i686-native-linuxapp-gcc/a9ff3ac1706949508d601399fcea8d52/dpdk/drivers/mempool/bucket/rte_mempool_bucket.c: In function ‘bucket_get_count’:
/root/UB1804-32_K4.15.0_GCC7.3.0/i686-native-linuxapp-gcc/a9ff3ac1706949508d601399fcea8d52/dpdk/drivers/mempool/bucket/rte_mempool_bucket.c:400:2: error: implicit declaration of function ‘rte_lcore_iterate’; did you mean ‘rte_lcore_is_enabled’? [-Werror=implicit-function-declaration]
  rte_lcore_iterate(count_per_lcore, &ctx);
  ^~~~~~~~~~~~~~~~~
  rte_lcore_is_enabled
/root/UB1804-32_K4.15.0_GCC7.3.0/i686-native-linuxapp-gcc/a9ff3ac1706949508d601399fcea8d52/dpdk/drivers/mempool/bucket/rte_mempool_bucket.c:400:2: error: nested extern declaration of ‘rte_lcore_iterate’ [-Werror=nested-externs]
  AR librte_mempool_dpaa.a
  INSTALL-LIB librte_mempool_dpaa.a
  AR librte_mempool_dpaa2.a
--
  LD octeontx_fpavf.o
  CC rte_mempool_octeontx.o
/root/UB1804-32_K4.15.0_GCC7.3.0/i686-native-linuxapp-gcc/a9ff3ac1706949508d601399fcea8d52/dpdk/drivers/mempool/bucket/rte_mempool_bucket.c: At top level:
cc1: error: unrecognized command line option ‘-Wno-address-of-packed-member’ [-Werror]
cc1: all warnings being treated as errors
/root/UB1804-32_K4.15.0_GCC7.3.0/i686-native-linuxapp-gcc/a9ff3ac1706949508d601399fcea8d52/dpdk/mk/internal/rte.compile-pre.mk:114: recipe for target 'rte_mempool_bucket.o' failed
make[6]: *** [rte_mempool_bucket.o] Error 1
/root/UB1804-32_K4.15.0_GCC7.3.0/i686-native-linuxapp-gcc/a9ff3ac1706949508d601399fcea8d52/dpdk/mk/rte.subdir.mk:35: recipe for target 'bucket' failed
make[5]: *** [bucket] Error 2
make[5]: *** Waiting for unfinished jobs....
  CC otx2_mempool.o
  AR librte_mempool_octeontx.a
--
  LD otx2_mempool.o
  AR librte_mempool_octeontx2.a
  INSTALL-LIB librte_mempool_octeontx2.a
/root/UB1804-32_K4.15.0_GCC7.3.0/i686-native-linuxapp-gcc/a9ff3ac1706949508d601399fcea8d52/dpdk/mk/rte.subdir.mk:35: recipe for target 'mempool' failed
make[4]: *** [mempool] Error 2
/root/UB1804-32_K4.15.0_GCC7.3.0/i686-native-linuxapp-gcc/a9ff3ac1706949508d601399fcea8d52/dpdk/mk/rte.sdkbuild.mk:51: recipe for target 'drivers' failed
make[3]: *** [drivers] Error 2
/root/UB1804-32_K4.15.0_GCC7.3.0/i686-native-linuxapp-gcc/a9ff3ac1706949508d601399fcea8d52/dpdk/mk/rte.sdkroot.mk:98: recipe for target 'all' failed
make[2]: *** [all] Error 2
/root/UB1804-32_K4.15.0_GCC7.3.0/i686-native-linuxapp-gcc/a9ff3ac1706949508d601399fcea8d52/dpdk/mk/rte.sdkinstall.mk:60: recipe for target 'pre_install' failed
make[1]: *** [pre_install] Error 2
/root/UB1804-32_K4.15.0_GCC7.3.0/i686-native-linuxapp-gcc/a9ff3ac1706949508d601399fcea8d52/dpdk/mk/rte.sdkroot.mk:77: recipe for target 'install' failed
make: *** [install] Error 2


*Build Build Failed #18:
OS: UB1804-64
Target: x86_64-native-linuxapp-clang
  CC dpaa_mempool.o
  CC rte_mempool_bucket.o
  CC dpaa2_hw_mempool.o
/root/UB1804-64_K4.15.0_Clang6.0.0/x86_64-native-linuxapp-clang/a9ff3ac1706949508d601399fcea8d52/dpdk/drivers/mempool/bucket/rte_mempool_bucket.c:400:2: error: implicit declaration of function 'rte_lcore_iterate' is invalid in C99 [-Werror,-Wimplicit-function-declaration]
        rte_lcore_iterate(count_per_lcore, &ctx);
        ^
/root/UB1804-64_K4.15.0_Clang6.0.0/x86_64-native-linuxapp-clang/a9ff3ac1706949508d601399fcea8d52/dpdk/drivers/mempool/bucket/rte_mempool_bucket.c:400:2: error: this function declaration is not a prototype [-Werror,-Wstrict-prototypes]
2 errors generated.
/root/UB1804-64_K4.15.0_Clang6.0.0/x86_64-native-linuxapp-clang/a9ff3ac1706949508d601399fcea8d52/dpdk/mk/internal/rte.compile-pre.mk:114: recipe for target 'rte_mempool_bucket.o' failed
make[6]: *** [rte_mempool_bucket.o] Error 1
/root/UB1804-64_K4.15.0_Clang6.0.0/x86_64-native-linuxapp-clang/a9ff3ac1706949508d601399fcea8d52/dpdk/mk/rte.subdir.mk:35: recipe for target 'bucket' failed
make[5]: *** [bucket] Error 2
make[5]: *** Waiting for unfinished jobs....
  AR librte_mempool_dpaa.a
  INSTALL-LIB librte_mempool_dpaa.a
  AR librte_mempool_dpaa2.a
  INSTALL-LIB librte_mempool_dpaa2.a
/root/UB1804-64_K4.15.0_Clang6.0.0/x86_64-native-linuxapp-clang/a9ff3ac1706949508d601399fcea8d52/dpdk/mk/rte.subdir.mk:35: recipe for target 'mempool' failed
make[4]: *** [mempool] Error 2
/root/UB1804-64_K4.15.0_Clang6.0.0/x86_64-native-linuxapp-clang/a9ff3ac1706949508d601399fcea8d52/dpdk/mk/rte.sdkbuild.mk:51: recipe for target 'drivers' failed
make[3]: *** [drivers] Error 2
/root/UB1804-64_K4.15.0_Clang6.0.0/x86_64-native-linuxapp-clang/a9ff3ac1706949508d601399fcea8d52/dpdk/mk/rte.sdkroot.mk:98: recipe for target 'all' failed
make[2]: *** [all] Error 2
/root/UB1804-64_K4.15.0_Clang6.0.0/x86_64-native-linuxapp-clang/a9ff3ac1706949508d601399fcea8d52/dpdk/mk/rte.sdkinstall.mk:60: recipe for target 'pre_install' failed
make[1]: *** [pre_install] Error 2
/root/UB1804-64_K4.15.0_Clang6.0.0/x86_64-native-linuxapp-clang/a9ff3ac1706949508d601399fcea8d52/dpdk/mk/rte.sdkroot.mk:77: recipe for target 'install' failed
make: *** [install] Error 2


*Build Build Failed #19:
OS: UB1804-64
Target: x86_64-native-linuxapp-gcc
  CC dpaa_mempool.o
  CC dpaa2_hw_mempool.o
/root/UB1804-64_K4.15.0_GCC7.3.0/x86_64-native-linuxapp-gcc/a9ff3ac1706949508d601399fcea8d52/dpdk/drivers/mempool/bucket/rte_mempool_bucket.c: In function ‘bucket_get_count’:
/root/UB1804-64_K4.15.0_GCC7.3.0/x86_64-native-linuxapp-gcc/a9ff3ac1706949508d601399fcea8d52/dpdk/drivers/mempool/bucket/rte_mempool_bucket.c:400:2: error: implicit declaration of function ‘rte_lcore_iterate’; did you mean ‘rte_lcore_is_enabled’? [-Werror=implicit-function-declaration]
  rte_lcore_iterate(count_per_lcore, &ctx);
  ^~~~~~~~~~~~~~~~~
  rte_lcore_is_enabled
/root/UB1804-64_K4.15.0_GCC7.3.0/x86_64-native-linuxapp-gcc/a9ff3ac1706949508d601399fcea8d52/dpdk/drivers/mempool/bucket/rte_mempool_bucket.c:400:2: error: nested extern declaration of ‘rte_lcore_iterate’ [-Werror=nested-externs]
  AR librte_mempool_dpaa.a
  INSTALL-LIB librte_mempool_dpaa.a
== Build drivers/mempool/ring
--
  PMDINFO octeontx_fpavf.o.pmd.c
  CC octeontx_fpavf.o.pmd.o
/root/UB1804-64_K4.15.0_GCC7.3.0/x86_64-native-linuxapp-gcc/a9ff3ac1706949508d601399fcea8d52/dpdk/drivers/mempool/bucket/rte_mempool_bucket.c: At top level:
cc1: error: unrecognized command line option ‘-Wno-address-of-packed-member’ [-Werror]
cc1: all warnings being treated as errors
  LD octeontx_fpavf.o
/root/UB1804-64_K4.15.0_GCC7.3.0/x86_64-native-linuxapp-gcc/a9ff3ac1706949508d601399fcea8d52/dpdk/mk/internal/rte.compile-pre.mk:114: recipe for target 'rte_mempool_bucket.o' failed
make[6]: *** [rte_mempool_bucket.o] Error 1
/root/UB1804-64_K4.15.0_GCC7.3.0/x86_64-native-linuxapp-gcc/a9ff3ac1706949508d601399fcea8d52/dpdk/mk/rte.subdir.mk:35: recipe for target 'bucket' failed
make[5]: *** [bucket] Error 2
make[5]: *** Waiting for unfinished jobs....
  CC otx2_mempool.o
  CC rte_mempool_octeontx.o
--
  LD otx2_mempool.o
  AR librte_mempool_octeontx2.a
  INSTALL-LIB librte_mempool_octeontx2.a
/root/UB1804-64_K4.15.0_GCC7.3.0/x86_64-native-linuxapp-gcc/a9ff3ac1706949508d601399fcea8d52/dpdk/mk/rte.subdir.mk:35: recipe for target 'mempool' failed
make[4]: *** [mempool] Error 2
/root/UB1804-64_K4.15.0_GCC7.3.0/x86_64-native-linuxapp-gcc/a9ff3ac1706949508d601399fcea8d52/dpdk/mk/rte.sdkbuild.mk:51: recipe for target 'drivers' failed
make[3]: *** [drivers] Error 2
/root/UB1804-64_K4.15.0_GCC7.3.0/x86_64-native-linuxapp-gcc/a9ff3ac1706949508d601399fcea8d52/dpdk/mk/rte.sdkroot.mk:98: recipe for target 'all' failed
make[2]: *** [all] Error 2
/root/UB1804-64_K4.15.0_GCC7.3.0/x86_64-native-linuxapp-gcc/a9ff3ac1706949508d601399fcea8d52/dpdk/mk/rte.sdkinstall.mk:60: recipe for target 'pre_install' failed
make[1]: *** [pre_install] Error 2
/root/UB1804-64_K4.15.0_GCC7.3.0/x86_64-native-linuxapp-gcc/a9ff3ac1706949508d601399fcea8d52/dpdk/mk/rte.sdkroot.mk:77: recipe for target 'install' failed
make: *** [install] Error 2


*Build Build Failed #20:
OS: UB1804-64
Target: x86_64-native-linuxapp-icc
ld: /root/UB1804-64_K4.15.0_ICC19.0.0/x86_64-native-linuxapp-icc/a9ff3ac1706949508d601399fcea8d52/dpdk/x86_64-native-linuxapp-icc/lib/librte_mempool_bucket.a(rte_mempool_bucket.o): in function `bucket_get_count':
rte_mempool_bucket.c:(.text+0xdad2): undefined reference to `rte_lcore_iterate'
  CC test_atomic.o
/root/UB1804-64_K4.15.0_ICC19.0.0/x86_64-native-linuxapp-icc/a9ff3ac1706949508d601399fcea8d52/dpdk/mk/rte.app.mk:452: recipe for target 'dpdk-procinfo' failed
make[5]: *** [dpdk-procinfo] Error 1
/root/UB1804-64_K4.15.0_ICC19.0.0/x86_64-native-linuxapp-icc/a9ff3ac1706949508d601399fcea8d52/dpdk/mk/rte.subdir.mk:35: recipe for target 'proc-info' failed
make[4]: *** [proc-info] Error 2
make[4]: *** Waiting for unfinished jobs....
  CC test_barrier.o
  CC parameters.o
--
  LD testpmd
ld: /root/UB1804-64_K4.15.0_ICC19.0.0/x86_64-native-linuxapp-icc/a9ff3ac1706949508d601399fcea8d52/dpdk/x86_64-native-linuxapp-icc/lib/librte_mempool_bucket.a(rte_mempool_bucket.o): in function `bucket_get_count':
rte_mempool_bucket.c:(.text+0xdad2): undefined reference to `rte_lcore_iterate'
/root/UB1804-64_K4.15.0_ICC19.0.0/x86_64-native-linuxapp-icc/a9ff3ac1706949508d601399fcea8d52/dpdk/mk/rte.app.mk:452: recipe for target 'testpmd' failed
make[5]: *** [testpmd] Error 1
/root/UB1804-64_K4.15.0_ICC19.0.0/x86_64-native-linuxapp-icc/a9ff3ac1706949508d601399fcea8d52/dpdk/mk/rte.subdir.mk:35: recipe for target 'test-pmd' failed
make[4]: *** [test-pmd] Error 2
  CC test_ring_peek_stress.o
  CC test_ring_rts_stress.o
  CC test_ring_stress.o
--
  LD test
ld: /root/UB1804-64_K4.15.0_ICC19.0.0/x86_64-native-linuxapp-icc/a9ff3ac1706949508d601399fcea8d52/dpdk/x86_64-native-linuxapp-icc/lib/librte_mempool_bucket.a(rte_mempool_bucket.o): in function `bucket_get_count':
rte_mempool_bucket.c:(.text+0xdad2): undefined reference to `rte_lcore_iterate'
/root/UB1804-64_K4.15.0_ICC19.0.0/x86_64-native-linuxapp-icc/a9ff3ac1706949508d601399fcea8d52/dpdk/mk/rte.app.mk:452: recipe for target 'test' failed
make[5]: *** [test] Error 1
/root/UB1804-64_K4.15.0_ICC19.0.0/x86_64-native-linuxapp-icc/a9ff3ac1706949508d601399fcea8d52/dpdk/mk/rte.subdir.mk:35: recipe for target 'test' failed
make[4]: *** [test] Error 2
/root/UB1804-64_K4.15.0_ICC19.0.0/x86_64-native-linuxapp-icc/a9ff3ac1706949508d601399fcea8d52/dpdk/mk/rte.sdkbuild.mk:51: recipe for target 'app' failed
make[3]: *** [app] Error 2
/root/UB1804-64_K4.15.0_ICC19.0.0/x86_64-native-linuxapp-icc/a9ff3ac1706949508d601399fcea8d52/dpdk/mk/rte.sdkroot.mk:98: recipe for target 'all' failed
make[2]: *** [all] Error 2
/root/UB1804-64_K4.15.0_ICC19.0.0/x86_64-native-linuxapp-icc/a9ff3ac1706949508d601399fcea8d52/dpdk/mk/rte.sdkinstall.mk:60: recipe for target 'pre_install' failed
make[1]: *** [pre_install] Error 2
/root/UB1804-64_K4.15.0_ICC19.0.0/x86_64-native-linuxapp-icc/a9ff3ac1706949508d601399fcea8d52/dpdk/mk/rte.sdkroot.mk:77: recipe for target 'install' failed
make: *** [install] Error 2


*Build Build Failed #21:
OS: UB2004-64
Target: x86_64-native-linuxapp-clang
  CC rte_mempool_bucket.o
  CC dpaa2_hw_mempool.o
  CC dpaa_mempool.o
/root/UB2004-64_K5.4.0_Clang10.0.0/x86_64-native-linuxapp-clang/a9ff3ac1706949508d601399fcea8d52/dpdk/drivers/mempool/bucket/rte_mempool_bucket.c:400:2: error: implicit declaration of function 'rte_lcore_iterate' is invalid in C99 [-Werror,-Wimplicit-function-declaration]
        rte_lcore_iterate(count_per_lcore, &ctx);
        ^
1 error generated.
make[6]: *** [/root/UB2004-64_K5.4.0_Clang10.0.0/x86_64-native-linuxapp-clang/a9ff3ac1706949508d601399fcea8d52/dpdk/mk/internal/rte.compile-pre.mk:116: rte_mempool_bucket.o] Error 1
make[5]: *** [/root/UB2004-64_K5.4.0_Clang10.0.0/x86_64-native-linuxapp-clang/a9ff3ac1706949508d601399fcea8d52/dpdk/mk/rte.subdir.mk:37: bucket] Error 2
make[5]: *** Waiting for unfinished jobs....
  AR librte_mempool_dpaa2.a
  INSTALL-LIB librte_mempool_dpaa2.a
  AR librte_mempool_dpaa.a
  INSTALL-LIB librte_mempool_dpaa.a
make[4]: *** [/root/UB2004-64_K5.4.0_Clang10.0.0/x86_64-native-linuxapp-clang/a9ff3ac1706949508d601399fcea8d52/dpdk/mk/rte.subdir.mk:37: mempool] Error 2
make[3]: *** [/root/UB2004-64_K5.4.0_Clang10.0.0/x86_64-native-linuxapp-clang/a9ff3ac1706949508d601399fcea8d52/dpdk/mk/rte.sdkbuild.mk:51: drivers] Error 2
make[2]: *** [/root/UB2004-64_K5.4.0_Clang10.0.0/x86_64-native-linuxapp-clang/a9ff3ac1706949508d601399fcea8d52/dpdk/mk/rte.sdkroot.mk:99: all] Error 2
make[1]: *** [/root/UB2004-64_K5.4.0_Clang10.0.0/x86_64-native-linuxapp-clang/a9ff3ac1706949508d601399fcea8d52/dpdk/mk/rte.sdkinstall.mk:61: pre_install] Error 2
make: *** [/root/UB2004-64_K5.4.0_Clang10.0.0/x86_64-native-linuxapp-clang/a9ff3ac1706949508d601399fcea8d52/dpdk/mk/rte.sdkroot.mk:77: install] Error 2


*Build Build Failed #22:
OS: UB2004-64
Target: x86_64-native-linuxapp-gcc
  CC dpaa_mempool.o
  CC dpaa2_hw_mempool.o
/root/UB2004-64_K5.4.0_GCC9.3.0/x86_64-native-linuxapp-gcc/a9ff3ac1706949508d601399fcea8d52/dpdk/drivers/mempool/bucket/rte_mempool_bucket.c: In function ‘bucket_get_count’:
/root/UB2004-64_K5.4.0_GCC9.3.0/x86_64-native-linuxapp-gcc/a9ff3ac1706949508d601399fcea8d52/dpdk/drivers/mempool/bucket/rte_mempool_bucket.c:400:2: error: implicit declaration of function ‘rte_lcore_iterate’; did you mean ‘rte_lcore_is_enabled’? [-Werror=implicit-function-declaration]
  400 |  rte_lcore_iterate(count_per_lcore, &ctx);
      |  ^~~~~~~~~~~~~~~~~
      |  rte_lcore_is_enabled
/root/UB2004-64_K5.4.0_GCC9.3.0/x86_64-native-linuxapp-gcc/a9ff3ac1706949508d601399fcea8d52/dpdk/drivers/mempool/bucket/rte_mempool_bucket.c:400:2: error: nested extern declaration of ‘rte_lcore_iterate’ [-Werror=nested-externs]
  AR librte_mempool_dpaa.a
  INSTALL-LIB librte_mempool_dpaa.a
== Build drivers/mempool/ring
--
  INSTALL-LIB librte_mempool_stack.a
== Build drivers/mempool/octeontx
cc1: all warnings being treated as errors
make[6]: *** [/root/UB2004-64_K5.4.0_GCC9.3.0/x86_64-native-linuxapp-gcc/a9ff3ac1706949508d601399fcea8d52/dpdk/mk/internal/rte.compile-pre.mk:116: rte_mempool_bucket.o] Error 1
make[5]: *** [/root/UB2004-64_K5.4.0_GCC9.3.0/x86_64-native-linuxapp-gcc/a9ff3ac1706949508d601399fcea8d52/dpdk/mk/rte.subdir.mk:37: bucket] Error 2
make[5]: *** Waiting for unfinished jobs....
  AR librte_mempool_ring.a
  INSTALL-LIB librte_mempool_ring.a
--
  LD octeontx_fpavf.o
  AR librte_mempool_octeontx.a
  INSTALL-LIB librte_mempool_octeontx.a
make[4]: *** [/root/UB2004-64_K5.4.0_GCC9.3.0/x86_64-native-linuxapp-gcc/a9ff3ac1706949508d601399fcea8d52/dpdk/mk/rte.subdir.mk:37: mempool] Error 2
make[3]: *** [/root/UB2004-64_K5.4.0_GCC9.3.0/x86_64-native-linuxapp-gcc/a9ff3ac1706949508d601399fcea8d52/dpdk/mk/rte.sdkbuild.mk:51: drivers] Error 2
make[2]: *** [/root/UB2004-64_K5.4.0_GCC9.3.0/x86_64-native-linuxapp-gcc/a9ff3ac1706949508d601399fcea8d52/dpdk/mk/rte.sdkroot.mk:99: all] Error 2
make[1]: *** [/root/UB2004-64_K5.4.0_GCC9.3.0/x86_64-native-linuxapp-gcc/a9ff3ac1706949508d601399fcea8d52/dpdk/mk/rte.sdkinstall.mk:61: pre_install] Error 2
make: *** [/root/UB2004-64_K5.4.0_GCC9.3.0/x86_64-native-linuxapp-gcc/a9ff3ac1706949508d601399fcea8d52/dpdk/mk/rte.sdkroot.mk:77: install] Error 2


*Build Build Failed #23:
OS: UB2004-64
Target: x86_64-native-linuxapp-icc
ld: /root/UB2004-64_K5.4.0_ICC19.0.0/x86_64-native-linuxapp-icc/a9ff3ac1706949508d601399fcea8d52/dpdk/x86_64-native-linuxapp-icc/lib/librte_mempool_bucket.a(rte_mempool_bucket.o): in function `bucket_get_count':
rte_mempool_bucket.c:(.text+0xdad2): undefined reference to `rte_lcore_iterate'
  CC test_per_lcore.o
make[5]: *** [/root/UB2004-64_K5.4.0_ICC19.0.0/x86_64-native-linuxapp-icc/a9ff3ac1706949508d601399fcea8d52/dpdk/mk/rte.app.mk:454: dpdk-procinfo] Error 1
make[4]: *** [/root/UB2004-64_K5.4.0_ICC19.0.0/x86_64-native-linuxapp-icc/a9ff3ac1706949508d601399fcea8d52/dpdk/mk/rte.subdir.mk:37: proc-info] Error 2
make[4]: *** Waiting for unfinished jobs....
  CC parameters.o
  CC test_atomic.o
--
  CC test_ring_perf.o
ld: /root/UB2004-64_K5.4.0_ICC19.0.0/x86_64-native-linuxapp-icc/a9ff3ac1706949508d601399fcea8d52/dpdk/x86_64-native-linuxapp-icc/lib/librte_mempool_bucket.a(rte_mempool_bucket.o): in function `bucket_get_count':
rte_mempool_bucket.c:(.text+0xdad2): undefined reference to `rte_lcore_iterate'
make[5]: *** [/root/UB2004-64_K5.4.0_ICC19.0.0/x86_64-native-linuxapp-icc/a9ff3ac1706949508d601399fcea8d52/dpdk/mk/rte.app.mk:454: testpmd] Error 1
make[4]: *** [/root/UB2004-64_K5.4.0_ICC19.0.0/x86_64-native-linuxapp-icc/a9ff3ac1706949508d601399fcea8d52/dpdk/mk/rte.subdir.mk:37: test-pmd] Error 2
  CC test_ring_peek_stress.o
  CC test_ring_rts_stress.o
  CC test_ring_stress.o
--
  LD test
ld: /root/UB2004-64_K5.4.0_ICC19.0.0/x86_64-native-linuxapp-icc/a9ff3ac1706949508d601399fcea8d52/dpdk/x86_64-native-linuxapp-icc/lib/librte_mempool_bucket.a(rte_mempool_bucket.o): in function `bucket_get_count':
rte_mempool_bucket.c:(.text+0xdad2): undefined reference to `rte_lcore_iterate'
make[5]: *** [/root/UB2004-64_K5.4.0_ICC19.0.0/x86_64-native-linuxapp-icc/a9ff3ac1706949508d601399fcea8d52/dpdk/mk/rte.app.mk:454: test] Error 1
make[4]: *** [/root/UB2004-64_K5.4.0_ICC19.0.0/x86_64-native-linuxapp-icc/a9ff3ac1706949508d601399fcea8d52/dpdk/mk/rte.subdir.mk:37: test] Error 2
make[3]: *** [/root/UB2004-64_K5.4.0_ICC19.0.0/x86_64-native-linuxapp-icc/a9ff3ac1706949508d601399fcea8d52/dpdk/mk/rte.sdkbuild.mk:53: app] Error 2
make[2]: *** [/root/UB2004-64_K5.4.0_ICC19.0.0/x86_64-native-linuxapp-icc/a9ff3ac1706949508d601399fcea8d52/dpdk/mk/rte.sdkroot.mk:99: all] Error 2
make[1]: *** [/root/UB2004-64_K5.4.0_ICC19.0.0/x86_64-native-linuxapp-icc/a9ff3ac1706949508d601399fcea8d52/dpdk/mk/rte.sdkinstall.mk:61: pre_install] Error 2
make: *** [/root/UB2004-64_K5.4.0_ICC19.0.0/x86_64-native-linuxapp-icc/a9ff3ac1706949508d601399fcea8d52/dpdk/mk/rte.sdkroot.mk:77: install] Error 2
DPDK STV team


More information about the test-report mailing list