[dpdk-test-report] |FAILURE| pw(72293) [04/27] event/dlb: add make and meson build infrastructure

sys_stv at intel.com sys_stv at intel.com
Sat Jun 27 07:50:15 CEST 2020


Test-Label: Intel-compilation
Test-Status: FAILURE
http://dpdk.org/patch/72293

_Compilation issues_

Submitter: Tim McDaniel <timothy.mcdaniel at intel.com>
Date: 2020-06-27 04:37:28
Reply_mail: 1593232671-5690-5-git-send-email-timothy.mcdaniel at intel.com

DPDK git baseline: Repo:dpdk, CommitID: 6248368a9ae1eadf6b7fb05ab37497afdb714429


Meson build Summary: 8 Builds Done, 2 Successful, 6 Failures, 0 Blocked

Makefile build Summary: 20 Builds Done, 9 Successful, 11 Failures, 0 Blocked

                +==============================================+===========+==========+
                |                   Makefile                   |   Meson   | Document |
+----------------+------+-------+------+------------+-----------+-----------+----------+
| os             | gcc  | clang | icc  | gcc+shared | gcc+debug | gcc/clang | pdf/html |
+----------------+------+-------+------+------------+-----------+-----------+----------+
| CENTOS82-64    | pass | FAIL  | FAIL | FAIL       | pass      | FAIL      |          |
| RHEL82-64      | pass |       |      |            |           |           |          |
| UB1804-64      | pass |       |      |            |           |           |          |
| FC32-64        | pass | FAIL  |      |            |           | FAIL      |          |
| CENTOS77-64    | pass |       |      |            |           |           |          |
| UB2004-64      | pass | FAIL  | FAIL |            |           | FAIL      | pass     |
| WIN10-64       |      |       |      |            |           | pass      |          |
| UB2004-32      | pass |       |      |            |           |           |          |
| UB1804-32      |      |       |      |            |           | FAIL      |          |
| FreeBSD1201-64 | FAIL | FAIL  |      | FAIL       | FAIL      | FAIL      |          |
| SUSE15-64      | pass | FAIL  |      |            |           | FAIL      |          |
+----------------+------+-------+------+------------+-----------+-----------+----------+
Test environment and configuration as below:

** Makefile build **


OS: CENTOS82-64
	Kernel Version: 4.18.0-193.el8.x86_64
	CPU info: Intel(R) Xeon(R) Platinum 8280M CPU @ 2.70GHz
	GCC Version: gcc (GCC) 8.3.1 20191121 (Red Hat 8.3.1-5)
	Clang Version: 9.0.1 (Red Hat 9.0.1-2.module_el8.2.0+309+0c7b6b03)
	x86_64-native-linuxapp-gcc
	x86_64-native-linuxapp-clang
	x86_64-native-linuxapp-icc
	x86_64-native-linuxapp-gcc+shared
	x86_64-native-linuxapp-gcc+debug


OS: RHEL82-64
	Kernel Version: 4.18.0-193.el8.x86_64
	CPU info: Intel(R) Xeon(R) Platinum 8280M CPU @ 2.70GHz
	GCC Version: gcc (GCC) 8.3.1 20191121 (Red Hat 8.3.1-5)
	Clang Version: 8.0.1 (Red Hat 8.0.1-1.module_el8.1.0+215+a01033fb)
	x86_64-native-linuxapp-gcc


OS: UB1804-64
	Kernel Version: 4.15.0-29-generic
	CPU info: Intel(R) Xeon(R) Platinum 8180 CPU @ 2.50GHz
	GCC Version: gcc (Ubuntu 7.5.0-3ubuntu1~18.04) 7.5.0
	Clang Version: 6.0.0-1ubuntu2 (tags/RELEASE_600/final)
	x86_64-native-linuxapp-gcc


OS: FC32-64
	Kernel Version: 5.6.0-0.rc7.git0.2.fc32.x86_64
	CPU info: Intel(R) Xeon(R) Platinum 8280M CPU @ 2.70GHz
	GCC Version: gcc (GCC) 10.0.1 20200311 (Red Hat 10.0.1-0.9)
	Clang Version: 10.0.0 (Fedora 10.0.0-0.3.rc4.fc32)
	x86_64-native-linuxapp-gcc
	x86_64-native-linuxapp-clang


OS: CENTOS77-64
	Kernel Version: 3.10.0-1062.9.1.el7.x86_64
	CPU info: Intel(R) Xeon(R) Platinum 8280M CPU @ 2.70GHz
	GCC Version: gcc (GCC) 4.8.5 20150623 (Red Hat 4.8.5-39)
	Clang Version: 3.4.2 (tags/RELEASE_34/dot2-final)
	x86_64-native-linuxapp-gcc


OS: UB2004-64
	Kernel Version: 5.4.0-26-generic
	CPU info: Intel(R) Xeon(R) Platinum 8180 CPU @ 2.50GHz
	GCC Version: gcc (Ubuntu 10-20200416-0ubuntu1) 10.0.1 20200416 (experimental) [master revision 3c3f12e2a76:dcee354ce56:44b326839d864fc10c459916abcc97f35a9ac3de]
	Clang Version: 10.0.0-4ubuntu1
	x86_64-native-linuxapp-clang
	x86_64-native-linuxapp-gcc
	x86_64-native-linuxapp-icc


OS: UB2004-32
	Kernel Version: 5.4.0-26-generic
	CPU info: Intel(R) Xeon(R) Platinum 8180 CPU @ 2.50GHz
	GCC Version: gcc (Ubuntu 9.3.0-10ubuntu2) 9.3.0
	Clang Version: 10.0.0-4ubuntu1
	i686-native-linuxapp-gcc


OS: FreeBSD1201-64
	Kernel Version: 12.1-RELEASE
	CPU info: Intel(R) Xeon(R) CPU E5-2699 v3 @ 2.30GHz (2294.74-MHz K8-class CPU)
	GCC Version: gcc (FreeBSD Ports Collection) 9.2.0
	Clang Version: 8.0.1 (tags/RELEASE_801/final 366581) (based on LLVM 8.0.1)
	x86_64-native-bsdapp-gcc
	x86_64-native-bsdapp-clang
	x86_64-native-bsdapp-gcc+shared
	x86_64-native-bsdapp-gcc+debug


OS: SUSE15-64
	Kernel Version: 4.12.14-lp150.11-default
	CPU info: Intel(R) Xeon(R) CPU E5-2699 v4 @ 2.20GHz
	GCC Version: gcc (SUSE Linux) 7.3.1 20180323 [gcc-7-branch revision 258812]
	Clang Version: 5.0.1 (tags/RELEASE_501/final 312548)
	x86_64-native-linuxapp-clang
	x86_64-native-linuxapp-gcc

** Meson build **


OS: CENTOS82-64
	Kernel Version: 4.18.0-193.el8.x86_64
	CPU info: Intel(R) Xeon(R) CPU E5-2699 v4 @ 2.20GHz
	GCC Version: gcc (GCC) 8.3.1 20191121 (Red Hat 8.3.1-5)
	Clang Version: 9.0.1 (Red Hat 9.0.1-2.module_el8.2.0+309+0c7b6b03)
	./build-gcc-static
	./build-gcc-shared
	./build-clang-static
	./build-clang-shared
	./build-x86-default


OS: UB2004-64
	Kernel Version: 5.4.0-26-generic
	CPU info: Intel(R) Xeon(R) Platinum 8180 CPU @ 2.50GHz
	GCC Version: gcc (Ubuntu 9.3.0-10ubuntu2) 9.3.0
	Clang Version: 10.0.0-4ubuntu1
	x86_64-native-linuxapp-doc
	./build-gcc-static
	./build-gcc-shared
	./build-clang-static
	./build-clang-shared
	./build-x86-default


OS: FC32-64
	Kernel Version: 5.6.0-0.rc7.git0.2.fc32.x86_64
	CPU info: Intel(R) Xeon(R) CPU E5-2699 v4 @ 2.20GHz
	GCC Version: gcc (GCC) 10.0.1 20200311 (Red Hat 10.0.1-0.9)
	Clang Version: 10.0.0 (Fedora 10.0.0-0.3.rc4.fc32)
	./build-gcc-static
	./build-gcc-shared
	./build-clang-static
	./build-clang-shared
	./build-x86-default


OS: WIN10-64
	Kernel Version: N/A
	CPU info: N/A
	GCC Version: N/A
	Clang Version: Clang 8.0.0
	x86_64-windows-clang


OS: UB1804-32
	Kernel Version: 4.15.0-20-generic
	CPU info: Intel(R) Xeon(R) CPU E5-2699 v4 @ 2.20GHz
	GCC Version: gcc (Ubuntu 7.5.0-3ubuntu1~18.04) 7.5.0
	Clang Version: 6.0.0-1ubuntu2 (tags/RELEASE_600/final)
	./build-gcc-static
	./build-gcc-shared
	./build-clang-static
	./build-clang-shared
	./build-x86-default


OS: FreeBSD1201-64
	Kernel Version: 12.1-RELEASE
	CPU info: Intel(R) Xeon(R) CPU E5-2699 v4 @ 2.20GHz (2194.97-MHz K8-class CPU)
	GCC Version: gcc (FreeBSD Ports Collection) 9.2.0
	Clang Version: 8.0.1 (tags/RELEASE_801/final 366581) (based on LLVM 8.0.1)
	./build-gcc-static
	./build-gcc-shared
	./build-clang-static
	./build-clang-shared
	./build-x86-default


OS: SUSE15-64
	Kernel Version: 4.12.14-lp150.12.82-default
	CPU info: Intel(R) Xeon(R) CPU E5-2699 v4 @ 2.20GHz
	GCC Version: gcc (SUSE Linux) 7.4.1 20190905 [gcc-7-branch revision 275407]
	Clang Version: 5.0.1 (tags/RELEASE_501/final 312548)
	./build-gcc-static
	./build-gcc-shared
	./build-clang-static
	./build-clang-shared
	./build-x86-default



*Meson Build Failed #1:
OS: CENTOS82-64
Target:./build-gcc-static
FAILED: lib/librte_eventdev.so.20.0.3 
gcc  -o lib/librte_eventdev.so.20.0.3 'lib/76b5a35@@rte_eventdev at sha/librte_eventdev_rte_eventdev.c.o' 'lib/76b5a35@@rte_eventdev at sha/librte_eventdev_rte_event_ring.c.o' 'lib/76b5a35@@rte_eventdev at sha/librte_eventdev_eventdev_trace_points.c.o' 'lib/76b5a35@@rte_eventdev at sha/librte_eventdev_rte_event_eth_rx_adapter.c.o' 'lib/76b5a35@@rte_eventdev at sha/librte_eventdev_rte_event_timer_adapter.c.o' 'lib/76b5a35@@rte_eventdev at sha/librte_eventdev_rte_event_crypto_adapter.c.o' 'lib/76b5a35@@rte_eventdev at sha/librte_eventdev_rte_event_eth_tx_adapter.c.o' -Wl,--as-needed -Wl,--no-undefined -shared -fPIC -Wl,--start-group -Wl,-soname,librte_eventdev.so.20.0 -Wl,--no-as-needed -pthread -lm -ldl -lnuma lib/librte_eal.so.20.0.3 lib/librte_kvargs.so.20.0.3 lib/librte_telemetry.so.0.200.3 lib/librte_ring.so.20.0.3 lib/librte_ethdev.so.20.0.3 lib/librte_net.so.20.0.3 lib/librte_mbuf.so.20.0.3 lib/librte_mempool.so.20.0.3 lib/librte_meter.so.20.0.3 lib/librte_hash.so.20.0.3 lib/librte_timer.so.20.0.3 lib/librte_cryptodev.so.20.0.3 -Wl,--end-group -Wl,--version-script=/root/CENTOS82-64_K4.18.0_GCC8.3.1/x86_64-native-linuxapp-gcc/e59a0ebc4a6444bca03fa8b024b6c174/dpdk/lib/librte_eventdev/rte_eventdev_version.map '-Wl,-rpath,$ORIGIN/' -Wl,-rpath-link,/root/CENTOS82-64_K4.18.0_GCC8.3.1/x86_64-native-linuxapp-gcc/e59a0ebc4a6444bca03fa8b024b6c174/dpdk/build-gcc-static/lib
/usr/bin/ld: lib/librte_eventdev.so.20.0.3: version node not found for symbol rte_event_port_default_conf_get at DPDK_20
/usr/bin/ld: failed to set dynamic section sizes: Bad value
collect2: error: ld returned 1 exit status
[312/2222] Linking target lib/librte_gro.so.20.0.3.
[313/2222] Linking target lib/librte_gso.so.20.0.3.
[314/2222] Linking static target lib/librte_lpm.a.
[315/2222] Linking target lib/librte_ip_frag.so.20.0.3.
[316/2222] Linking target lib/librte_latencystats.so.20.0.3.
[317/2222] Compiling C object 'lib/76b5a35@@rte_power at sta/librte_power_power_acpi_cpufreq.c.o'.
[318/2222] Generating kni.sym_chk with a meson_exe.py custom command.
[319/2222] Compiling C object 'lib/76b5a35@@rte_power at sta/librte_power_power_pstate_cpufreq.c.o'.
[320/2222] Compiling C object 'lib/76b5a35@@rte_member at sta/librte_member_rte_member_ht.c.o'.
[321/2222] Compiling C object 'lib/76b5a35@@rte_rawdev at sta/librte_rawdev_rte_rawdev.c.o'.
[322/2222] Compiling C object 'lib/76b5a35@@rte_pdump at sta/librte_pdump_rte_pdump.c.o'.
ninja: build stopped: subcommand failed




*Meson Build Failed #2:
OS: FC32-64
Target:./build-gcc-static
FAILED: lib/librte_eventdev.so.20.0.3 
gcc  -o lib/librte_eventdev.so.20.0.3 'lib/76b5a35@@rte_eventdev at sha/librte_eventdev_rte_eventdev.c.o' 'lib/76b5a35@@rte_eventdev at sha/librte_eventdev_rte_event_ring.c.o' 'lib/76b5a35@@rte_eventdev at sha/librte_eventdev_eventdev_trace_points.c.o' 'lib/76b5a35@@rte_eventdev at sha/librte_eventdev_rte_event_eth_rx_adapter.c.o' 'lib/76b5a35@@rte_eventdev at sha/librte_eventdev_rte_event_timer_adapter.c.o' 'lib/76b5a35@@rte_eventdev at sha/librte_eventdev_rte_event_crypto_adapter.c.o' 'lib/76b5a35@@rte_eventdev at sha/librte_eventdev_rte_event_eth_tx_adapter.c.o' -Wl,--as-needed -Wl,--no-undefined -shared -fPIC -Wl,--start-group -Wl,-soname,librte_eventdev.so.20.0 -Wl,--no-as-needed -pthread -lm -ldl -lnuma lib/librte_eal.so.20.0.3 lib/librte_kvargs.so.20.0.3 lib/librte_telemetry.so.0.200.3 lib/librte_ring.so.20.0.3 lib/librte_ethdev.so.20.0.3 lib/librte_net.so.20.0.3 lib/librte_mbuf.so.20.0.3 lib/librte_mempool.so.20.0.3 lib/librte_meter.so.20.0.3 lib/librte_hash.so.20.0.3 lib/librte_timer.so.20.0.3 lib/librte_cryptodev.so.20.0.3 -Wl,--end-group -Wl,--version-script=/root/FC32-64_K5.6.0_GCC10.0.1/x86_64-native-linuxapp-gcc/e59a0ebc4a6444bca03fa8b024b6c174/dpdk/lib/librte_eventdev/rte_eventdev_version.map '-Wl,-rpath,$ORIGIN/' -Wl,-rpath-link,/root/FC32-64_K5.6.0_GCC10.0.1/x86_64-native-linuxapp-gcc/e59a0ebc4a6444bca03fa8b024b6c174/dpdk/build-gcc-static/lib
/usr/bin/ld: lib/librte_eventdev.so.20.0.3: version node not found for symbol rte_event_port_default_conf_get at DPDK_20
/usr/bin/ld: failed to set dynamic section sizes: bad value
collect2: error: ld returned 1 exit status
[285/2223] Generating latencystats_def with a custom command.
[286/2223] Compiling C object 'lib/76b5a35@@rte_ip_frag at sta/librte_ip_frag_rte_ipv6_reassembly.c.o'.
[287/2223] Generating gso.sym_chk with a meson_exe.py custom command.
[288/2223] Compiling C object 'lib/76b5a35@@rte_ip_frag at sta/librte_ip_frag_rte_ipv4_fragmentation.c.o'.
[289/2223] Compiling C object 'lib/76b5a35@@rte_ip_frag at sta/librte_ip_frag_rte_ip_frag_common.c.o'.
[290/2223] Compiling C object 'lib/76b5a35@@rte_ip_frag at sta/librte_ip_frag_ip_frag_internal.c.o'.
[291/2223] Compiling C object 'lib/76b5a35@@rte_jobstats at sta/librte_jobstats_rte_jobstats.c.o'.
[292/2223] Compiling C object 'lib/76b5a35@@rte_latencystats at sta/librte_latencystats_rte_latencystats.c.o'.
[293/2223] Compiling C object 'lib/76b5a35@@rte_kni at sta/librte_kni_rte_kni.c.o'.
ninja: build stopped: subcommand failed




*Meson Build Failed #3:
OS: FreeBSD1201-64
Target:./build-gcc-static
FAILED: lib/librte_eventdev.so.20.0.3 
gcc  -o lib/librte_eventdev.so.20.0.3 'lib/76b5a35@@rte_eventdev at sha/librte_eventdev_rte_eventdev.c.o' 'lib/76b5a35@@rte_eventdev at sha/librte_eventdev_rte_event_ring.c.o' 'lib/76b5a35@@rte_eventdev at sha/librte_eventdev_eventdev_trace_points.c.o' 'lib/76b5a35@@rte_eventdev at sha/librte_eventdev_rte_event_eth_rx_adapter.c.o' 'lib/76b5a35@@rte_eventdev at sha/librte_eventdev_rte_event_timer_adapter.c.o' 'lib/76b5a35@@rte_eventdev at sha/librte_eventdev_rte_event_crypto_adapter.c.o' 'lib/76b5a35@@rte_eventdev at sha/librte_eventdev_rte_event_eth_tx_adapter.c.o' -Wl,--as-needed -Wl,--no-undefined -shared -fPIC -Wl,--start-group -Wl,-soname,librte_eventdev.so.20.0 -Wl,--no-as-needed -pthread -lm -lexecinfo lib/librte_eal.so.20.0.3 lib/librte_kvargs.so.20.0.3 lib/librte_telemetry.so.0.200.3 lib/librte_ring.so.20.0.3 lib/librte_ethdev.so.20.0.3 lib/librte_net.so.20.0.3 lib/librte_mbuf.so.20.0.3 lib/librte_mempool.so.20.0.3 lib/librte_meter.so.20.0.3 lib/librte_hash.so.20.0.3 lib/librte_timer.so.20.0.3 lib/librte_cryptodev.so.20.0.3 -Wl,--end-group -Wl,--version-script=/root/FreeBSD1201-64_K12.1_GCC9.2.0/x86_64-native-bsdapp-gcc/e59a0ebc4a6444bca03fa8b024b6c174/dpdk/lib/librte_eventdev/rte_eventdev_version.map '-Wl,-rpath,$ORIGIN/' -Wl,-rpath-link,/root/FreeBSD1201-64_K12.1_GCC9.2.0/x86_64-native-bsdapp-gcc/e59a0ebc4a6444bca03fa8b024b6c174/dpdk/build-gcc-static/lib
/usr/local/bin/ld: lib/librte_eventdev.so.20.0.3: version node not found for symbol rte_event_port_default_conf_get at DPDK_20
/usr/local/bin/ld: failed to set dynamic section sizes: bad value
collect2: error: ld returned 1 exit status
[270/1640] Compiling C object 'lib/76b5a35@@rte_gso at sta/librte_gso_rte_gso.c.o'
[271/1640] Generating gro.sym_chk with a meson_exe.py custom command
[272/1640] Compiling C object 'lib/76b5a35@@rte_ip_frag at sta/librte_ip_frag_rte_ipv6_reassembly.c.o'
[273/1640] Compiling C object 'lib/76b5a35@@rte_ip_frag at sta/librte_ip_frag_rte_ipv6_fragmentation.c.o'
[274/1640] Compiling C object 'lib/76b5a35@@rte_ip_frag at sta/librte_ip_frag_ip_frag_internal.c.o'
[275/1640] Compiling C object 'lib/76b5a35@@rte_jobstats at sta/librte_jobstats_rte_jobstats.c.o'
[276/1640] Compiling C object 'lib/76b5a35@@rte_ip_frag at sta/librte_ip_frag_rte_ipv4_fragmentation.c.o'
[277/1640] Compiling C object 'lib/76b5a35@@rte_ip_frag at sta/librte_ip_frag_rte_ip_frag_common.c.o'
[278/1640] Compiling C object 'lib/76b5a35@@rte_latencystats at sta/librte_latencystats_rte_latencystats.c.o'
ninja: build stopped: subcommand failed




*Meson Build Failed #4:
OS: SUSE15-64
Target:./build-gcc-static
FAILED: lib/librte_eventdev.so.20.0.3 
gcc  -o lib/librte_eventdev.so.20.0.3 'lib/76b5a35@@rte_eventdev at sha/librte_eventdev_rte_eventdev.c.o' 'lib/76b5a35@@rte_eventdev at sha/librte_eventdev_rte_event_ring.c.o' 'lib/76b5a35@@rte_eventdev at sha/librte_eventdev_eventdev_trace_points.c.o' 'lib/76b5a35@@rte_eventdev at sha/librte_eventdev_rte_event_eth_rx_adapter.c.o' 'lib/76b5a35@@rte_eventdev at sha/librte_eventdev_rte_event_timer_adapter.c.o' 'lib/76b5a35@@rte_eventdev at sha/librte_eventdev_rte_event_crypto_adapter.c.o' 'lib/76b5a35@@rte_eventdev at sha/librte_eventdev_rte_event_eth_tx_adapter.c.o' -Wl,--no-undefined -Wl,--as-needed -shared -fPIC -Wl,--start-group -Wl,-soname,librte_eventdev.so.20.0 -Wl,--no-as-needed -pthread -lm -ldl -lnuma lib/librte_eal.so.20.0.3 lib/librte_kvargs.so.20.0.3 lib/librte_telemetry.so.0.200.3 lib/librte_ring.so.20.0.3 lib/librte_ethdev.so.20.0.3 lib/librte_net.so.20.0.3 lib/librte_mbuf.so.20.0.3 lib/librte_mempool.so.20.0.3 lib/librte_meter.so.20.0.3 lib/librte_hash.so.20.0.3 lib/librte_timer.so.20.0.3 lib/librte_cryptodev.so.20.0.3 -Wl,--end-group -Wl,--version-script=/root/SUSE15-64_K4.12.14_GCC7.3.1/x86_64-native-linuxapp-gcc/e59a0ebc4a6444bca03fa8b024b6c174/dpdk/lib/librte_eventdev/rte_eventdev_version.map '-Wl,-rpath,$ORIGIN/' -Wl,-rpath-link,/root/SUSE15-64_K4.12.14_GCC7.3.1/x86_64-native-linuxapp-gcc/e59a0ebc4a6444bca03fa8b024b6c174/dpdk/build-gcc-static/lib 
/usr/lib64/gcc/x86_64-suse-linux/7/../../../../x86_64-suse-linux/bin/ld: lib/librte_eventdev.so.20.0.3: version node not found for symbol rte_event_dev_info_get at DPDK_20
/usr/lib64/gcc/x86_64-suse-linux/7/../../../../x86_64-suse-linux/bin/ld: failed to set dynamic section sizes: bad value
collect2: error: ld returned 1 exit status
[280/2126] Compiling C object 'lib/76b5a35@@rte_ip_frag at sta/librte_ip_frag_rte_ipv6_fragmentation.c.o'.
[281/2126] Compiling C object 'lib/76b5a35@@rte_ip_frag at sta/librte_ip_frag_rte_ipv6_reassembly.c.o'.
[282/2126] Linking target lib/librte_gro.so.20.0.3.
[283/2126] Compiling C object 'lib/76b5a35@@rte_ip_frag at sta/librte_ip_frag_ip_frag_internal.c.o'.
[284/2126] Compiling C object 'lib/76b5a35@@rte_jobstats at sta/librte_jobstats_rte_jobstats.c.o'.
[285/2126] Compiling C object 'lib/76b5a35@@rte_ip_frag at sta/librte_ip_frag_rte_ipv4_fragmentation.c.o'.
[286/2126] Compiling C object 'lib/76b5a35@@rte_ip_frag at sta/librte_ip_frag_rte_ip_frag_common.c.o'.
[287/2126] Generating gso.sym_chk with a meson_exe.py custom command.
[288/2126] Compiling C object 'lib/76b5a35@@rte_kni at sta/librte_kni_rte_kni.c.o'.
ninja: build stopped: subcommand failed




*Meson Build Failed #5:
OS: UB1804-32
Target:./build-gcc-static
FAILED: lib/librte_eventdev.so.20.0.3 
gcc  -o lib/librte_eventdev.so.20.0.3 'lib/76b5a35@@rte_eventdev at sha/librte_eventdev_rte_eventdev.c.o' 'lib/76b5a35@@rte_eventdev at sha/librte_eventdev_rte_event_ring.c.o' 'lib/76b5a35@@rte_eventdev at sha/librte_eventdev_eventdev_trace_points.c.o' 'lib/76b5a35@@rte_eventdev at sha/librte_eventdev_rte_event_eth_rx_adapter.c.o' 'lib/76b5a35@@rte_eventdev at sha/librte_eventdev_rte_event_timer_adapter.c.o' 'lib/76b5a35@@rte_eventdev at sha/librte_eventdev_rte_event_crypto_adapter.c.o' 'lib/76b5a35@@rte_eventdev at sha/librte_eventdev_rte_event_eth_tx_adapter.c.o' -Wl,--no-undefined -Wl,--as-needed -shared -fPIC -Wl,--start-group -Wl,-soname,librte_eventdev.so.20.0 -Wl,--no-as-needed -pthread -lm -ldl -lnuma -m32 lib/librte_eal.so.20.0.3 lib/librte_kvargs.so.20.0.3 lib/librte_telemetry.so.0.200.3 lib/librte_ring.so.20.0.3 lib/librte_ethdev.so.20.0.3 lib/librte_net.so.20.0.3 lib/librte_mbuf.so.20.0.3 lib/librte_mempool.so.20.0.3 lib/librte_meter.so.20.0.3 lib/librte_hash.so.20.0.3 lib/librte_timer.so.20.0.3 lib/librte_cryptodev.so.20.0.3 -Wl,--end-group -Wl,--version-script=/root/UB1804-32_K4.15.0_GCC7.3.0/i686-native-linuxapp-gcc/e59a0ebc4a6444bca03fa8b024b6c174/dpdk/lib/librte_eventdev/rte_eventdev_version.map '-Wl,-rpath,$ORIGIN/' -Wl,-rpath-link,/root/UB1804-32_K4.15.0_GCC7.3.0/i686-native-linuxapp-gcc/e59a0ebc4a6444bca03fa8b024b6c174/dpdk/build-gcc-static/lib 
/usr/local/bin/ld: lib/librte_eventdev.so.20.0.3: version node not found for symbol rte_event_port_default_conf_get at DPDK_20
/usr/local/bin/ld: failed to set dynamic section sizes: bad value
collect2: error: ld returned 1 exit status
[287/1978] Compiling C object 'lib/76b5a35@@rte_jobstats at sta/librte_jobstats_rte_jobstats.c.o'.
[288/1978] Compiling C object 'lib/76b5a35@@rte_ip_frag at sta/librte_ip_frag_ip_frag_internal.c.o'.
[289/1978] Linking target lib/librte_gso.so.20.0.3.
[290/1978] Linking target lib/librte_gro.so.20.0.3.
[291/1978] Compiling C object 'lib/76b5a35@@rte_ip_frag at sta/librte_ip_frag_rte_ip_frag_common.c.o'.
[292/1978] Compiling C object 'lib/76b5a35@@rte_member at sta/librte_member_rte_member.c.o'.
[293/1978] Compiling C object 'lib/76b5a35@@rte_latencystats at sta/librte_latencystats_rte_latencystats.c.o'.
[294/1978] Compiling C object 'lib/76b5a35@@rte_member at sta/librte_member_rte_member_vbf.c.o'.
[295/1978] Compiling C object 'lib/76b5a35@@rte_lpm at sta/librte_lpm_rte_lpm.c.o'.
[296/1978] Compiling C object 'lib/76b5a35@@rte_lpm at sta/librte_lpm_rte_lpm6.c.o'.
[297/1978] Compiling C object 'lib/76b5a35@@rte_member at sta/librte_member_rte_member_ht.c.o'.
ninja: build stopped: subcommand failed




*Meson Build Failed #6:
OS: UB2004-64
Target:./build-gcc-static
FAILED: lib/librte_eventdev.so.20.0.3 
gcc  -o lib/librte_eventdev.so.20.0.3 'lib/76b5a35@@rte_eventdev at sha/librte_eventdev_rte_eventdev.c.o' 'lib/76b5a35@@rte_eventdev at sha/librte_eventdev_rte_event_ring.c.o' 'lib/76b5a35@@rte_eventdev at sha/librte_eventdev_eventdev_trace_points.c.o' 'lib/76b5a35@@rte_eventdev at sha/librte_eventdev_rte_event_eth_rx_adapter.c.o' 'lib/76b5a35@@rte_eventdev at sha/librte_eventdev_rte_event_timer_adapter.c.o' 'lib/76b5a35@@rte_eventdev at sha/librte_eventdev_rte_event_crypto_adapter.c.o' 'lib/76b5a35@@rte_eventdev at sha/librte_eventdev_rte_event_eth_tx_adapter.c.o' -Wl,--as-needed -Wl,--no-undefined -shared -fPIC -Wl,--start-group -Wl,-soname,librte_eventdev.so.20.0 -Wl,--no-as-needed -pthread -lm -ldl -lnuma lib/librte_eal.so.20.0.3 lib/librte_kvargs.so.20.0.3 lib/librte_telemetry.so.0.200.3 lib/librte_ring.so.20.0.3 lib/librte_ethdev.so.20.0.3 lib/librte_net.so.20.0.3 lib/librte_mbuf.so.20.0.3 lib/librte_mempool.so.20.0.3 lib/librte_meter.so.20.0.3 lib/librte_hash.so.20.0.3 lib/librte_timer.so.20.0.3 lib/librte_cryptodev.so.20.0.3 -Wl,--end-group -Wl,--version-script=/root/UB2004-64_K5.4.0_GCC9.3.0/x86_64-native-linuxapp-gcc/e59a0ebc4a6444bca03fa8b024b6c174/dpdk/lib/librte_eventdev/rte_eventdev_version.map '-Wl,-rpath,$ORIGIN/' -Wl,-rpath-link,/root/UB2004-64_K5.4.0_GCC9.3.0/x86_64-native-linuxapp-gcc/e59a0ebc4a6444bca03fa8b024b6c174/dpdk/build-gcc-static/lib
/usr/bin/ld: lib/librte_eventdev.so.20.0.3: version node not found for symbol rte_event_port_default_conf_get at DPDK_20
/usr/bin/ld: failed to set dynamic section sizes: bad value
collect2: error: ld returned 1 exit status
[295/2214] Compiling C object 'lib/76b5a35@@rte_ip_frag at sta/librte_ip_frag_rte_ip_frag_common.c.o'.
[296/2214] Linking target lib/librte_gso.so.20.0.3.
[297/2214] Compiling C object 'lib/76b5a35@@rte_power at sta/librte_power_rte_power.c.o'.
[298/2214] Compiling C object 'lib/76b5a35@@rte_latencystats at sta/librte_latencystats_rte_latencystats.c.o'.
[299/2214] Generating jobstats.sym_chk with a meson_exe.py custom command.
[300/2214] Compiling C object 'lib/76b5a35@@rte_lpm at sta/librte_lpm_rte_lpm6.c.o'.
[301/2214] Compiling C object 'lib/76b5a35@@rte_lpm at sta/librte_lpm_rte_lpm.c.o'.
[302/2214] Compiling C object 'lib/76b5a35@@rte_kni at sta/librte_kni_rte_kni.c.o'.
[303/2214] Compiling C object 'lib/76b5a35@@rte_member at sta/librte_member_rte_member_vbf.c.o'.
[304/2214] Compiling C object 'lib/76b5a35@@rte_power at sta/librte_power_power_acpi_cpufreq.c.o'.
[305/2214] Compiling C object 'lib/76b5a35@@rte_member at sta/librte_member_rte_member_ht.c.o'.
ninja: build stopped: subcommand failed



*Makefile Build Failed #1:
OS: CENTOS82-64
Target: x86_64-native-linuxapp-clang
#define __rte_aligned(a) __attribute__((__aligned__(a)))
                                        ^
In file included from /root/CENTOS82-64_K4.18.0_Clang7.0.1/x86_64-native-linuxapp-clang/e59a0ebc4a6444bca03fa8b024b6c174/dpdk/drivers/event/dlb/dlb.c:36:
/root/CENTOS82-64_K4.18.0_Clang7.0.1/x86_64-native-linuxapp-clang/e59a0ebc4a6444bca03fa8b024b6c174/dpdk/drivers/event/dlb/dlb_inline_fns.h:46:2: error: use of unknown builtin '__builtin_ia32_movntdq' [-Wimplicit-function-declaration]
        __builtin_ia32_movntdq((__v2di *)pp_addr + 0, (__v2di)src_data0);
        ^
/root/CENTOS82-64_K4.18.0_Clang7.0.1/x86_64-native-linuxapp-clang/e59a0ebc4a6444bca03fa8b024b6c174/dpdk/drivers/event/dlb/dlb_inline_fns.h:46:2: note: did you mean '__builtin_ia32_movntq'?
--
  __builtin_ia32_movntq(__p, __a);
  ^
In file included from /root/CENTOS82-64_K4.18.0_Clang7.0.1/x86_64-native-linuxapp-clang/e59a0ebc4a6444bca03fa8b024b6c174/dpdk/drivers/event/dlb/dlb.c:36:
/root/CENTOS82-64_K4.18.0_Clang7.0.1/x86_64-native-linuxapp-clang/e59a0ebc4a6444bca03fa8b024b6c174/dpdk/drivers/event/dlb/dlb_inline_fns.h:62:2: error: use of unknown builtin '__builtin_ia32_movntdq' [-Wimplicit-function-declaration]
        __builtin_ia32_movntdq((__v2di *)pp_addr, (__v2di)src_data0);
        ^
1 warning and 2 errors generated.
make[6]: *** [/root/CENTOS82-64_K4.18.0_Clang7.0.1/x86_64-native-linuxapp-clang/e59a0ebc4a6444bca03fa8b024b6c174/dpdk/mk/internal/rte.compile-pre.mk:116: dlb.o] Error 1
make[5]: *** [/root/CENTOS82-64_K4.18.0_Clang7.0.1/x86_64-native-linuxapp-clang/e59a0ebc4a6444bca03fa8b024b6c174/dpdk/mk/rte.subdir.mk:37: dlb] Error 2
make[5]: *** Waiting for unfinished jobs....
  CC otx2_worker.o
  AR librte_pmd_opdl_event.a
--
  CC otx2_evdev_irq.o
  AR librte_pmd_octeontx2_event.a
  INSTALL-LIB librte_pmd_octeontx2_event.a
make[4]: *** [/root/CENTOS82-64_K4.18.0_Clang7.0.1/x86_64-native-linuxapp-clang/e59a0ebc4a6444bca03fa8b024b6c174/dpdk/mk/rte.subdir.mk:37: event] Error 2
make[3]: *** [/root/CENTOS82-64_K4.18.0_Clang7.0.1/x86_64-native-linuxapp-clang/e59a0ebc4a6444bca03fa8b024b6c174/dpdk/mk/rte.sdkbuild.mk:51: drivers] Error 2
make[2]: *** [/root/CENTOS82-64_K4.18.0_Clang7.0.1/x86_64-native-linuxapp-clang/e59a0ebc4a6444bca03fa8b024b6c174/dpdk/mk/rte.sdkroot.mk:99: all] Error 2
make[1]: *** [/root/CENTOS82-64_K4.18.0_Clang7.0.1/x86_64-native-linuxapp-clang/e59a0ebc4a6444bca03fa8b024b6c174/dpdk/mk/rte.sdkinstall.mk:61: pre_install] Error 2
make: *** [/root/CENTOS82-64_K4.18.0_Clang7.0.1/x86_64-native-linuxapp-clang/e59a0ebc4a6444bca03fa8b024b6c174/dpdk/mk/rte.sdkroot.mk:77: install] Error 2


*Makefile Build Failed #2:
OS: CENTOS82-64
Target: x86_64-native-linuxapp-icc
dlb.c:(.text+0x2568): undefined reference to `__builtin_ia32_movntdq'
/root/CENTOS82-64_K4.18.0_ICC19.1.1/x86_64-native-linuxapp-icc/e59a0ebc4a6444bca03fa8b024b6c174/dpdk/x86_64-native-linuxapp-icc/lib/librte_pmd_dlb_eventdev.a(dlb.o):dlb.c:(.text+0x3190): more undefined references to `__builtin_ia32_movntdq' follow
  CC test_atomic.o
make[5]: *** [/root/CENTOS82-64_K4.18.0_ICC19.1.1/x86_64-native-linuxapp-icc/e59a0ebc4a6444bca03fa8b024b6c174/dpdk/mk/rte.app.mk:455: dpdk-procinfo] Error 1
make[4]: *** [/root/CENTOS82-64_K4.18.0_ICC19.1.1/x86_64-native-linuxapp-icc/e59a0ebc4a6444bca03fa8b024b6c174/dpdk/mk/rte.subdir.mk:37: proc-info] Error 2
make[4]: *** Waiting for unfinished jobs....
  CC test_barrier.o
  CC test_malloc.o
--
/root/CENTOS82-64_K4.18.0_ICC19.1.1/x86_64-native-linuxapp-icc/e59a0ebc4a6444bca03fa8b024b6c174/dpdk/x86_64-native-linuxapp-icc/lib/librte_pmd_dlb_eventdev.a(dlb.o): In function `dlb_event_enqueue_burst_delayed':
dlb.c:(.text+0x2568): undefined reference to `__builtin_ia32_movntdq'
/root/CENTOS82-64_K4.18.0_ICC19.1.1/x86_64-native-linuxapp-icc/e59a0ebc4a6444bca03fa8b024b6c174/dpdk/x86_64-native-linuxapp-icc/lib/librte_pmd_dlb_eventdev.a(dlb.o):dlb.c:(.text+0x3190): more undefined references to `__builtin_ia32_movntdq' follow
make[5]: *** [/root/CENTOS82-64_K4.18.0_ICC19.1.1/x86_64-native-linuxapp-icc/e59a0ebc4a6444bca03fa8b024b6c174/dpdk/mk/rte.app.mk:455: testpmd] Error 1
make[4]: *** [/root/CENTOS82-64_K4.18.0_ICC19.1.1/x86_64-native-linuxapp-icc/e59a0ebc4a6444bca03fa8b024b6c174/dpdk/mk/rte.subdir.mk:37: test-pmd] Error 2
  CC test_ring_peek_stress.o
  CC test_ring_rts_stress.o
  CC test_ring_stress.o
--
/root/CENTOS82-64_K4.18.0_ICC19.1.1/x86_64-native-linuxapp-icc/e59a0ebc4a6444bca03fa8b024b6c174/dpdk/x86_64-native-linuxapp-icc/lib/librte_pmd_dlb_eventdev.a(dlb.o): In function `dlb_event_enqueue_burst_delayed':
dlb.c:(.text+0x2568): undefined reference to `__builtin_ia32_movntdq'
/root/CENTOS82-64_K4.18.0_ICC19.1.1/x86_64-native-linuxapp-icc/e59a0ebc4a6444bca03fa8b024b6c174/dpdk/x86_64-native-linuxapp-icc/lib/librte_pmd_dlb_eventdev.a(dlb.o):dlb.c:(.text+0x3190): more undefined references to `__builtin_ia32_movntdq' follow
make[5]: *** [/root/CENTOS82-64_K4.18.0_ICC19.1.1/x86_64-native-linuxapp-icc/e59a0ebc4a6444bca03fa8b024b6c174/dpdk/mk/rte.app.mk:455: test] Error 1
make[4]: *** [/root/CENTOS82-64_K4.18.0_ICC19.1.1/x86_64-native-linuxapp-icc/e59a0ebc4a6444bca03fa8b024b6c174/dpdk/mk/rte.subdir.mk:37: test] Error 2
make[3]: *** [/root/CENTOS82-64_K4.18.0_ICC19.1.1/x86_64-native-linuxapp-icc/e59a0ebc4a6444bca03fa8b024b6c174/dpdk/mk/rte.sdkbuild.mk:53: app] Error 2
make[2]: *** [/root/CENTOS82-64_K4.18.0_ICC19.1.1/x86_64-native-linuxapp-icc/e59a0ebc4a6444bca03fa8b024b6c174/dpdk/mk/rte.sdkroot.mk:99: all] Error 2
make[1]: *** [/root/CENTOS82-64_K4.18.0_ICC19.1.1/x86_64-native-linuxapp-icc/e59a0ebc4a6444bca03fa8b024b6c174/dpdk/mk/rte.sdkinstall.mk:61: pre_install] Error 2
make: *** [/root/CENTOS82-64_K4.18.0_ICC19.1.1/x86_64-native-linuxapp-icc/e59a0ebc4a6444bca03fa8b024b6c174/dpdk/mk/rte.sdkroot.mk:77: install] Error 2


*Makefile Build Failed #3:
OS: CENTOS82-64
Target: x86_64-native-linuxapp-gcc+shared
  CC rte_metrics.o
  LD librte_eventdev.so.20.0.3
/usr/bin/ld: librte_eventdev.so.20.0.3: version node not found for symbol rte_event_dev_info_get at DPDK_20
/usr/bin/ld: failed to set dynamic section sizes: Bad value
collect2: error: ld returned 1 exit status
make[5]: *** [/root/CENTOS82-64_K4.18.0_GCC8.3.1/x86_64-native-linuxapp-gcc+shared/e59a0ebc4a6444bca03fa8b024b6c174/dpdk/mk/rte.lib.mk:100: librte_eventdev.so.20.0.3] Error 1
make[4]: *** [/root/CENTOS82-64_K4.18.0_GCC8.3.1/x86_64-native-linuxapp-gcc+shared/e59a0ebc4a6444bca03fa8b024b6c174/dpdk/mk/rte.subdir.mk:37: librte_eventdev] Error 2
make[4]: *** Waiting for unfinished jobs....
  CC vdpa.o
  LD librte_metrics.so.20.0.3
--
  CC vhost_crypto.o
  LD librte_vhost.so.20.0.3
  INSTALL-LIB librte_vhost.so.20.0.3
make[3]: *** [/root/CENTOS82-64_K4.18.0_GCC8.3.1/x86_64-native-linuxapp-gcc+shared/e59a0ebc4a6444bca03fa8b024b6c174/dpdk/mk/rte.sdkbuild.mk:53: lib] Error 2
make[2]: *** [/root/CENTOS82-64_K4.18.0_GCC8.3.1/x86_64-native-linuxapp-gcc+shared/e59a0ebc4a6444bca03fa8b024b6c174/dpdk/mk/rte.sdkroot.mk:99: all] Error 2
make[1]: *** [/root/CENTOS82-64_K4.18.0_GCC8.3.1/x86_64-native-linuxapp-gcc+shared/e59a0ebc4a6444bca03fa8b024b6c174/dpdk/mk/rte.sdkinstall.mk:61: pre_install] Error 2
make: *** [/root/CENTOS82-64_K4.18.0_GCC8.3.1/x86_64-native-linuxapp-gcc+shared/e59a0ebc4a6444bca03fa8b024b6c174/dpdk/mk/rte.sdkroot.mk:77: install] Error 2


*Makefile Build Failed #4:
OS: FC32-64
Target: x86_64-native-linuxapp-clang
#define __rte_aligned(a) __attribute__((__aligned__(a)))
                                        ^
In file included from /root/FC32-64_K5.6.0_Clang10.0.0/x86_64-native-linuxapp-clang/e59a0ebc4a6444bca03fa8b024b6c174/dpdk/drivers/event/dlb/dlb.c:36:
/root/FC32-64_K5.6.0_Clang10.0.0/x86_64-native-linuxapp-clang/e59a0ebc4a6444bca03fa8b024b6c174/dpdk/drivers/event/dlb/dlb_inline_fns.h:46:2: error: use of unknown builtin '__builtin_ia32_movntdq' [-Wimplicit-function-declaration]
        __builtin_ia32_movntdq((__v2di *)pp_addr + 0, (__v2di)src_data0);
        ^
/root/FC32-64_K5.6.0_Clang10.0.0/x86_64-native-linuxapp-clang/e59a0ebc4a6444bca03fa8b024b6c174/dpdk/drivers/event/dlb/dlb_inline_fns.h:46:2: note: did you mean '__builtin_ia32_movntq'?
--
  __builtin_ia32_movntq(__p, __a);
  ^
In file included from /root/FC32-64_K5.6.0_Clang10.0.0/x86_64-native-linuxapp-clang/e59a0ebc4a6444bca03fa8b024b6c174/dpdk/drivers/event/dlb/dlb.c:36:
/root/FC32-64_K5.6.0_Clang10.0.0/x86_64-native-linuxapp-clang/e59a0ebc4a6444bca03fa8b024b6c174/dpdk/drivers/event/dlb/dlb_inline_fns.h:62:2: error: use of unknown builtin '__builtin_ia32_movntdq' [-Wimplicit-function-declaration]
        __builtin_ia32_movntdq((__v2di *)pp_addr, (__v2di)src_data0);
        ^
  CC opdl_evdev_xstats.o
1 warning and 2 errors generated.
make[6]: *** [/root/FC32-64_K5.6.0_Clang10.0.0/x86_64-native-linuxapp-clang/e59a0ebc4a6444bca03fa8b024b6c174/dpdk/mk/internal/rte.compile-pre.mk:116: dlb.o] Error 1
make[5]: *** [/root/FC32-64_K5.6.0_Clang10.0.0/x86_64-native-linuxapp-clang/e59a0ebc4a6444bca03fa8b024b6c174/dpdk/mk/rte.subdir.mk:37: dlb] Error 2
make[5]: *** Waiting for unfinished jobs....
  CC otx2_worker.o
  CC opdl_test.o
--
  CC otx2_evdev_irq.o
  AR librte_pmd_octeontx2_event.a
  INSTALL-LIB librte_pmd_octeontx2_event.a
make[4]: *** [/root/FC32-64_K5.6.0_Clang10.0.0/x86_64-native-linuxapp-clang/e59a0ebc4a6444bca03fa8b024b6c174/dpdk/mk/rte.subdir.mk:37: event] Error 2
make[3]: *** [/root/FC32-64_K5.6.0_Clang10.0.0/x86_64-native-linuxapp-clang/e59a0ebc4a6444bca03fa8b024b6c174/dpdk/mk/rte.sdkbuild.mk:51: drivers] Error 2
make[2]: *** [/root/FC32-64_K5.6.0_Clang10.0.0/x86_64-native-linuxapp-clang/e59a0ebc4a6444bca03fa8b024b6c174/dpdk/mk/rte.sdkroot.mk:99: all] Error 2
make[1]: *** [/root/FC32-64_K5.6.0_Clang10.0.0/x86_64-native-linuxapp-clang/e59a0ebc4a6444bca03fa8b024b6c174/dpdk/mk/rte.sdkinstall.mk:61: pre_install] Error 2
make: *** [/root/FC32-64_K5.6.0_Clang10.0.0/x86_64-native-linuxapp-clang/e59a0ebc4a6444bca03fa8b024b6c174/dpdk/mk/rte.sdkroot.mk:77: install] Error 2


*Makefile Build Failed #5:
OS: FreeBSD1201-64
Target: x86_64-native-bsdapp-gcc
== Build drivers/common
awk -f /usr/src/sys/tools/makeobjops.awk /usr/src/sys/dev/pci/pci_if.m -h
Warning: Object directory not changed from original /root/FreeBSD1201-64_K12.1_GCC9.2.0/x86_64-native-bsdapp-gcc/e59a0ebc4a6444bca03fa8b024b6c174/dpdk/x86_64-native-bsdapp-gcc/build/kernel/freebsd/contigmem
cc  -Winline -Wall -Werror -include /root/FreeBSD1201-64_K12.1_GCC9.2.0/x86_64-native-bsdapp-gcc/e59a0ebc4a6444bca03fa8b024b6c174/dpdk/x86_64-native-bsdapp-gcc/include/rte_config.h  -Werror -D_KERNEL -DKLD_MODULE -nostdinc  -I/root/FreeBSD1201-64_K12.1_GCC9.2.0/x86_64-native-bsdapp-gcc/e59a0ebc4a6444bca03fa8b024b6c174/dpdk/kernel/freebsd/contigmem -I/root/FreeBSD1201-64_K12.1_GCC9.2.0/x86_64-native-bsdapp-gcc/e59a0ebc4a6444bca03fa8b024b6c174/dpdk/x86_64-native-bsdapp-gcc/include -I. -I/usr/src/sys -I/usr/src/sys/contrib/ck/include -fno-common  -fno-omit-frame-pointer -mno-omit-leaf-frame-pointer -fdebug-prefix-map=./machine=/usr/src/sys/amd64/include -fdebug-prefix-map=./x86=/usr/src/sys/x86/include   -MD  -MF.depend.contigmem.o -MTcontigmem.o -mcmodel=kernel -mno-red-zone -mno-mmx -mno-sse -msoft-float  -fno-asynchronous-unwind-tables -ffreestanding -fwrapv -fstack-protector -Wall -Wredundant-decls -Wnested-externs -Wstrict-prototypes -Wmissing-prototypes -Wpointer-arith -Wcast-qual -Wundef -Wno-pointer-sign -D__printf__=__freebsd_kprintf__ -Wmissing-include-dirs -fdiagnostics-show-option -Wno-unknown-pragmas -Wno-error-tautological-compare -Wno-error-empty-body -Wno-error-parentheses-equality -Wno-error-unused-function -Wno-error-pointer-sign -Wno-error-shift-negative-value -Wno-address-of-packed-member  -mno-aes -mno-avx  -std=iso9899:1999 -c contigmem.c -o contigmem.o
Warning: Object directory not changed from original /root/FreeBSD1201-64_K12.1_GCC9.2.0/x86_64-native-bsdapp-gcc/e59a0ebc4a6444bca03fa8b024b6c174/dpdk/x86_64-native-bsdapp-gcc/build/kernel/freebsd/nic_uio
cc  -Winline -Wall -Werror -include /root/FreeBSD1201-64_K12.1_GCC9.2.0/x86_64-native-bsdapp-gcc/e59a0ebc4a6444bca03fa8b024b6c174/dpdk/x86_64-native-bsdapp-gcc/include/rte_config.h  -Werror -D_KERNEL -DKLD_MODULE -nostdinc  -I/root/FreeBSD1201-64_K12.1_GCC9.2.0/x86_64-native-bsdapp-gcc/e59a0ebc4a6444bca03fa8b024b6c174/dpdk/kernel/freebsd/nic_uio -I/root/FreeBSD1201-64_K12.1_GCC9.2.0/x86_64-native-bsdapp-gcc/e59a0ebc4a6444bca03fa8b024b6c174/dpdk/x86_64-native-bsdapp-gcc/include -I. -I/usr/src/sys -I/usr/src/sys/contrib/ck/include -fno-common  -fno-omit-frame-pointer -mno-omit-leaf-frame-pointer -fdebug-prefix-map=./machine=/usr/src/sys/amd64/include -fdebug-prefix-map=./x86=/usr/src/sys/x86/include   -MD  -MF.depend.nic_uio.o -MTnic_uio.o -mcmodel=kernel -mno-red-zone -mno-mmx -mno-sse -msoft-float  -fno-asynchronous-unwind-tables -ffreestanding -fwrapv -fstack-protector -Wall -Wredundant-decls -Wnested-externs -Wstrict-prototypes -Wmissing-prototypes -Wpointer-arith -Wcast-qual -Wundef -Wno-pointer-sign -D__printf__=__freebsd_kprintf__ -Wmissing-include-dirs -fdiagnostics-show-option -Wno-unknown-pragmas -Wno-error-tautological-compare -Wno-error-empty-body -Wno-error-parentheses-equality -Wno-error-unused-function -Wno-error-pointer-sign -Wno-error-shift-negative-value -Wno-address-of-packed-member  -mno-aes -mno-avx  -std=iso9899:1999 -c nic_uio.c -o nic_uio.o
ld -m elf_x86_64_fbsd -L/root/FreeBSD1201-64_K12.1_GCC9.2.0/x86_64-native-bsdapp-gcc/e59a0ebc4a6444bca03fa8b024b6c174/dpdk/x86_64-native-bsdapp-gcc/lib -d -warn-common --build-id=sha1 -r -d -o contigmem.ko contigmem.o
:> export_syms
awk -f /usr/src/sys/conf/kmod_syms.awk contigmem.ko  export_syms | xargs -J% objcopy % contigmem.ko
--
  LD dpdk-pdump
  CC test.o
/usr/local/bin/ld: cannot find -lrte_pmd_dlb_eventdev
collect2: error: ld returned 1 exit status
gmake[5]: *** [/root/FreeBSD1201-64_K12.1_GCC9.2.0/x86_64-native-bsdapp-gcc/e59a0ebc4a6444bca03fa8b024b6c174/dpdk/mk/rte.app.mk:455: dpdk-pdump] Error 1
gmake[4]: *** [/root/FreeBSD1201-64_K12.1_GCC9.2.0/x86_64-native-bsdapp-gcc/e59a0ebc4a6444bca03fa8b024b6c174/dpdk/mk/rte.subdir.mk:37: pdump] Error 2
gmake[4]: *** Waiting for unfinished jobs....
  CC parameters.o
  CC resource.o
--
  CC util.o
  LD testpmd
/usr/local/bin/ld: cannot find -lrte_pmd_dlb_eventdev
collect2: error: ld returned 1 exit status
gmake[5]: *** [/root/FreeBSD1201-64_K12.1_GCC9.2.0/x86_64-native-bsdapp-gcc/e59a0ebc4a6444bca03fa8b024b6c174/dpdk/mk/rte.app.mk:455: testpmd] Error 1
gmake[4]: *** [/root/FreeBSD1201-64_K12.1_GCC9.2.0/x86_64-native-bsdapp-gcc/e59a0ebc4a6444bca03fa8b024b6c174/dpdk/mk/rte.subdir.mk:37: test-pmd] Error 2
  CC test_ring_peek_stress.o
  CC test_ring_rts_stress.o
  CC test_ring_stress.o
--
  MKRES test_resource_c.res.o
  LD test
/usr/local/bin/ld: cannot find -lrte_pmd_dlb_eventdev
collect2: error: ld returned 1 exit status
gmake[5]: *** [/root/FreeBSD1201-64_K12.1_GCC9.2.0/x86_64-native-bsdapp-gcc/e59a0ebc4a6444bca03fa8b024b6c174/dpdk/mk/rte.app.mk:455: test] Error 1
gmake[4]: *** [/root/FreeBSD1201-64_K12.1_GCC9.2.0/x86_64-native-bsdapp-gcc/e59a0ebc4a6444bca03fa8b024b6c174/dpdk/mk/rte.subdir.mk:37: test] Error 2
gmake[3]: *** [/root/FreeBSD1201-64_K12.1_GCC9.2.0/x86_64-native-bsdapp-gcc/e59a0ebc4a6444bca03fa8b024b6c174/dpdk/mk/rte.sdkbuild.mk:53: app] Error 2
gmake[2]: *** [/root/FreeBSD1201-64_K12.1_GCC9.2.0/x86_64-native-bsdapp-gcc/e59a0ebc4a6444bca03fa8b024b6c174/dpdk/mk/rte.sdkroot.mk:99: all] Error 2
gmake[1]: *** [/root/FreeBSD1201-64_K12.1_GCC9.2.0/x86_64-native-bsdapp-gcc/e59a0ebc4a6444bca03fa8b024b6c174/dpdk/mk/rte.sdkinstall.mk:61: pre_install] Error 2
gmake: *** [/root/FreeBSD1201-64_K12.1_GCC9.2.0/x86_64-native-bsdapp-gcc/e59a0ebc4a6444bca03fa8b024b6c174/dpdk/mk/rte.sdkroot.mk:77: install] Error 2


*Makefile Build Failed #6:
OS: FreeBSD1201-64
Target: x86_64-native-bsdapp-clang
awk -f /usr/src/sys/tools/makeobjops.awk /usr/src/sys/kern/bus_if.m -h
awk -f /usr/src/sys/tools/makeobjops.awk /usr/src/sys/dev/pci/pci_if.m -h
Warning: Object directory not changed from original /root/FreeBSD1201-64_K12.1_Clang8.0.1/x86_64-native-bsdapp-clang/e59a0ebc4a6444bca03fa8b024b6c174/dpdk/x86_64-native-bsdapp-clang/build/kernel/freebsd/contigmem
cc  -Winline -Wall -Werror -include /root/FreeBSD1201-64_K12.1_Clang8.0.1/x86_64-native-bsdapp-clang/e59a0ebc4a6444bca03fa8b024b6c174/dpdk/x86_64-native-bsdapp-clang/include/rte_config.h  -Werror -D_KERNEL -DKLD_MODULE -nostdinc  -I/root/FreeBSD1201-64_K12.1_Clang8.0.1/x86_64-native-bsdapp-clang/e59a0ebc4a6444bca03fa8b024b6c174/dpdk/kernel/freebsd/contigmem -I/root/FreeBSD1201-64_K12.1_Clang8.0.1/x86_64-native-bsdapp-clang/e59a0ebc4a6444bca03fa8b024b6c174/dpdk/x86_64-native-bsdapp-clang/include -I. -I/usr/src/sys -I/usr/src/sys/contrib/ck/include -fno-common  -fno-omit-frame-pointer -mno-omit-leaf-frame-pointer -fdebug-prefix-map=./machine=/usr/src/sys/amd64/include -fdebug-prefix-map=./x86=/usr/src/sys/x86/include   -MD  -MF.depend.contigmem.o -MTcontigmem.o -mcmodel=kernel -mno-red-zone -mno-mmx -mno-sse -msoft-float  -fno-asynchronous-unwind-tables -ffreestanding -fwrapv -fstack-protector -Wall -Wredundant-decls -Wnested-externs -Wstrict-prototypes -Wmissing-prototypes -Wpointer-arith -Wcast-qual -Wundef -Wno-pointer-sign -D__printf__=__freebsd_kprintf__ -Wmissing-include-dirs -fdiagnostics-show-option -Wno-unknown-pragmas -Wno-error-tautological-compare -Wno-error-empty-body -Wno-error-parentheses-equality -Wno-error-unused-function -Wno-error-pointer-sign -Wno-error-shift-negative-value -Wno-address-of-packed-member  -mno-aes -mno-avx  -std=iso9899:1999 -c contigmem.c -o contigmem.o
Warning: Object directory not changed from original /root/FreeBSD1201-64_K12.1_Clang8.0.1/x86_64-native-bsdapp-clang/e59a0ebc4a6444bca03fa8b024b6c174/dpdk/x86_64-native-bsdapp-clang/build/kernel/freebsd/nic_uio
cc  -Winline -Wall -Werror -include /root/FreeBSD1201-64_K12.1_Clang8.0.1/x86_64-native-bsdapp-clang/e59a0ebc4a6444bca03fa8b024b6c174/dpdk/x86_64-native-bsdapp-clang/include/rte_config.h  -Werror -D_KERNEL -DKLD_MODULE -nostdinc  -I/root/FreeBSD1201-64_K12.1_Clang8.0.1/x86_64-native-bsdapp-clang/e59a0ebc4a6444bca03fa8b024b6c174/dpdk/kernel/freebsd/nic_uio -I/root/FreeBSD1201-64_K12.1_Clang8.0.1/x86_64-native-bsdapp-clang/e59a0ebc4a6444bca03fa8b024b6c174/dpdk/x86_64-native-bsdapp-clang/include -I. -I/usr/src/sys -I/usr/src/sys/contrib/ck/include -fno-common  -fno-omit-frame-pointer -mno-omit-leaf-frame-pointer -fdebug-prefix-map=./machine=/usr/src/sys/amd64/include -fdebug-prefix-map=./x86=/usr/src/sys/x86/include   -MD  -MF.depend.nic_uio.o -MTnic_uio.o -mcmodel=kernel -mno-red-zone -mno-mmx -mno-sse -msoft-float  -fno-asynchronous-unwind-tables -ffreestanding -fwrapv -fstack-protector -Wall -Wredundant-decls -Wnested-externs -Wstrict-prototypes -Wmissing-prototypes -Wpointer-arith -Wcast-qual -Wundef -Wno-pointer-sign -D__printf__=__freebsd_kprintf__ -Wmissing-include-dirs -fdiagnostics-show-option -Wno-unknown-pragmas -Wno-error-tautological-compare -Wno-error-empty-body -Wno-error-parentheses-equality -Wno-error-unused-function -Wno-error-pointer-sign -Wno-error-shift-negative-value -Wno-address-of-packed-member  -mno-aes -mno-avx  -std=iso9899:1999 -c nic_uio.c -o nic_uio.o
== Build drivers/common
== Build drivers/common/cpt
ld -m elf_x86_64_fbsd -L/root/FreeBSD1201-64_K12.1_Clang8.0.1/x86_64-native-bsdapp-clang/e59a0ebc4a6444bca03fa8b024b6c174/dpdk/x86_64-native-bsdapp-clang/lib -d -warn-common --build-id=sha1 -r -d -o contigmem.ko contigmem.o
--
  CC testpmd.o
  CC commands.o
  LD dpdk-pdump
ld: error: unable to find library -lrte_pmd_dlb_eventdev
clang: error: linker command failed with exit code 1 (use -v to see invocation)
gmake[5]: *** [/root/FreeBSD1201-64_K12.1_Clang8.0.1/x86_64-native-bsdapp-clang/e59a0ebc4a6444bca03fa8b024b6c174/dpdk/mk/rte.app.mk:455: dpdk-pdump] Error 1
gmake[4]: *** [/root/FreeBSD1201-64_K12.1_Clang8.0.1/x86_64-native-bsdapp-clang/e59a0ebc4a6444bca03fa8b024b6c174/dpdk/mk/rte.subdir.mk:37: pdump] Error 2
gmake[4]: *** Waiting for unfinished jobs....
  CC parameters.o
  CC test.o
--
  CC bpf_cmd.o
  CC util.o
  LD testpmd
ld: error: unable to find library -lrte_pmd_dlb_eventdev
clang: error: linker command failed with exit code 1 (use -v to see invocation)
gmake[5]: *** [/root/FreeBSD1201-64_K12.1_Clang8.0.1/x86_64-native-bsdapp-clang/e59a0ebc4a6444bca03fa8b024b6c174/dpdk/mk/rte.app.mk:455: testpmd] Error 1
gmake[4]: *** [/root/FreeBSD1201-64_K12.1_Clang8.0.1/x86_64-native-bsdapp-clang/e59a0ebc4a6444bca03fa8b024b6c174/dpdk/mk/rte.subdir.mk:37: test-pmd] Error 2
  CC test_ring_peek_stress.o
  CC test_ring_rts_stress.o
  CC test_ring_stress.o
--
  CC test_ipsec_sad.o
  MKRES test_resource_c.res.o
  LD test
ld: error: unable to find library -lrte_pmd_dlb_eventdev
clang: error: linker command failed with exit code 1 (use -v to see invocation)
gmake[5]: *** [/root/FreeBSD1201-64_K12.1_Clang8.0.1/x86_64-native-bsdapp-clang/e59a0ebc4a6444bca03fa8b024b6c174/dpdk/mk/rte.app.mk:455: test] Error 1
gmake[4]: *** [/root/FreeBSD1201-64_K12.1_Clang8.0.1/x86_64-native-bsdapp-clang/e59a0ebc4a6444bca03fa8b024b6c174/dpdk/mk/rte.subdir.mk:37: test] Error 2
gmake[3]: *** [/root/FreeBSD1201-64_K12.1_Clang8.0.1/x86_64-native-bsdapp-clang/e59a0ebc4a6444bca03fa8b024b6c174/dpdk/mk/rte.sdkbuild.mk:53: app] Error 2
gmake[2]: *** [/root/FreeBSD1201-64_K12.1_Clang8.0.1/x86_64-native-bsdapp-clang/e59a0ebc4a6444bca03fa8b024b6c174/dpdk/mk/rte.sdkroot.mk:99: all] Error 2
gmake[1]: *** [/root/FreeBSD1201-64_K12.1_Clang8.0.1/x86_64-native-bsdapp-clang/e59a0ebc4a6444bca03fa8b024b6c174/dpdk/mk/rte.sdkinstall.mk:61: pre_install] Error 2
gmake: *** [/root/FreeBSD1201-64_K12.1_Clang8.0.1/x86_64-native-bsdapp-clang/e59a0ebc4a6444bca03fa8b024b6c174/dpdk/mk/rte.sdkroot.mk:77: install] Error 2


*Makefile Build Failed #7:
OS: FreeBSD1201-64
Target: x86_64-native-bsdapp-gcc+shared
== Build lib/librte_bpf
  LD librte_eventdev.so.20.0.3
/usr/local/bin/ld: librte_eventdev.so.20.0.3: version node not found for symbol rte_event_port_default_conf_get at DPDK_20
/usr/local/bin/ld: failed to set dynamic section sizes: bad value
collect2: error: ld returned 1 exit status
gmake[5]: *** [/root/FreeBSD1201-64_K12.1_GCC7.3.0/x86_64-native-bsdapp-gcc+shared/e59a0ebc4a6444bca03fa8b024b6c174/dpdk/mk/rte.lib.mk:100: librte_eventdev.so.20.0.3] Error 1
gmake[4]: *** [/root/FreeBSD1201-64_K12.1_GCC7.3.0/x86_64-native-bsdapp-gcc+shared/e59a0ebc4a6444bca03fa8b024b6c174/dpdk/mk/rte.subdir.mk:37: librte_eventdev] Error 2
gmake[4]: *** Waiting for unfinished jobs....
  CC gso_tcp4.o
  SYMLINK-FILE include/bpf_def.h
--
  CC bpf_jit_x86.o
  LD librte_bpf.so.0.200.3
  INSTALL-LIB librte_bpf.so.0.200.3
gmake[3]: *** [/root/FreeBSD1201-64_K12.1_GCC7.3.0/x86_64-native-bsdapp-gcc+shared/e59a0ebc4a6444bca03fa8b024b6c174/dpdk/mk/rte.sdkbuild.mk:53: lib] Error 2
gmake[2]: *** [/root/FreeBSD1201-64_K12.1_GCC7.3.0/x86_64-native-bsdapp-gcc+shared/e59a0ebc4a6444bca03fa8b024b6c174/dpdk/mk/rte.sdkroot.mk:99: all] Error 2
gmake[1]: *** [/root/FreeBSD1201-64_K12.1_GCC7.3.0/x86_64-native-bsdapp-gcc+shared/e59a0ebc4a6444bca03fa8b024b6c174/dpdk/mk/rte.sdkinstall.mk:61: pre_install] Error 2
gmake: *** [/root/FreeBSD1201-64_K12.1_GCC7.3.0/x86_64-native-bsdapp-gcc+shared/e59a0ebc4a6444bca03fa8b024b6c174/dpdk/mk/rte.sdkroot.mk:77: install] Error 2


*Makefile Build Failed #8:
OS: FreeBSD1201-64
Target: x86_64-native-bsdapp-gcc+debug
awk -f /usr/src/sys/tools/makeobjops.awk /usr/src/sys/dev/pci/pci_if.m -h
== Build drivers/common
Warning: Object directory not changed from original /root/FreeBSD1201-64_K12.1_GCC7.3.0/x86_64-native-bsdapp-gcc+debug/e59a0ebc4a6444bca03fa8b024b6c174/dpdk/x86_64-native-bsdapp-gcc/build/kernel/freebsd/contigmem
cc  -Winline -Wall -Werror -include /root/FreeBSD1201-64_K12.1_GCC7.3.0/x86_64-native-bsdapp-gcc+debug/e59a0ebc4a6444bca03fa8b024b6c174/dpdk/x86_64-native-bsdapp-gcc/include/rte_config.h  -Werror -D_KERNEL -DKLD_MODULE -nostdinc  -I/root/FreeBSD1201-64_K12.1_GCC7.3.0/x86_64-native-bsdapp-gcc+debug/e59a0ebc4a6444bca03fa8b024b6c174/dpdk/kernel/freebsd/contigmem -I/root/FreeBSD1201-64_K12.1_GCC7.3.0/x86_64-native-bsdapp-gcc+debug/e59a0ebc4a6444bca03fa8b024b6c174/dpdk/x86_64-native-bsdapp-gcc/include -I. -I/usr/src/sys -I/usr/src/sys/contrib/ck/include -fno-common  -fno-omit-frame-pointer -mno-omit-leaf-frame-pointer -fdebug-prefix-map=./machine=/usr/src/sys/amd64/include -fdebug-prefix-map=./x86=/usr/src/sys/x86/include   -MD  -MF.depend.contigmem.o -MTcontigmem.o -mcmodel=kernel -mno-red-zone -mno-mmx -mno-sse -msoft-float  -fno-asynchronous-unwind-tables -ffreestanding -fwrapv -fstack-protector -Wall -Wredundant-decls -Wnested-externs -Wstrict-prototypes -Wmissing-prototypes -Wpointer-arith -Wcast-qual -Wundef -Wno-pointer-sign -D__printf__=__freebsd_kprintf__ -Wmissing-include-dirs -fdiagnostics-show-option -Wno-unknown-pragmas -Wno-error-tautological-compare -Wno-error-empty-body -Wno-error-parentheses-equality -Wno-error-unused-function -Wno-error-pointer-sign -Wno-error-shift-negative-value -Wno-address-of-packed-member  -mno-aes -mno-avx  -std=iso9899:1999 -c contigmem.c -o contigmem.o
Warning: Object directory not changed from original /root/FreeBSD1201-64_K12.1_GCC7.3.0/x86_64-native-bsdapp-gcc+debug/e59a0ebc4a6444bca03fa8b024b6c174/dpdk/x86_64-native-bsdapp-gcc/build/kernel/freebsd/nic_uio
cc  -Winline -Wall -Werror -include /root/FreeBSD1201-64_K12.1_GCC7.3.0/x86_64-native-bsdapp-gcc+debug/e59a0ebc4a6444bca03fa8b024b6c174/dpdk/x86_64-native-bsdapp-gcc/include/rte_config.h  -Werror -D_KERNEL -DKLD_MODULE -nostdinc  -I/root/FreeBSD1201-64_K12.1_GCC7.3.0/x86_64-native-bsdapp-gcc+debug/e59a0ebc4a6444bca03fa8b024b6c174/dpdk/kernel/freebsd/nic_uio -I/root/FreeBSD1201-64_K12.1_GCC7.3.0/x86_64-native-bsdapp-gcc+debug/e59a0ebc4a6444bca03fa8b024b6c174/dpdk/x86_64-native-bsdapp-gcc/include -I. -I/usr/src/sys -I/usr/src/sys/contrib/ck/include -fno-common  -fno-omit-frame-pointer -mno-omit-leaf-frame-pointer -fdebug-prefix-map=./machine=/usr/src/sys/amd64/include -fdebug-prefix-map=./x86=/usr/src/sys/x86/include   -MD  -MF.depend.nic_uio.o -MTnic_uio.o -mcmodel=kernel -mno-red-zone -mno-mmx -mno-sse -msoft-float  -fno-asynchronous-unwind-tables -ffreestanding -fwrapv -fstack-protector -Wall -Wredundant-decls -Wnested-externs -Wstrict-prototypes -Wmissing-prototypes -Wpointer-arith -Wcast-qual -Wundef -Wno-pointer-sign -D__printf__=__freebsd_kprintf__ -Wmissing-include-dirs -fdiagnostics-show-option -Wno-unknown-pragmas -Wno-error-tautological-compare -Wno-error-empty-body -Wno-error-parentheses-equality -Wno-error-unused-function -Wno-error-pointer-sign -Wno-error-shift-negative-value -Wno-address-of-packed-member  -mno-aes -mno-avx  -std=iso9899:1999 -c nic_uio.c -o nic_uio.o
ld -m elf_x86_64_fbsd -L/root/FreeBSD1201-64_K12.1_GCC7.3.0/x86_64-native-bsdapp-gcc+debug/e59a0ebc4a6444bca03fa8b024b6c174/dpdk/x86_64-native-bsdapp-gcc/lib -d -warn-common --build-id=sha1 -r -d -o contigmem.ko contigmem.o
:> export_syms
awk -f /usr/src/sys/conf/kmod_syms.awk contigmem.ko  export_syms | xargs -J% objcopy % contigmem.ko
--
  CC test.o
  CC resource.o
/usr/local/bin/ld: cannot find -lrte_pmd_dlb_eventdev
collect2: error: ld returned 1 exit status
gmake[5]: *** [/root/FreeBSD1201-64_K12.1_GCC7.3.0/x86_64-native-bsdapp-gcc+debug/e59a0ebc4a6444bca03fa8b024b6c174/dpdk/mk/rte.app.mk:455: dpdk-pdump] Error 1
gmake[4]: *** [/root/FreeBSD1201-64_K12.1_GCC7.3.0/x86_64-native-bsdapp-gcc+debug/e59a0ebc4a6444bca03fa8b024b6c174/dpdk/mk/rte.subdir.mk:37: pdump] Error 2
gmake[4]: *** Waiting for unfinished jobs....
  CC test_resource.o
  CC test_prefetch.o
--
  CC test_ring_mpmc_stress.o
  LD testpmd
/usr/local/bin/ld: cannot find -lrte_pmd_dlb_eventdev
collect2: error: ld returned 1 exit status
gmake[5]: *** [/root/FreeBSD1201-64_K12.1_GCC7.3.0/x86_64-native-bsdapp-gcc+debug/e59a0ebc4a6444bca03fa8b024b6c174/dpdk/mk/rte.app.mk:455: testpmd] Error 1
gmake[4]: *** [/root/FreeBSD1201-64_K12.1_GCC7.3.0/x86_64-native-bsdapp-gcc+debug/e59a0ebc4a6444bca03fa8b024b6c174/dpdk/mk/rte.subdir.mk:37: test-pmd] Error 2
  CC test_ring_hts_stress.o
  CC test_ring_perf.o
  CC test_ring_peek_stress.o
--
  MKRES test_resource_c.res.o
  LD test
/usr/local/bin/ld: cannot find -lrte_pmd_dlb_eventdev
collect2: error: ld returned 1 exit status
gmake[5]: *** [/root/FreeBSD1201-64_K12.1_GCC7.3.0/x86_64-native-bsdapp-gcc+debug/e59a0ebc4a6444bca03fa8b024b6c174/dpdk/mk/rte.app.mk:455: test] Error 1
gmake[4]: *** [/root/FreeBSD1201-64_K12.1_GCC7.3.0/x86_64-native-bsdapp-gcc+debug/e59a0ebc4a6444bca03fa8b024b6c174/dpdk/mk/rte.subdir.mk:37: test] Error 2
gmake[3]: *** [/root/FreeBSD1201-64_K12.1_GCC7.3.0/x86_64-native-bsdapp-gcc+debug/e59a0ebc4a6444bca03fa8b024b6c174/dpdk/mk/rte.sdkbuild.mk:53: app] Error 2
gmake[2]: *** [/root/FreeBSD1201-64_K12.1_GCC7.3.0/x86_64-native-bsdapp-gcc+debug/e59a0ebc4a6444bca03fa8b024b6c174/dpdk/mk/rte.sdkroot.mk:99: all] Error 2
gmake[1]: *** [/root/FreeBSD1201-64_K12.1_GCC7.3.0/x86_64-native-bsdapp-gcc+debug/e59a0ebc4a6444bca03fa8b024b6c174/dpdk/mk/rte.sdkinstall.mk:61: pre_install] Error 2
gmake: *** [/root/FreeBSD1201-64_K12.1_GCC7.3.0/x86_64-native-bsdapp-gcc+debug/e59a0ebc4a6444bca03fa8b024b6c174/dpdk/mk/rte.sdkroot.mk:77: install] Error 2


*Makefile Build Failed #9:
OS: SUSE15-64
Target: x86_64-native-linuxapp-clang
#define __rte_aligned(a) __attribute__((__aligned__(a)))
                                        ^
In file included from /root/SUSE15-64_K4.12.14_Clang5.0.1/x86_64-native-linuxapp-clang/e59a0ebc4a6444bca03fa8b024b6c174/dpdk/drivers/event/dlb/dlb.c:36:
/root/SUSE15-64_K4.12.14_Clang5.0.1/x86_64-native-linuxapp-clang/e59a0ebc4a6444bca03fa8b024b6c174/dpdk/drivers/event/dlb/dlb_inline_fns.h:46:2: error: use of unknown builtin '__builtin_ia32_movntdq' [-Wimplicit-function-declaration]
        __builtin_ia32_movntdq((__v2di *)pp_addr + 0, (__v2di)src_data0);
        ^
/root/SUSE15-64_K4.12.14_Clang5.0.1/x86_64-native-linuxapp-clang/e59a0ebc4a6444bca03fa8b024b6c174/dpdk/drivers/event/dlb/dlb_inline_fns.h:46:2: note: did you mean '__builtin_ia32_movntq'?
--
        __builtin_ia32_movntdq((__v2di *)pp_addr + 0, (__v2di)src_data0);
        ^
2 warnings and 1 error generated.
make[6]: *** [/root/SUSE15-64_K4.12.14_Clang5.0.1/x86_64-native-linuxapp-clang/e59a0ebc4a6444bca03fa8b024b6c174/dpdk/mk/internal/rte.compile-pre.mk:116: dlb.o] Error 1
make[5]: *** [/root/SUSE15-64_K4.12.14_Clang5.0.1/x86_64-native-linuxapp-clang/e59a0ebc4a6444bca03fa8b024b6c174/dpdk/mk/rte.subdir.mk:37: dlb] Error 2
make[5]: *** Waiting for unfinished jobs....
  CC opdl_evdev.o
  PMDINFO opdl_evdev.o.pmd.c
--
  INSTALL-LIB librte_pmd_octeontx2_event.a
  AR librte_pmd_opdl_event.a
  INSTALL-LIB librte_pmd_opdl_event.a
make[4]: *** [/root/SUSE15-64_K4.12.14_Clang5.0.1/x86_64-native-linuxapp-clang/e59a0ebc4a6444bca03fa8b024b6c174/dpdk/mk/rte.subdir.mk:37: event] Error 2
make[3]: *** [/root/SUSE15-64_K4.12.14_Clang5.0.1/x86_64-native-linuxapp-clang/e59a0ebc4a6444bca03fa8b024b6c174/dpdk/mk/rte.sdkbuild.mk:51: drivers] Error 2
make[2]: *** [/root/SUSE15-64_K4.12.14_Clang5.0.1/x86_64-native-linuxapp-clang/e59a0ebc4a6444bca03fa8b024b6c174/dpdk/mk/rte.sdkroot.mk:99: all] Error 2
make[1]: *** [/root/SUSE15-64_K4.12.14_Clang5.0.1/x86_64-native-linuxapp-clang/e59a0ebc4a6444bca03fa8b024b6c174/dpdk/mk/rte.sdkinstall.mk:61: pre_install] Error 2
make: *** [/root/SUSE15-64_K4.12.14_Clang5.0.1/x86_64-native-linuxapp-clang/e59a0ebc4a6444bca03fa8b024b6c174/dpdk/mk/rte.sdkroot.mk:77: install] Error 2


*Makefile Build Failed #10:
OS: UB2004-64
Target: x86_64-native-linuxapp-clang
#define __rte_aligned(a) __attribute__((__aligned__(a)))
                                        ^
In file included from /root/UB2004-64_K5.4.0_Clang10.0.0/x86_64-native-linuxapp-clang/e59a0ebc4a6444bca03fa8b024b6c174/dpdk/drivers/event/dlb/dlb.c:36:
/root/UB2004-64_K5.4.0_Clang10.0.0/x86_64-native-linuxapp-clang/e59a0ebc4a6444bca03fa8b024b6c174/dpdk/drivers/event/dlb/dlb_inline_fns.h:46:2: error: use of unknown builtin '__builtin_ia32_movntdq' [-Wimplicit-function-declaration]
        __builtin_ia32_movntdq((__v2di *)pp_addr + 0, (__v2di)src_data0);
        ^
/root/UB2004-64_K5.4.0_Clang10.0.0/x86_64-native-linuxapp-clang/e59a0ebc4a6444bca03fa8b024b6c174/dpdk/drivers/event/dlb/dlb_inline_fns.h:46:2: note: did you mean '__builtin_ia32_movntq'?
--
  __builtin_ia32_movntq(__p, __a);
  ^
In file included from /root/UB2004-64_K5.4.0_Clang10.0.0/x86_64-native-linuxapp-clang/e59a0ebc4a6444bca03fa8b024b6c174/dpdk/drivers/event/dlb/dlb.c:36:
/root/UB2004-64_K5.4.0_Clang10.0.0/x86_64-native-linuxapp-clang/e59a0ebc4a6444bca03fa8b024b6c174/dpdk/drivers/event/dlb/dlb_inline_fns.h:62:2: error: use of unknown builtin '__builtin_ia32_movntdq' [-Wimplicit-function-declaration]
        __builtin_ia32_movntdq((__v2di *)pp_addr, (__v2di)src_data0);
        ^
1 warning and 2 errors generated.
make[6]: *** [/root/UB2004-64_K5.4.0_Clang10.0.0/x86_64-native-linuxapp-clang/e59a0ebc4a6444bca03fa8b024b6c174/dpdk/mk/internal/rte.compile-pre.mk:114: dlb.o] Error 1
make[5]: *** [/root/UB2004-64_K5.4.0_Clang10.0.0/x86_64-native-linuxapp-clang/e59a0ebc4a6444bca03fa8b024b6c174/dpdk/mk/rte.subdir.mk:37: dlb] Error 2
make[5]: *** Waiting for unfinished jobs....
  CC opdl_evdev.o
  PMDINFO opdl_evdev.o.pmd.c
--
  CC otx2_evdev_irq.o
  AR librte_pmd_octeontx2_event.a
  INSTALL-LIB librte_pmd_octeontx2_event.a
make[4]: *** [/root/UB2004-64_K5.4.0_Clang10.0.0/x86_64-native-linuxapp-clang/e59a0ebc4a6444bca03fa8b024b6c174/dpdk/mk/rte.subdir.mk:37: event] Error 2
make[3]: *** [/root/UB2004-64_K5.4.0_Clang10.0.0/x86_64-native-linuxapp-clang/e59a0ebc4a6444bca03fa8b024b6c174/dpdk/mk/rte.sdkbuild.mk:51: drivers] Error 2
make[2]: *** [/root/UB2004-64_K5.4.0_Clang10.0.0/x86_64-native-linuxapp-clang/e59a0ebc4a6444bca03fa8b024b6c174/dpdk/mk/rte.sdkroot.mk:99: all] Error 2
make[1]: *** [/root/UB2004-64_K5.4.0_Clang10.0.0/x86_64-native-linuxapp-clang/e59a0ebc4a6444bca03fa8b024b6c174/dpdk/mk/rte.sdkinstall.mk:61: pre_install] Error 2
make: *** [/root/UB2004-64_K5.4.0_Clang10.0.0/x86_64-native-linuxapp-clang/e59a0ebc4a6444bca03fa8b024b6c174/dpdk/mk/rte.sdkroot.mk:77: install] Error 2


*Makefile Build Failed #11:
OS: UB2004-64
Target: x86_64-native-linuxapp-icc
ld: /root/UB2004-64_K5.4.0_ICC19.1.0/x86_64-native-linuxapp-icc/e59a0ebc4a6444bca03fa8b024b6c174/dpdk/x86_64-native-linuxapp-icc/lib/librte_pmd_dlb_eventdev.a(dlb.o): in function `dlb_event_enqueue_burst_delayed':
dlb.c:(.text+0x2568): undefined reference to `__builtin_ia32_movntdq'
ld: /root/UB2004-64_K5.4.0_ICC19.1.0/x86_64-native-linuxapp-icc/e59a0ebc4a6444bca03fa8b024b6c174/dpdk/x86_64-native-linuxapp-icc/lib/librte_pmd_dlb_eventdev.a(dlb.o):dlb.c:(.text+0x3190): more undefined references to `__builtin_ia32_movntdq' follow
make[5]: *** [/root/UB2004-64_K5.4.0_ICC19.1.0/x86_64-native-linuxapp-icc/e59a0ebc4a6444bca03fa8b024b6c174/dpdk/mk/rte.app.mk:455: dpdk-procinfo] Error 1
make[4]: *** [/root/UB2004-64_K5.4.0_ICC19.1.0/x86_64-native-linuxapp-icc/e59a0ebc4a6444bca03fa8b024b6c174/dpdk/mk/rte.subdir.mk:37: proc-info] Error 2
make[4]: *** Waiting for unfinished jobs....
  CC test_barrier.o
  CC test_malloc.o
--
ld: /root/UB2004-64_K5.4.0_ICC19.1.0/x86_64-native-linuxapp-icc/e59a0ebc4a6444bca03fa8b024b6c174/dpdk/x86_64-native-linuxapp-icc/lib/librte_pmd_dlb_eventdev.a(dlb.o): in function `dlb_event_enqueue_burst_delayed':
dlb.c:(.text+0x2568): undefined reference to `__builtin_ia32_movntdq'
ld: /root/UB2004-64_K5.4.0_ICC19.1.0/x86_64-native-linuxapp-icc/e59a0ebc4a6444bca03fa8b024b6c174/dpdk/x86_64-native-linuxapp-icc/lib/librte_pmd_dlb_eventdev.a(dlb.o):dlb.c:(.text+0x3190): more undefined references to `__builtin_ia32_movntdq' follow
make[5]: *** [/root/UB2004-64_K5.4.0_ICC19.1.0/x86_64-native-linuxapp-icc/e59a0ebc4a6444bca03fa8b024b6c174/dpdk/mk/rte.app.mk:455: testpmd] Error 1
make[4]: *** [/root/UB2004-64_K5.4.0_ICC19.1.0/x86_64-native-linuxapp-icc/e59a0ebc4a6444bca03fa8b024b6c174/dpdk/mk/rte.subdir.mk:37: test-pmd] Error 2
  CC test_ring_peek_stress.o
  CC test_ring_rts_stress.o
  CC test_ring_stress.o
--
ld: /root/UB2004-64_K5.4.0_ICC19.1.0/x86_64-native-linuxapp-icc/e59a0ebc4a6444bca03fa8b024b6c174/dpdk/x86_64-native-linuxapp-icc/lib/librte_pmd_dlb_eventdev.a(dlb.o): in function `dlb_event_enqueue_burst_delayed':
dlb.c:(.text+0x2568): undefined reference to `__builtin_ia32_movntdq'
ld: /root/UB2004-64_K5.4.0_ICC19.1.0/x86_64-native-linuxapp-icc/e59a0ebc4a6444bca03fa8b024b6c174/dpdk/x86_64-native-linuxapp-icc/lib/librte_pmd_dlb_eventdev.a(dlb.o):dlb.c:(.text+0x3190): more undefined references to `__builtin_ia32_movntdq' follow
make[5]: *** [/root/UB2004-64_K5.4.0_ICC19.1.0/x86_64-native-linuxapp-icc/e59a0ebc4a6444bca03fa8b024b6c174/dpdk/mk/rte.app.mk:455: test] Error 1
make[4]: *** [/root/UB2004-64_K5.4.0_ICC19.1.0/x86_64-native-linuxapp-icc/e59a0ebc4a6444bca03fa8b024b6c174/dpdk/mk/rte.subdir.mk:37: test] Error 2
make[3]: *** [/root/UB2004-64_K5.4.0_ICC19.1.0/x86_64-native-linuxapp-icc/e59a0ebc4a6444bca03fa8b024b6c174/dpdk/mk/rte.sdkbuild.mk:53: app] Error 2
make[2]: *** [/root/UB2004-64_K5.4.0_ICC19.1.0/x86_64-native-linuxapp-icc/e59a0ebc4a6444bca03fa8b024b6c174/dpdk/mk/rte.sdkroot.mk:99: all] Error 2
make[1]: *** [/root/UB2004-64_K5.4.0_ICC19.1.0/x86_64-native-linuxapp-icc/e59a0ebc4a6444bca03fa8b024b6c174/dpdk/mk/rte.sdkinstall.mk:61: pre_install] Error 2
make: *** [/root/UB2004-64_K5.4.0_ICC19.1.0/x86_64-native-linuxapp-icc/e59a0ebc4a6444bca03fa8b024b6c174/dpdk/mk/rte.sdkroot.mk:77: install] Error 2
DPDK STV team


More information about the test-report mailing list