[dpdk-test-report] |FAILURE| pw(72200) [2/2] ethdev: tunnel offload model

sys_stv at intel.com sys_stv at intel.com
Sun Jun 28 20:01:12 CEST 2020


Test-Label: Intel-compilation
Test-Status: FAILURE
http://dpdk.org/patch/72200

_Compilation issues_

Submitter: Gregory Etelson <getelson at mellanox.com>
Date: 2020-06-25 16:03:48
Reply_mail: 20200625160348.26220-3-getelson at mellanox.com

DPDK git baseline: Repo:dpdk-next-net, CommitID: 3917f4a4290daa186f03500b26523ca684a7db08


Meson build Summary: 8 Builds Done, 2 Successful, 6 Failures, 0 Blocked

Makefile build Summary: 20 Builds Done, 13 Successful, 7 Failures, 0 Blocked

                +==============================================+===========+==========+
                |                   Makefile                   |   Meson   | Document |
+----------------+------+-------+------+------------+-----------+-----------+----------+
| os             | gcc  | clang | icc  | gcc+shared | gcc+debug | gcc/clang | pdf/html |
+----------------+------+-------+------+------------+-----------+-----------+----------+
| CENTOS82-64    | pass | FAIL  | FAIL | pass       | pass      | FAIL      |          |
| RHEL82-64      | pass |       |      |            |           |           |          |
| UB1804-64      | pass |       |      |            |           |           |          |
| FC32-64        | pass | FAIL  |      |            |           | FAIL      |          |
| CENTOS77-64    | pass |       |      |            |           |           |          |
| UB2004-64      | pass | FAIL  | FAIL |            |           | FAIL      | pass     |
| WIN10-64       |      |       |      |            |           | pass      |          |
| UB2004-32      | pass |       |      |            |           |           |          |
| UB1804-32      |      |       |      |            |           | FAIL      |          |
| FreeBSD1201-64 | pass | FAIL  |      | pass       | pass      | FAIL      |          |
| SUSE15-64      | pass | FAIL  |      |            |           | FAIL      |          |
+----------------+------+-------+------+------------+-----------+-----------+----------+
Test environment and configuration as below:

** Makefile build **


OS: CENTOS82-64
	Kernel Version: 4.18.0-193.el8.x86_64
	CPU info: Intel(R) Xeon(R) Platinum 8280M CPU @ 2.70GHz
	GCC Version: gcc (GCC) 8.3.1 20191121 (Red Hat 8.3.1-5)
	Clang Version: 9.0.1 (Red Hat 9.0.1-2.module_el8.2.0+309+0c7b6b03)
	x86_64-native-linuxapp-gcc
	x86_64-native-linuxapp-clang
	x86_64-native-linuxapp-icc
	x86_64-native-linuxapp-gcc+shared
	x86_64-native-linuxapp-gcc+debug


OS: RHEL82-64
	Kernel Version: 4.18.0-193.el8.x86_64
	CPU info: Intel(R) Xeon(R) Platinum 8280M CPU @ 2.70GHz
	GCC Version: gcc (GCC) 8.3.1 20191121 (Red Hat 8.3.1-5)
	Clang Version: 8.0.1 (Red Hat 8.0.1-1.module_el8.1.0+215+a01033fb)
	x86_64-native-linuxapp-gcc


OS: UB1804-64
	Kernel Version: 4.15.0-29-generic
	CPU info: Intel(R) Xeon(R) Platinum 8180 CPU @ 2.50GHz
	GCC Version: gcc (Ubuntu 7.5.0-3ubuntu1~18.04) 7.5.0
	Clang Version: 6.0.0-1ubuntu2 (tags/RELEASE_600/final)
	x86_64-native-linuxapp-gcc


OS: FC32-64
	Kernel Version: 5.6.0-0.rc7.git0.2.fc32.x86_64
	CPU info: Intel(R) Xeon(R) Platinum 8280M CPU @ 2.70GHz
	GCC Version: gcc (GCC) 10.0.1 20200311 (Red Hat 10.0.1-0.9)
	Clang Version: 10.0.0 (Fedora 10.0.0-0.3.rc4.fc32)
	x86_64-native-linuxapp-gcc
	x86_64-native-linuxapp-clang


OS: CENTOS77-64
	Kernel Version: 3.10.0-1062.9.1.el7.x86_64
	CPU info: Intel(R) Xeon(R) Platinum 8280M CPU @ 2.70GHz
	GCC Version: gcc (GCC) 4.8.5 20150623 (Red Hat 4.8.5-39)
	Clang Version: 3.4.2 (tags/RELEASE_34/dot2-final)
	x86_64-native-linuxapp-gcc


OS: UB2004-64
	Kernel Version: 5.4.0-26-generic
	CPU info: Intel(R) Xeon(R) Platinum 8180 CPU @ 2.50GHz
	GCC Version: gcc (Ubuntu 10-20200416-0ubuntu1) 10.0.1 20200416 (experimental) [master revision 3c3f12e2a76:dcee354ce56:44b326839d864fc10c459916abcc97f35a9ac3de]
	Clang Version: 10.0.0-4ubuntu1
	x86_64-native-linuxapp-clang
	x86_64-native-linuxapp-gcc
	x86_64-native-linuxapp-icc


OS: UB2004-32
	Kernel Version: 5.4.0-26-generic
	CPU info: Intel(R) Xeon(R) Platinum 8180 CPU @ 2.50GHz
	GCC Version: gcc (Ubuntu 9.3.0-10ubuntu2) 9.3.0
	Clang Version: 10.0.0-4ubuntu1
	i686-native-linuxapp-gcc


OS: FreeBSD1201-64
	Kernel Version: 12.1-RELEASE
	CPU info: Intel(R) Xeon(R) CPU E5-2699 v3 @ 2.30GHz (2294.74-MHz K8-class CPU)
	GCC Version: gcc (FreeBSD Ports Collection) 9.2.0
	Clang Version: 8.0.1 (tags/RELEASE_801/final 366581) (based on LLVM 8.0.1)
	x86_64-native-bsdapp-gcc
	x86_64-native-bsdapp-clang
	x86_64-native-bsdapp-gcc+shared
	x86_64-native-bsdapp-gcc+debug


OS: SUSE15-64
	Kernel Version: 4.12.14-lp150.11-default
	CPU info: Intel(R) Xeon(R) CPU E5-2699 v4 @ 2.20GHz
	GCC Version: gcc (SUSE Linux) 7.3.1 20180323 [gcc-7-branch revision 258812]
	Clang Version: 5.0.1 (tags/RELEASE_501/final 312548)
	x86_64-native-linuxapp-clang
	x86_64-native-linuxapp-gcc

** Meson build **


OS: CENTOS82-64
	Kernel Version: 4.18.0-193.el8.x86_64
	CPU info: Intel(R) Xeon(R) CPU E5-2699 v4 @ 2.20GHz
	GCC Version: gcc (GCC) 8.3.1 20191121 (Red Hat 8.3.1-5)
	Clang Version: 9.0.1 (Red Hat 9.0.1-2.module_el8.2.0+309+0c7b6b03)
	./build-gcc-static
	./build-gcc-shared
	./build-clang-static
	./build-clang-shared
	./build-x86-default


OS: UB2004-64
	Kernel Version: 5.4.0-26-generic
	CPU info: Intel(R) Xeon(R) Platinum 8180 CPU @ 2.50GHz
	GCC Version: gcc (Ubuntu 9.3.0-10ubuntu2) 9.3.0
	Clang Version: 10.0.0-4ubuntu1
	x86_64-native-linuxapp-doc
	./build-gcc-static
	./build-gcc-shared
	./build-clang-static
	./build-clang-shared
	./build-x86-default


OS: FC32-64
	Kernel Version: 5.6.0-0.rc7.git0.2.fc32.x86_64
	CPU info: Intel(R) Xeon(R) CPU E5-2699 v4 @ 2.20GHz
	GCC Version: gcc (GCC) 10.0.1 20200311 (Red Hat 10.0.1-0.9)
	Clang Version: 10.0.0 (Fedora 10.0.0-0.3.rc4.fc32)
	./build-gcc-static
	./build-gcc-shared
	./build-clang-static
	./build-clang-shared
	./build-x86-default


OS: WIN10-64
	Kernel Version: N/A
	CPU info: N/A
	GCC Version: N/A
	Clang Version: Clang 8.0.0
	x86_64-windows-clang


OS: UB1804-32
	Kernel Version: 4.15.0-20-generic
	CPU info: Intel(R) Xeon(R) CPU E5-2699 v4 @ 2.20GHz
	GCC Version: gcc (Ubuntu 7.5.0-3ubuntu1~18.04) 7.5.0
	Clang Version: 6.0.0-1ubuntu2 (tags/RELEASE_600/final)
	./build-gcc-static
	./build-gcc-shared
	./build-clang-static
	./build-clang-shared
	./build-x86-default


OS: FreeBSD1201-64
	Kernel Version: 12.1-RELEASE
	CPU info: Intel(R) Xeon(R) CPU E5-2699 v4 @ 2.20GHz (2194.97-MHz K8-class CPU)
	GCC Version: gcc (FreeBSD Ports Collection) 9.2.0
	Clang Version: 8.0.1 (tags/RELEASE_801/final 366581) (based on LLVM 8.0.1)
	./build-gcc-static
	./build-gcc-shared
	./build-clang-static
	./build-clang-shared
	./build-x86-default


OS: SUSE15-64
	Kernel Version: 4.12.14-lp150.12.82-default
	CPU info: Intel(R) Xeon(R) CPU E5-2699 v4 @ 2.20GHz
	GCC Version: gcc (SUSE Linux) 7.4.1 20190905 [gcc-7-branch revision 275407]
	Clang Version: 5.0.1 (tags/RELEASE_501/final 312548)
	./build-gcc-static
	./build-gcc-shared
	./build-clang-static
	./build-clang-shared
	./build-x86-default



*Meson Build Failed #1:
OS: CENTOS82-64
Target:./build-gcc-static
FAILED: lib/76b5a35@@rte_ethdev at sta/librte_ethdev_ethdev_private.c.o 
clang -Ilib/76b5a35@@rte_ethdev at sta -Ilib -I../lib -Ilib/librte_ethdev -I../lib/librte_ethdev -I. -I../ -Iconfig -I../config -Ilib/librte_eal/include -I../lib/librte_eal/include -Ilib/librte_eal/linux/include -I../lib/librte_eal/linux/include -Ilib/librte_eal/x86/include -I../lib/librte_eal/x86/include -Ilib/librte_eal/common -I../lib/librte_eal/common -Ilib/librte_eal -I../lib/librte_eal -Ilib/librte_kvargs -I../lib/librte_kvargs -Ilib/librte_telemetry/../librte_metrics -I../lib/librte_telemetry/../librte_metrics -Ilib/librte_telemetry -I../lib/librte_telemetry -Ilib/librte_net -I../lib/librte_net -Ilib/librte_mbuf -I../lib/librte_mbuf -Ilib/librte_mempool -I../lib/librte_mempool -Ilib/librte_ring -I../lib/librte_ring -Ilib/librte_meter -I../lib/librte_meter -Xclang -fcolor-diagnostics -pipe -D_FILE_OFFSET_BITS=64 -Wall -Winvalid-pch -Werror -O2 -g -include rte_config.h -Wextra -Wcast-qual -Wdeprecated -Wformat-nonliteral -Wformat-security -Wmissing-declarations -Wmissing-prototypes -Wnested-externs -Wold-style-definition -Wpointer-arith -Wsign-compare -Wstrict-prototypes -Wundef -Wwrite-strings -Wno-address-of-packed-member -Wno-missing-field-initializers -D_GNU_SOURCE -fPIC -march=native -mno-avx512f -DALLOW_EXPERIMENTAL_API -DALLOW_INTERNAL_API -MD -MQ 'lib/76b5a35@@rte_ethdev at sta/librte_ethdev_ethdev_private.c.o' -MF 'lib/76b5a35@@rte_ethdev at sta/librte_ethdev_ethdev_private.c.o.d' -o 'lib/76b5a35@@rte_ethdev at sta/librte_ethdev_ethdev_private.c.o' -c ../lib/librte_ethdev/ethdev_private.c
In file included from ../lib/librte_ethdev/ethdev_private.c:5:
In file included from ../lib/librte_ethdev/rte_ethdev.h:995:
In file included from ../lib/librte_ethdev/rte_eth_ctrl.h:11:
../lib/librte_ethdev/rte_flow.h:3328:1: error: attribute 'section' is ignored, place it after "struct" to apply attribute to type declaration [-Werror,-Wignored-attributes]
__rte_experimental
^
../lib/librte_eal/include/rte_compat.h:18:16: note: expanded from macro '__rte_experimental'
__attribute__((section(".text.experimental")))
               ^
In file included from ../lib/librte_ethdev/ethdev_private.c:5:
In file included from ../lib/librte_ethdev/rte_ethdev.h:995:
In file included from ../lib/librte_ethdev/rte_eth_ctrl.h:11:
../lib/librte_ethdev/rte_flow.h:3352:1: error: attribute 'section' is ignored, place it after "struct" to apply attribute to type declaration [-Werror,-Wignored-attributes]
__rte_experimental
^
../lib/librte_eal/include/rte_compat.h:18:16: note: expanded from macro '__rte_experimental'
__attribute__((section(".text.experimental")))
               ^
In file included from ../lib/librte_ethdev/ethdev_private.c:5:
In file included from ../lib/librte_ethdev/rte_ethdev.h:995:
In file included from ../lib/librte_ethdev/rte_eth_ctrl.h:11:
../lib/librte_ethdev/rte_flow.h:3382:1: error: attribute 'section' is ignored, place it after "struct" to apply attribute to type declaration [-Werror,-Wignored-attributes]
__rte_experimental
^
../lib/librte_eal/include/rte_compat.h:18:16: note: expanded from macro '__rte_experimental'
__attribute__((section(".text.experimental")))
               ^
3 errors generated.
[118/2199] Generating meter.sym_chk with a meson_exe.py custom command.
[119/2199] Compiling C object 'lib/76b5a35@@rte_ethdev at sta/librte_ethdev_rte_class_eth.c.o'.
FAILED: lib/76b5a35@@rte_ethdev at sta/librte_ethdev_rte_class_eth.c.o 
clang -Ilib/76b5a35@@rte_ethdev at sta -Ilib -I../lib -Ilib/librte_ethdev -I../lib/librte_ethdev -I. -I../ -Iconfig -I../config -Ilib/librte_eal/include -I../lib/librte_eal/include -Ilib/librte_eal/linux/include -I../lib/librte_eal/linux/include -Ilib/librte_eal/x86/include -I../lib/librte_eal/x86/include -Ilib/librte_eal/common -I../lib/librte_eal/common -Ilib/librte_eal -I../lib/librte_eal -Ilib/librte_kvargs -I../lib/librte_kvargs -Ilib/librte_telemetry/../librte_metrics -I../lib/librte_telemetry/../librte_metrics -Ilib/librte_telemetry -I../lib/librte_telemetry -Ilib/librte_net -I../lib/librte_net -Ilib/librte_mbuf -I../lib/librte_mbuf -Ilib/librte_mempool -I../lib/librte_mempool -Ilib/librte_ring -I../lib/librte_ring -Ilib/librte_meter -I../lib/librte_meter -Xclang -fcolor-diagnostics -pipe -D_FILE_OFFSET_BITS=64 -Wall -Winvalid-pch -Werror -O2 -g -include rte_config.h -Wextra -Wcast-qual -Wdeprecated -Wformat-nonliteral -Wformat-security -Wmissing-declarations -Wmissing-prototypes -Wnested-externs -Wold-style-definition -Wpointer-arith -Wsign-compare -Wstrict-prototypes -Wundef -Wwrite-strings -Wno-address-of-packed-member -Wno-missing-field-initializers -D_GNU_SOURCE -fPIC -march=native -mno-avx512f -DALLOW_EXPERIMENTAL_API -DALLOW_INTERNAL_API -MD -MQ 'lib/76b5a35@@rte_ethdev at sta/librte_ethdev_rte_class_eth.c.o' -MF 'lib/76b5a35@@rte_ethdev at sta/librte_ethdev_rte_class_eth.c.o.d' -o 'lib/76b5a35@@rte_ethdev at sta/librte_ethdev_rte_class_eth.c.o' -c ../lib/librte_ethdev/rte_class_eth.c
In file included from ../lib/librte_ethdev/rte_class_eth.c:13:
In file included from ../lib/librte_ethdev/rte_ethdev.h:995:
In file included from ../lib/librte_ethdev/rte_eth_ctrl.h:11:
../lib/librte_ethdev/rte_flow.h:3328:1: error: attribute 'section' is ignored, place it after "struct" to apply attribute to type declaration [-Werror,-Wignored-attributes]
__rte_experimental
^
../lib/librte_eal/include/rte_compat.h:18:16: note: expanded from macro '__rte_experimental'
__attribute__((section(".text.experimental")))
               ^
In file included from ../lib/librte_ethdev/rte_class_eth.c:13:
In file included from ../lib/librte_ethdev/rte_ethdev.h:995:
In file included from ../lib/librte_ethdev/rte_eth_ctrl.h:11:
../lib/librte_ethdev/rte_flow.h:3352:1: error: attribute 'section' is ignored, place it after "struct" to apply attribute to type declaration [-Werror,-Wignored-attributes]
__rte_experimental
^
../lib/librte_eal/include/rte_compat.h:18:16: note: expanded from macro '__rte_experimental'
__attribute__((section(".text.experimental")))
               ^
In file included from ../lib/librte_ethdev/rte_class_eth.c:13:
In file included from ../lib/librte_ethdev/rte_ethdev.h:995:
In file included from ../lib/librte_ethdev/rte_eth_ctrl.h:11:
../lib/librte_ethdev/rte_flow.h:3382:1: error: attribute 'section' is ignored, place it after "struct" to apply attribute to type declaration [-Werror,-Wignored-attributes]
__rte_experimental
^
../lib/librte_eal/include/rte_compat.h:18:16: note: expanded from macro '__rte_experimental'
__attribute__((section(".text.experimental")))
               ^
3 errors generated.
[120/2199] Compiling C object 'lib/76b5a35@@rte_ethdev at sta/librte_ethdev_ethdev_trace_points.c.o'.
FAILED: lib/76b5a35@@rte_ethdev at sta/librte_ethdev_ethdev_trace_points.c.o 
clang -Ilib/76b5a35@@rte_ethdev at sta -Ilib -I../lib -Ilib/librte_ethdev -I../lib/librte_ethdev -I. -I../ -Iconfig -I../config -Ilib/librte_eal/include -I../lib/librte_eal/include -Ilib/librte_eal/linux/include -I../lib/librte_eal/linux/include -Ilib/librte_eal/x86/include -I../lib/librte_eal/x86/include -Ilib/librte_eal/common -I../lib/librte_eal/common -Ilib/librte_eal -I../lib/librte_eal -Ilib/librte_kvargs -I../lib/librte_kvargs -Ilib/librte_telemetry/../librte_metrics -I../lib/librte_telemetry/../librte_metrics -Ilib/librte_telemetry -I../lib/librte_telemetry -Ilib/librte_net -I../lib/librte_net -Ilib/librte_mbuf -I../lib/librte_mbuf -Ilib/librte_mempool -I../lib/librte_mempool -Ilib/librte_ring -I../lib/librte_ring -Ilib/librte_meter -I../lib/librte_meter -Xclang -fcolor-diagnostics -pipe -D_FILE_OFFSET_BITS=64 -Wall -Winvalid-pch -Werror -O2 -g -include rte_config.h -Wextra -Wcast-qual -Wdeprecated -Wformat-nonliteral -Wformat-security -Wmissing-declarations -Wmissing-prototypes -Wnested-externs -Wold-style-definition -Wpointer-arith -Wsign-compare -Wstrict-prototypes -Wundef -Wwrite-strings -Wno-address-of-packed-member -Wno-missing-field-initializers -D_GNU_SOURCE -fPIC -march=native -mno-avx512f -DALLOW_EXPERIMENTAL_API -DALLOW_INTERNAL_API -MD -MQ 'lib/76b5a35@@rte_ethdev at sta/librte_ethdev_ethdev_trace_points.c.o' -MF 'lib/76b5a35@@rte_ethdev at sta/librte_ethdev_ethdev_trace_points.c.o.d' -o 'lib/76b5a35@@rte_ethdev at sta/librte_ethdev_ethdev_trace_points.c.o' -c ../lib/librte_ethdev/ethdev_trace_points.c
In file included from ../lib/librte_ethdev/ethdev_trace_points.c:7:
In file included from ../lib/librte_ethdev/rte_ethdev_trace.h:20:
In file included from ../lib/librte_ethdev/rte_ethdev.h:995:
In file included from ../lib/librte_ethdev/rte_eth_ctrl.h:11:
../lib/librte_ethdev/rte_flow.h:3328:1: error: attribute 'section' is ignored, place it after "struct" to apply attribute to type declaration [-Werror,-Wignored-attributes]
__rte_experimental
^
../lib/librte_eal/include/rte_compat.h:18:16: note: expanded from macro '__rte_experimental'
__attribute__((section(".text.experimental")))
               ^
In file included from ../lib/librte_ethdev/ethdev_trace_points.c:7:
In file included from ../lib/librte_ethdev/rte_ethdev_trace.h:20:
In file included from ../lib/librte_ethdev/rte_ethdev.h:995:
In file included from ../lib/librte_ethdev/rte_eth_ctrl.h:11:
../lib/librte_ethdev/rte_flow.h:3352:1: error: attribute 'section' is ignored, place it after "struct" to apply attribute to type declaration [-Werror,-Wignored-attributes]
__rte_experimental
^
../lib/librte_eal/include/rte_compat.h:18:16: note: expanded from macro '__rte_experimental'
__attribute__((section(".text.experimental")))
               ^
In file included from ../lib/librte_ethdev/ethdev_trace_points.c:7:
In file included from ../lib/librte_ethdev/rte_ethdev_trace.h:20:
In file included from ../lib/librte_ethdev/rte_ethdev.h:995:
In file included from ../lib/librte_ethdev/rte_eth_ctrl.h:11:
../lib/librte_ethdev/rte_flow.h:3382:1: error: attribute 'section' is ignored, place it after "struct" to apply attribute to type declaration [-Werror,-Wignored-attributes]
__rte_experimental
^
../lib/librte_eal/include/rte_compat.h:18:16: note: expanded from macro '__rte_experimental'
__attribute__((section(".text.experimental")))
               ^
3 errors generated.
[121/2199] Generating net.sym_chk with a meson_exe.py custom command.
[122/2199] Compiling C object 'lib/76b5a35@@rte_ethdev at sta/librte_ethdev_rte_flow.c.o'.
FAILED: lib/76b5a35@@rte_ethdev at sta/librte_ethdev_rte_flow.c.o 
clang -Ilib/76b5a35@@rte_ethdev at sta -Ilib -I../lib -Ilib/librte_ethdev -I../lib/librte_ethdev -I. -I../ -Iconfig -I../config -Ilib/librte_eal/include -I../lib/librte_eal/include -Ilib/librte_eal/linux/include -I../lib/librte_eal/linux/include -Ilib/librte_eal/x86/include -I../lib/librte_eal/x86/include -Ilib/librte_eal/common -I../lib/librte_eal/common -Ilib/librte_eal -I../lib/librte_eal -Ilib/librte_kvargs -I../lib/librte_kvargs -Ilib/librte_telemetry/../librte_metrics -I../lib/librte_telemetry/../librte_metrics -Ilib/librte_telemetry -I../lib/librte_telemetry -Ilib/librte_net -I../lib/librte_net -Ilib/librte_mbuf -I../lib/librte_mbuf -Ilib/librte_mempool -I../lib/librte_mempool -Ilib/librte_ring -I../lib/librte_ring -Ilib/librte_meter -I../lib/librte_meter -Xclang -fcolor-diagnostics -pipe -D_FILE_OFFSET_BITS=64 -Wall -Winvalid-pch -Werror -O2 -g -include rte_config.h -Wextra -Wcast-qual -Wdeprecated -Wformat-nonliteral -Wformat-security -Wmissing-declarations -Wmissing-prototypes -Wnested-externs -Wold-style-definition -Wpointer-arith -Wsign-compare -Wstrict-prototypes -Wundef -Wwrite-strings -Wno-address-of-packed-member -Wno-missing-field-initializers -D_GNU_SOURCE -fPIC -march=native -mno-avx512f -DALLOW_EXPERIMENTAL_API -DALLOW_INTERNAL_API -MD -MQ 'lib/76b5a35@@rte_ethdev at sta/librte_ethdev_rte_flow.c.o' -MF 'lib/76b5a35@@rte_ethdev at sta/librte_ethdev_rte_flow.c.o.d' -o 'lib/76b5a35@@rte_ethdev at sta/librte_ethdev_rte_flow.c.o' -c ../lib/librte_ethdev/rte_flow.c
In file included from ../lib/librte_ethdev/rte_flow.c:17:
In file included from ../lib/librte_ethdev/rte_ethdev.h:995:
In file included from ../lib/librte_ethdev/rte_eth_ctrl.h:11:
../lib/librte_ethdev/rte_flow.h:3328:1: error: attribute 'section' is ignored, place it after "struct" to apply attribute to type declaration [-Werror,-Wignored-attributes]
__rte_experimental
^
../lib/librte_eal/include/rte_compat.h:18:16: note: expanded from macro '__rte_experimental'
__attribute__((section(".text.experimental")))
               ^
In file included from ../lib/librte_ethdev/rte_flow.c:17:
In file included from ../lib/librte_ethdev/rte_ethdev.h:995:
In file included from ../lib/librte_ethdev/rte_eth_ctrl.h:11:
../lib/librte_ethdev/rte_flow.h:3352:1: error: attribute 'section' is ignored, place it after "struct" to apply attribute to type declaration [-Werror,-Wignored-attributes]
__rte_experimental
^
../lib/librte_eal/include/rte_compat.h:18:16: note: expanded from macro '__rte_experimental'
__attribute__((section(".text.experimental")))
               ^
In file included from ../lib/librte_ethdev/rte_flow.c:17:
In file included from ../lib/librte_ethdev/rte_ethdev.h:995:
In file included from ../lib/librte_ethdev/rte_eth_ctrl.h:11:
../lib/librte_ethdev/rte_flow.h:3382:1: error: attribute 'section' is ignored, place it after "struct" to apply attribute to type declaration [-Werror,-Wignored-attributes]
__rte_experimental
^
../lib/librte_eal/include/rte_compat.h:18:16: note: expanded from macro '__rte_experimental'
__attribute__((section(".text.experimental")))
               ^
3 errors generated.
[123/2199] Compiling C object 'lib/76b5a35@@rte_ethdev at sta/librte_ethdev_ethdev_profile.c.o'.
FAILED: lib/76b5a35@@rte_ethdev at sta/librte_ethdev_ethdev_profile.c.o 
clang -Ilib/76b5a35@@rte_ethdev at sta -Ilib -I../lib -Ilib/librte_ethdev -I../lib/librte_ethdev -I. -I../ -Iconfig -I../config -Ilib/librte_eal/include -I../lib/librte_eal/include -Ilib/librte_eal/linux/include -I../lib/librte_eal/linux/include -Ilib/librte_eal/x86/include -I../lib/librte_eal/x86/include -Ilib/librte_eal/common -I../lib/librte_eal/common -Ilib/librte_eal -I../lib/librte_eal -Ilib/librte_kvargs -I../lib/librte_kvargs -Ilib/librte_telemetry/../librte_metrics -I../lib/librte_telemetry/../librte_metrics -Ilib/librte_telemetry -I../lib/librte_telemetry -Ilib/librte_net -I../lib/librte_net -Ilib/librte_mbuf -I../lib/librte_mbuf -Ilib/librte_mempool -I../lib/librte_mempool -Ilib/librte_ring -I../lib/librte_ring -Ilib/librte_meter -I../lib/librte_meter -Xclang -fcolor-diagnostics -pipe -D_FILE_OFFSET_BITS=64 -Wall -Winvalid-pch -Werror -O2 -g -include rte_config.h -Wextra -Wcast-qual -Wdeprecated -Wformat-nonliteral -Wformat-security -Wmissing-declarations -Wmissing-prototypes -Wnested-externs -Wold-style-definition -Wpointer-arith -Wsign-compare -Wstrict-prototypes -Wundef -Wwrite-strings -Wno-address-of-packed-member -Wno-missing-field-initializers -D_GNU_SOURCE -fPIC -march=native -mno-avx512f -DALLOW_EXPERIMENTAL_API -DALLOW_INTERNAL_API -MD -MQ 'lib/76b5a35@@rte_ethdev at sta/librte_ethdev_ethdev_profile.c.o' -MF 'lib/76b5a35@@rte_ethdev at sta/librte_ethdev_ethdev_profile.c.o.d' -o 'lib/76b5a35@@rte_ethdev at sta/librte_ethdev_ethdev_profile.c.o' -c ../lib/librte_ethdev/ethdev_profile.c
In file included from ../lib/librte_ethdev/ethdev_profile.c:5:
In file included from ../lib/librte_ethdev/ethdev_profile.h:8:
In file included from ../lib/librte_ethdev/rte_ethdev.h:995:
In file included from ../lib/librte_ethdev/rte_eth_ctrl.h:11:
../lib/librte_ethdev/rte_flow.h:3328:1: error: attribute 'section' is ignored, place it after "struct" to apply attribute to type declaration [-Werror,-Wignored-attributes]
__rte_experimental
^
../lib/librte_eal/include/rte_compat.h:18:16: note: expanded from macro '__rte_experimental'
__attribute__((section(".text.experimental")))
               ^
In file included from ../lib/librte_ethdev/ethdev_profile.c:5:
In file included from ../lib/librte_ethdev/ethdev_profile.h:8:
In file included from ../lib/librte_ethdev/rte_ethdev.h:995:
In file included from ../lib/librte_ethdev/rte_eth_ctrl.h:11:
../lib/librte_ethdev/rte_flow.h:3352:1: error: attribute 'section' is ignored, place it after "struct" to apply attribute to type declaration [-Werror,-Wignored-attributes]
__rte_experimental
^
../lib/librte_eal/include/rte_compat.h:18:16: note: expanded from macro '__rte_experimental'
__attribute__((section(".text.experimental")))
               ^
In file included from ../lib/librte_ethdev/ethdev_profile.c:5:
In file included from ../lib/librte_ethdev/ethdev_profile.h:8:
In file included from ../lib/librte_ethdev/rte_ethdev.h:995:
In file included from ../lib/librte_ethdev/rte_eth_ctrl.h:11:
../lib/librte_ethdev/rte_flow.h:3382:1: error: attribute 'section' is ignored, place it after "struct" to apply attribute to type declaration [-Werror,-Wignored-attributes]
__rte_experimental
^
../lib/librte_eal/include/rte_compat.h:18:16: note: expanded from macro '__rte_experimental'
__attribute__((section(".text.experimental")))
               ^
3 errors generated.
[124/2199] Compiling C object 'lib/76b5a35@@rte_ethdev at sta/librte_ethdev_rte_ethdev.c.o'.
FAILED: lib/76b5a35@@rte_ethdev at sta/librte_ethdev_rte_ethdev.c.o 
clang -Ilib/76b5a35@@rte_ethdev at sta -Ilib -I../lib -Ilib/librte_ethdev -I../lib/librte_ethdev -I. -I../ -Iconfig -I../config -Ilib/librte_eal/include -I../lib/librte_eal/include -Ilib/librte_eal/linux/include -I../lib/librte_eal/linux/include -Ilib/librte_eal/x86/include -I../lib/librte_eal/x86/include -Ilib/librte_eal/common -I../lib/librte_eal/common -Ilib/librte_eal -I../lib/librte_eal -Ilib/librte_kvargs -I../lib/librte_kvargs -Ilib/librte_telemetry/../librte_metrics -I../lib/librte_telemetry/../librte_metrics -Ilib/librte_telemetry -I../lib/librte_telemetry -Ilib/librte_net -I../lib/librte_net -Ilib/librte_mbuf -I../lib/librte_mbuf -Ilib/librte_mempool -I../lib/librte_mempool -Ilib/librte_ring -I../lib/librte_ring -Ilib/librte_meter -I../lib/librte_meter -Xclang -fcolor-diagnostics -pipe -D_FILE_OFFSET_BITS=64 -Wall -Winvalid-pch -Werror -O2 -g -include rte_config.h -Wextra -Wcast-qual -Wdeprecated -Wformat-nonliteral -Wformat-security -Wmissing-declarations -Wmissing-prototypes -Wnested-externs -Wold-style-definition -Wpointer-arith -Wsign-compare -Wstrict-prototypes -Wundef -Wwrite-strings -Wno-address-of-packed-member -Wno-missing-field-initializers -D_GNU_SOURCE -fPIC -march=native -mno-avx512f -DALLOW_EXPERIMENTAL_API -DALLOW_INTERNAL_API -MD -MQ 'lib/76b5a35@@rte_ethdev at sta/librte_ethdev_rte_ethdev.c.o' -MF 'lib/76b5a35@@rte_ethdev at sta/librte_ethdev_rte_ethdev.c.o.d' -o 'lib/76b5a35@@rte_ethdev at sta/librte_ethdev_rte_ethdev.c.o' -c ../lib/librte_ethdev/rte_ethdev.c
In file included from ../lib/librte_ethdev/rte_ethdev.c:43:
In file included from ../lib/librte_ethdev/rte_ethdev_trace.h:20:
In file included from ../lib/librte_ethdev/rte_ethdev.h:995:
In file included from ../lib/librte_ethdev/rte_eth_ctrl.h:11:
../lib/librte_ethdev/rte_flow.h:3328:1: error: attribute 'section' is ignored, place it after "struct" to apply attribute to type declaration [-Werror,-Wignored-attributes]
__rte_experimental
^
../lib/librte_eal/include/rte_compat.h:18:16: note: expanded from macro '__rte_experimental'
__attribute__((section(".text.experimental")))
               ^
In file included from ../lib/librte_ethdev/rte_ethdev.c:43:
In file included from ../lib/librte_ethdev/rte_ethdev_trace.h:20:
In file included from ../lib/librte_ethdev/rte_ethdev.h:995:
In file included from ../lib/librte_ethdev/rte_eth_ctrl.h:11:
../lib/librte_ethdev/rte_flow.h:3352:1: error: attribute 'section' is ignored, place it after "struct" to apply attribute to type declaration [-Werror,-Wignored-attributes]
__rte_experimental
^
../lib/librte_eal/include/rte_compat.h:18:16: note: expanded from macro '__rte_experimental'
__attribute__((section(".text.experimental")))
               ^
In file included from ../lib/librte_ethdev/rte_ethdev.c:43:
In file included from ../lib/librte_ethdev/rte_ethdev_trace.h:20:
In file included from ../lib/librte_ethdev/rte_ethdev.h:995:
In file included from ../lib/librte_ethdev/rte_eth_ctrl.h:11:
../lib/librte_ethdev/rte_flow.h:3382:1: error: attribute 'section' is ignored, place it after "struct" to apply attribute to type declaration [-Werror,-Wignored-attributes]
__rte_experimental
^
../lib/librte_eal/include/rte_compat.h:18:16: note: expanded from macro '__rte_experimental'
__attribute__((section(".text.experimental")))
               ^
3 errors generated.
[125/2199] Compiling C object 'lib/76b5a35@@rte_ethdev at sta/librte_ethdev_rte_mtr.c.o'.
FAILED: lib/76b5a35@@rte_ethdev at sta/librte_ethdev_rte_mtr.c.o 
clang -Ilib/76b5a35@@rte_ethdev at sta -Ilib -I../lib -Ilib/librte_ethdev -I../lib/librte_ethdev -I. -I../ -Iconfig -I../config -Ilib/librte_eal/include -I../lib/librte_eal/include -Ilib/librte_eal/linux/include -I../lib/librte_eal/linux/include -Ilib/librte_eal/x86/include -I../lib/librte_eal/x86/include -Ilib/librte_eal/common -I../lib/librte_eal/common -Ilib/librte_eal -I../lib/librte_eal -Ilib/librte_kvargs -I../lib/librte_kvargs -Ilib/librte_telemetry/../librte_metrics -I../lib/librte_telemetry/../librte_metrics -Ilib/librte_telemetry -I../lib/librte_telemetry -Ilib/librte_net -I../lib/librte_net -Ilib/librte_mbuf -I../lib/librte_mbuf -Ilib/librte_mempool -I../lib/librte_mempool -Ilib/librte_ring -I../lib/librte_ring -Ilib/librte_meter -I../lib/librte_meter -Xclang -fcolor-diagnostics -pipe -D_FILE_OFFSET_BITS=64 -Wall -Winvalid-pch -Werror -O2 -g -include rte_config.h -Wextra -Wcast-qual -Wdeprecated -Wformat-nonliteral -Wformat-security -Wmissing-declarations -Wmissing-prototypes -Wnested-externs -Wold-style-definition -Wpointer-arith -Wsign-compare -Wstrict-prototypes -Wundef -Wwrite-strings -Wno-address-of-packed-member -Wno-missing-field-initializers -D_GNU_SOURCE -fPIC -march=native -mno-avx512f -DALLOW_EXPERIMENTAL_API -DALLOW_INTERNAL_API -MD -MQ 'lib/76b5a35@@rte_ethdev at sta/librte_ethdev_rte_mtr.c.o' -MF 'lib/76b5a35@@rte_ethdev at sta/librte_ethdev_rte_mtr.c.o.d' -o 'lib/76b5a35@@rte_ethdev at sta/librte_ethdev_rte_mtr.c.o' -c ../lib/librte_ethdev/rte_mtr.c
In file included from ../lib/librte_ethdev/rte_mtr.c:9:
In file included from ../lib/librte_ethdev/rte_ethdev.h:995:
In file included from ../lib/librte_ethdev/rte_eth_ctrl.h:11:
../lib/librte_ethdev/rte_flow.h:3328:1: error: attribute 'section' is ignored, place it after "struct" to apply attribute to type declaration [-Werror,-Wignored-attributes]
__rte_experimental
^
../lib/librte_eal/include/rte_compat.h:18:16: note: expanded from macro '__rte_experimental'
__attribute__((section(".text.experimental")))
               ^
In file included from ../lib/librte_ethdev/rte_mtr.c:9:
In file included from ../lib/librte_ethdev/rte_ethdev.h:995:
In file included from ../lib/librte_ethdev/rte_eth_ctrl.h:11:
../lib/librte_ethdev/rte_flow.h:3352:1: error: attribute 'section' is ignored, place it after "struct" to apply attribute to type declaration [-Werror,-Wignored-attributes]
__rte_experimental
^
../lib/librte_eal/include/rte_compat.h:18:16: note: expanded from macro '__rte_experimental'
__attribute__((section(".text.experimental")))
               ^
In file included from ../lib/librte_ethdev/rte_mtr.c:9:
In file included from ../lib/librte_ethdev/rte_ethdev.h:995:
In file included from ../lib/librte_ethdev/rte_eth_ctrl.h:11:
../lib/librte_ethdev/rte_flow.h:3382:1: error: attribute 'section' is ignored, place it after "struct" to apply attribute to type declaration [-Werror,-Wignored-attributes]
__rte_experimental
^
../lib/librte_eal/include/rte_compat.h:18:16: note: expanded from macro '__rte_experimental'
__attribute__((section(".text.experimental")))
               ^
3 errors generated.
[126/2199] Generating mbuf.sym_chk with a meson_exe.py custom command.
[127/2199] Compiling C object 'lib/76b5a35@@rte_ethdev at sta/librte_ethdev_rte_tm.c.o'.
FAILED: lib/76b5a35@@rte_ethdev at sta/librte_ethdev_rte_tm.c.o 
clang -Ilib/76b5a35@@rte_ethdev at sta -Ilib -I../lib -Ilib/librte_ethdev -I../lib/librte_ethdev -I. -I../ -Iconfig -I../config -Ilib/librte_eal/include -I../lib/librte_eal/include -Ilib/librte_eal/linux/include -I../lib/librte_eal/linux/include -Ilib/librte_eal/x86/include -I../lib/librte_eal/x86/include -Ilib/librte_eal/common -I../lib/librte_eal/common -Ilib/librte_eal -I../lib/librte_eal -Ilib/librte_kvargs -I../lib/librte_kvargs -Ilib/librte_telemetry/../librte_metrics -I../lib/librte_telemetry/../librte_metrics -Ilib/librte_telemetry -I../lib/librte_telemetry -Ilib/librte_net -I../lib/librte_net -Ilib/librte_mbuf -I../lib/librte_mbuf -Ilib/librte_mempool -I../lib/librte_mempool -Ilib/librte_ring -I../lib/librte_ring -Ilib/librte_meter -I../lib/librte_meter -Xclang -fcolor-diagnostics -pipe -D_FILE_OFFSET_BITS=64 -Wall -Winvalid-pch -Werror -O2 -g -include rte_config.h -Wextra -Wcast-qual -Wdeprecated -Wformat-nonliteral -Wformat-security -Wmissing-declarations -Wmissing-prototypes -Wnested-externs -Wold-style-definition -Wpointer-arith -Wsign-compare -Wstrict-prototypes -Wundef -Wwrite-strings -Wno-address-of-packed-member -Wno-missing-field-initializers -D_GNU_SOURCE -fPIC -march=native -mno-avx512f -DALLOW_EXPERIMENTAL_API -DALLOW_INTERNAL_API -MD -MQ 'lib/76b5a35@@rte_ethdev at sta/librte_ethdev_rte_tm.c.o' -MF 'lib/76b5a35@@rte_ethdev at sta/librte_ethdev_rte_tm.c.o.d' -o 'lib/76b5a35@@rte_ethdev at sta/librte_ethdev_rte_tm.c.o' -c ../lib/librte_ethdev/rte_tm.c
In file included from ../lib/librte_ethdev/rte_tm.c:8:
In file included from ../lib/librte_ethdev/rte_ethdev.h:995:
In file included from ../lib/librte_ethdev/rte_eth_ctrl.h:11:
../lib/librte_ethdev/rte_flow.h:3328:1: error: attribute 'section' is ignored, place it after "struct" to apply attribute to type declaration [-Werror,-Wignored-attributes]
__rte_experimental
^
../lib/librte_eal/include/rte_compat.h:18:16: note: expanded from macro '__rte_experimental'
__attribute__((section(".text.experimental")))
               ^
In file included from ../lib/librte_ethdev/rte_tm.c:8:
In file included from ../lib/librte_ethdev/rte_ethdev.h:995:
In file included from ../lib/librte_ethdev/rte_eth_ctrl.h:11:
../lib/librte_ethdev/rte_flow.h:3352:1: error: attribute 'section' is ignored, place it after "struct" to apply attribute to type declaration [-Werror,-Wignored-attributes]
__rte_experimental
^
../lib/librte_eal/include/rte_compat.h:18:16: note: expanded from macro '__rte_experimental'
__attribute__((section(".text.experimental")))
               ^
In file included from ../lib/librte_ethdev/rte_tm.c:8:
In file included from ../lib/librte_ethdev/rte_ethdev.h:995:
In file included from ../lib/librte_ethdev/rte_eth_ctrl.h:11:
../lib/librte_ethdev/rte_flow.h:3382:1: error: attribute 'section' is ignored, place it after "struct" to apply attribute to type declaration [-Werror,-Wignored-attributes]
__rte_experimental
^
../lib/librte_eal/include/rte_compat.h:18:16: note: expanded from macro '__rte_experimental'
__attribute__((section(".text.experimental")))
               ^
3 errors generated.
[128/2199] Generating eal.sym_chk with a meson_exe.py custom command.
ninja: build stopped: subcommand failed




*Meson Build Failed #2:
OS: FC32-64
Target:./build-gcc-static
FAILED: lib/76b5a35@@rte_ethdev at sta/librte_ethdev_ethdev_private.c.o 
clang -Ilib/76b5a35@@rte_ethdev at sta -Ilib -I../lib -Ilib/librte_ethdev -I../lib/librte_ethdev -I. -I../ -Iconfig -I../config -Ilib/librte_eal/include -I../lib/librte_eal/include -Ilib/librte_eal/linux/include -I../lib/librte_eal/linux/include -Ilib/librte_eal/x86/include -I../lib/librte_eal/x86/include -Ilib/librte_eal/common -I../lib/librte_eal/common -Ilib/librte_eal -I../lib/librte_eal -Ilib/librte_kvargs -I../lib/librte_kvargs -Ilib/librte_telemetry/../librte_metrics -I../lib/librte_telemetry/../librte_metrics -Ilib/librte_telemetry -I../lib/librte_telemetry -Ilib/librte_net -I../lib/librte_net -Ilib/librte_mbuf -I../lib/librte_mbuf -Ilib/librte_mempool -I../lib/librte_mempool -Ilib/librte_ring -I../lib/librte_ring -Ilib/librte_meter -I../lib/librte_meter -Xclang -fcolor-diagnostics -pipe -D_FILE_OFFSET_BITS=64 -Wall -Winvalid-pch -Werror -O2 -g -include rte_config.h -Wextra -Wcast-qual -Wdeprecated -Wformat-nonliteral -Wformat-security -Wmissing-declarations -Wmissing-prototypes -Wnested-externs -Wold-style-definition -Wpointer-arith -Wsign-compare -Wstrict-prototypes -Wundef -Wwrite-strings -Wno-address-of-packed-member -Wno-missing-field-initializers -D_GNU_SOURCE -fPIC -march=native -DALLOW_EXPERIMENTAL_API -DALLOW_INTERNAL_API -MD -MQ 'lib/76b5a35@@rte_ethdev at sta/librte_ethdev_ethdev_private.c.o' -MF 'lib/76b5a35@@rte_ethdev at sta/librte_ethdev_ethdev_private.c.o.d' -o 'lib/76b5a35@@rte_ethdev at sta/librte_ethdev_ethdev_private.c.o' -c ../lib/librte_ethdev/ethdev_private.c
In file included from ../lib/librte_ethdev/ethdev_private.c:5:
In file included from ../lib/librte_ethdev/rte_ethdev.h:995:
In file included from ../lib/librte_ethdev/rte_eth_ctrl.h:11:
../lib/librte_ethdev/rte_flow.h:3328:1: error: attribute 'section' is ignored, place it after "struct" to apply attribute to type declaration [-Werror,-Wignored-attributes]
__rte_experimental
^
../lib/librte_eal/include/rte_compat.h:18:16: note: expanded from macro '__rte_experimental'
__attribute__((section(".text.experimental")))
               ^
In file included from ../lib/librte_ethdev/ethdev_private.c:5:
In file included from ../lib/librte_ethdev/rte_ethdev.h:995:
In file included from ../lib/librte_ethdev/rte_eth_ctrl.h:11:
../lib/librte_ethdev/rte_flow.h:3352:1: error: attribute 'section' is ignored, place it after "struct" to apply attribute to type declaration [-Werror,-Wignored-attributes]
__rte_experimental
^
../lib/librte_eal/include/rte_compat.h:18:16: note: expanded from macro '__rte_experimental'
__attribute__((section(".text.experimental")))
               ^
In file included from ../lib/librte_ethdev/ethdev_private.c:5:
In file included from ../lib/librte_ethdev/rte_ethdev.h:995:
In file included from ../lib/librte_ethdev/rte_eth_ctrl.h:11:
../lib/librte_ethdev/rte_flow.h:3382:1: error: attribute 'section' is ignored, place it after "struct" to apply attribute to type declaration [-Werror,-Wignored-attributes]
__rte_experimental
^
../lib/librte_eal/include/rte_compat.h:18:16: note: expanded from macro '__rte_experimental'
__attribute__((section(".text.experimental")))
               ^
3 errors generated.
[118/2200] Compiling C object 'lib/76b5a35@@rte_ethdev at sta/librte_ethdev_ethdev_profile.c.o'.
FAILED: lib/76b5a35@@rte_ethdev at sta/librte_ethdev_ethdev_profile.c.o 
clang -Ilib/76b5a35@@rte_ethdev at sta -Ilib -I../lib -Ilib/librte_ethdev -I../lib/librte_ethdev -I. -I../ -Iconfig -I../config -Ilib/librte_eal/include -I../lib/librte_eal/include -Ilib/librte_eal/linux/include -I../lib/librte_eal/linux/include -Ilib/librte_eal/x86/include -I../lib/librte_eal/x86/include -Ilib/librte_eal/common -I../lib/librte_eal/common -Ilib/librte_eal -I../lib/librte_eal -Ilib/librte_kvargs -I../lib/librte_kvargs -Ilib/librte_telemetry/../librte_metrics -I../lib/librte_telemetry/../librte_metrics -Ilib/librte_telemetry -I../lib/librte_telemetry -Ilib/librte_net -I../lib/librte_net -Ilib/librte_mbuf -I../lib/librte_mbuf -Ilib/librte_mempool -I../lib/librte_mempool -Ilib/librte_ring -I../lib/librte_ring -Ilib/librte_meter -I../lib/librte_meter -Xclang -fcolor-diagnostics -pipe -D_FILE_OFFSET_BITS=64 -Wall -Winvalid-pch -Werror -O2 -g -include rte_config.h -Wextra -Wcast-qual -Wdeprecated -Wformat-nonliteral -Wformat-security -Wmissing-declarations -Wmissing-prototypes -Wnested-externs -Wold-style-definition -Wpointer-arith -Wsign-compare -Wstrict-prototypes -Wundef -Wwrite-strings -Wno-address-of-packed-member -Wno-missing-field-initializers -D_GNU_SOURCE -fPIC -march=native -DALLOW_EXPERIMENTAL_API -DALLOW_INTERNAL_API -MD -MQ 'lib/76b5a35@@rte_ethdev at sta/librte_ethdev_ethdev_profile.c.o' -MF 'lib/76b5a35@@rte_ethdev at sta/librte_ethdev_ethdev_profile.c.o.d' -o 'lib/76b5a35@@rte_ethdev at sta/librte_ethdev_ethdev_profile.c.o' -c ../lib/librte_ethdev/ethdev_profile.c
In file included from ../lib/librte_ethdev/ethdev_profile.c:5:
In file included from ../lib/librte_ethdev/ethdev_profile.h:8:
In file included from ../lib/librte_ethdev/rte_ethdev.h:995:
In file included from ../lib/librte_ethdev/rte_eth_ctrl.h:11:
../lib/librte_ethdev/rte_flow.h:3328:1: error: attribute 'section' is ignored, place it after "struct" to apply attribute to type declaration [-Werror,-Wignored-attributes]
__rte_experimental
^
../lib/librte_eal/include/rte_compat.h:18:16: note: expanded from macro '__rte_experimental'
__attribute__((section(".text.experimental")))
               ^
In file included from ../lib/librte_ethdev/ethdev_profile.c:5:
In file included from ../lib/librte_ethdev/ethdev_profile.h:8:
In file included from ../lib/librte_ethdev/rte_ethdev.h:995:
In file included from ../lib/librte_ethdev/rte_eth_ctrl.h:11:
../lib/librte_ethdev/rte_flow.h:3352:1: error: attribute 'section' is ignored, place it after "struct" to apply attribute to type declaration [-Werror,-Wignored-attributes]
__rte_experimental
^
../lib/librte_eal/include/rte_compat.h:18:16: note: expanded from macro '__rte_experimental'
__attribute__((section(".text.experimental")))
               ^
In file included from ../lib/librte_ethdev/ethdev_profile.c:5:
In file included from ../lib/librte_ethdev/ethdev_profile.h:8:
In file included from ../lib/librte_ethdev/rte_ethdev.h:995:
In file included from ../lib/librte_ethdev/rte_eth_ctrl.h:11:
../lib/librte_ethdev/rte_flow.h:3382:1: error: attribute 'section' is ignored, place it after "struct" to apply attribute to type declaration [-Werror,-Wignored-attributes]
__rte_experimental
^
../lib/librte_eal/include/rte_compat.h:18:16: note: expanded from macro '__rte_experimental'
__attribute__((section(".text.experimental")))
               ^
3 errors generated.
[119/2200] Generating net.sym_chk with a meson_exe.py custom command.
[120/2200] Compiling C object 'lib/76b5a35@@rte_ethdev at sta/librte_ethdev_rte_class_eth.c.o'.
FAILED: lib/76b5a35@@rte_ethdev at sta/librte_ethdev_rte_class_eth.c.o 
clang -Ilib/76b5a35@@rte_ethdev at sta -Ilib -I../lib -Ilib/librte_ethdev -I../lib/librte_ethdev -I. -I../ -Iconfig -I../config -Ilib/librte_eal/include -I../lib/librte_eal/include -Ilib/librte_eal/linux/include -I../lib/librte_eal/linux/include -Ilib/librte_eal/x86/include -I../lib/librte_eal/x86/include -Ilib/librte_eal/common -I../lib/librte_eal/common -Ilib/librte_eal -I../lib/librte_eal -Ilib/librte_kvargs -I../lib/librte_kvargs -Ilib/librte_telemetry/../librte_metrics -I../lib/librte_telemetry/../librte_metrics -Ilib/librte_telemetry -I../lib/librte_telemetry -Ilib/librte_net -I../lib/librte_net -Ilib/librte_mbuf -I../lib/librte_mbuf -Ilib/librte_mempool -I../lib/librte_mempool -Ilib/librte_ring -I../lib/librte_ring -Ilib/librte_meter -I../lib/librte_meter -Xclang -fcolor-diagnostics -pipe -D_FILE_OFFSET_BITS=64 -Wall -Winvalid-pch -Werror -O2 -g -include rte_config.h -Wextra -Wcast-qual -Wdeprecated -Wformat-nonliteral -Wformat-security -Wmissing-declarations -Wmissing-prototypes -Wnested-externs -Wold-style-definition -Wpointer-arith -Wsign-compare -Wstrict-prototypes -Wundef -Wwrite-strings -Wno-address-of-packed-member -Wno-missing-field-initializers -D_GNU_SOURCE -fPIC -march=native -DALLOW_EXPERIMENTAL_API -DALLOW_INTERNAL_API -MD -MQ 'lib/76b5a35@@rte_ethdev at sta/librte_ethdev_rte_class_eth.c.o' -MF 'lib/76b5a35@@rte_ethdev at sta/librte_ethdev_rte_class_eth.c.o.d' -o 'lib/76b5a35@@rte_ethdev at sta/librte_ethdev_rte_class_eth.c.o' -c ../lib/librte_ethdev/rte_class_eth.c
In file included from ../lib/librte_ethdev/rte_class_eth.c:13:
In file included from ../lib/librte_ethdev/rte_ethdev.h:995:
In file included from ../lib/librte_ethdev/rte_eth_ctrl.h:11:
../lib/librte_ethdev/rte_flow.h:3328:1: error: attribute 'section' is ignored, place it after "struct" to apply attribute to type declaration [-Werror,-Wignored-attributes]
__rte_experimental
^
../lib/librte_eal/include/rte_compat.h:18:16: note: expanded from macro '__rte_experimental'
__attribute__((section(".text.experimental")))
               ^
In file included from ../lib/librte_ethdev/rte_class_eth.c:13:
In file included from ../lib/librte_ethdev/rte_ethdev.h:995:
In file included from ../lib/librte_ethdev/rte_eth_ctrl.h:11:
../lib/librte_ethdev/rte_flow.h:3352:1: error: attribute 'section' is ignored, place it after "struct" to apply attribute to type declaration [-Werror,-Wignored-attributes]
__rte_experimental
^
../lib/librte_eal/include/rte_compat.h:18:16: note: expanded from macro '__rte_experimental'
__attribute__((section(".text.experimental")))
               ^
In file included from ../lib/librte_ethdev/rte_class_eth.c:13:
In file included from ../lib/librte_ethdev/rte_ethdev.h:995:
In file included from ../lib/librte_ethdev/rte_eth_ctrl.h:11:
../lib/librte_ethdev/rte_flow.h:3382:1: error: attribute 'section' is ignored, place it after "struct" to apply attribute to type declaration [-Werror,-Wignored-attributes]
__rte_experimental
^
../lib/librte_eal/include/rte_compat.h:18:16: note: expanded from macro '__rte_experimental'
__attribute__((section(".text.experimental")))
               ^
3 errors generated.
[121/2200] Compiling C object 'lib/76b5a35@@rte_ethdev at sta/librte_ethdev_ethdev_trace_points.c.o'.
FAILED: lib/76b5a35@@rte_ethdev at sta/librte_ethdev_ethdev_trace_points.c.o 
clang -Ilib/76b5a35@@rte_ethdev at sta -Ilib -I../lib -Ilib/librte_ethdev -I../lib/librte_ethdev -I. -I../ -Iconfig -I../config -Ilib/librte_eal/include -I../lib/librte_eal/include -Ilib/librte_eal/linux/include -I../lib/librte_eal/linux/include -Ilib/librte_eal/x86/include -I../lib/librte_eal/x86/include -Ilib/librte_eal/common -I../lib/librte_eal/common -Ilib/librte_eal -I../lib/librte_eal -Ilib/librte_kvargs -I../lib/librte_kvargs -Ilib/librte_telemetry/../librte_metrics -I../lib/librte_telemetry/../librte_metrics -Ilib/librte_telemetry -I../lib/librte_telemetry -Ilib/librte_net -I../lib/librte_net -Ilib/librte_mbuf -I../lib/librte_mbuf -Ilib/librte_mempool -I../lib/librte_mempool -Ilib/librte_ring -I../lib/librte_ring -Ilib/librte_meter -I../lib/librte_meter -Xclang -fcolor-diagnostics -pipe -D_FILE_OFFSET_BITS=64 -Wall -Winvalid-pch -Werror -O2 -g -include rte_config.h -Wextra -Wcast-qual -Wdeprecated -Wformat-nonliteral -Wformat-security -Wmissing-declarations -Wmissing-prototypes -Wnested-externs -Wold-style-definition -Wpointer-arith -Wsign-compare -Wstrict-prototypes -Wundef -Wwrite-strings -Wno-address-of-packed-member -Wno-missing-field-initializers -D_GNU_SOURCE -fPIC -march=native -DALLOW_EXPERIMENTAL_API -DALLOW_INTERNAL_API -MD -MQ 'lib/76b5a35@@rte_ethdev at sta/librte_ethdev_ethdev_trace_points.c.o' -MF 'lib/76b5a35@@rte_ethdev at sta/librte_ethdev_ethdev_trace_points.c.o.d' -o 'lib/76b5a35@@rte_ethdev at sta/librte_ethdev_ethdev_trace_points.c.o' -c ../lib/librte_ethdev/ethdev_trace_points.c
In file included from ../lib/librte_ethdev/ethdev_trace_points.c:7:
In file included from ../lib/librte_ethdev/rte_ethdev_trace.h:20:
In file included from ../lib/librte_ethdev/rte_ethdev.h:995:
In file included from ../lib/librte_ethdev/rte_eth_ctrl.h:11:
../lib/librte_ethdev/rte_flow.h:3328:1: error: attribute 'section' is ignored, place it after "struct" to apply attribute to type declaration [-Werror,-Wignored-attributes]
__rte_experimental
^
../lib/librte_eal/include/rte_compat.h:18:16: note: expanded from macro '__rte_experimental'
__attribute__((section(".text.experimental")))
               ^
In file included from ../lib/librte_ethdev/ethdev_trace_points.c:7:
In file included from ../lib/librte_ethdev/rte_ethdev_trace.h:20:
In file included from ../lib/librte_ethdev/rte_ethdev.h:995:
In file included from ../lib/librte_ethdev/rte_eth_ctrl.h:11:
../lib/librte_ethdev/rte_flow.h:3352:1: error: attribute 'section' is ignored, place it after "struct" to apply attribute to type declaration [-Werror,-Wignored-attributes]
__rte_experimental
^
../lib/librte_eal/include/rte_compat.h:18:16: note: expanded from macro '__rte_experimental'
__attribute__((section(".text.experimental")))
               ^
In file included from ../lib/librte_ethdev/ethdev_trace_points.c:7:
In file included from ../lib/librte_ethdev/rte_ethdev_trace.h:20:
In file included from ../lib/librte_ethdev/rte_ethdev.h:995:
In file included from ../lib/librte_ethdev/rte_eth_ctrl.h:11:
../lib/librte_ethdev/rte_flow.h:3382:1: error: attribute 'section' is ignored, place it after "struct" to apply attribute to type declaration [-Werror,-Wignored-attributes]
__rte_experimental
^
../lib/librte_eal/include/rte_compat.h:18:16: note: expanded from macro '__rte_experimental'
__attribute__((section(".text.experimental")))
               ^
3 errors generated.
[122/2200] Generating mbuf.sym_chk with a meson_exe.py custom command.
[123/2200] Compiling C object 'lib/76b5a35@@rte_ethdev at sta/librte_ethdev_rte_flow.c.o'.
FAILED: lib/76b5a35@@rte_ethdev at sta/librte_ethdev_rte_flow.c.o 
clang -Ilib/76b5a35@@rte_ethdev at sta -Ilib -I../lib -Ilib/librte_ethdev -I../lib/librte_ethdev -I. -I../ -Iconfig -I../config -Ilib/librte_eal/include -I../lib/librte_eal/include -Ilib/librte_eal/linux/include -I../lib/librte_eal/linux/include -Ilib/librte_eal/x86/include -I../lib/librte_eal/x86/include -Ilib/librte_eal/common -I../lib/librte_eal/common -Ilib/librte_eal -I../lib/librte_eal -Ilib/librte_kvargs -I../lib/librte_kvargs -Ilib/librte_telemetry/../librte_metrics -I../lib/librte_telemetry/../librte_metrics -Ilib/librte_telemetry -I../lib/librte_telemetry -Ilib/librte_net -I../lib/librte_net -Ilib/librte_mbuf -I../lib/librte_mbuf -Ilib/librte_mempool -I../lib/librte_mempool -Ilib/librte_ring -I../lib/librte_ring -Ilib/librte_meter -I../lib/librte_meter -Xclang -fcolor-diagnostics -pipe -D_FILE_OFFSET_BITS=64 -Wall -Winvalid-pch -Werror -O2 -g -include rte_config.h -Wextra -Wcast-qual -Wdeprecated -Wformat-nonliteral -Wformat-security -Wmissing-declarations -Wmissing-prototypes -Wnested-externs -Wold-style-definition -Wpointer-arith -Wsign-compare -Wstrict-prototypes -Wundef -Wwrite-strings -Wno-address-of-packed-member -Wno-missing-field-initializers -D_GNU_SOURCE -fPIC -march=native -DALLOW_EXPERIMENTAL_API -DALLOW_INTERNAL_API -MD -MQ 'lib/76b5a35@@rte_ethdev at sta/librte_ethdev_rte_flow.c.o' -MF 'lib/76b5a35@@rte_ethdev at sta/librte_ethdev_rte_flow.c.o.d' -o 'lib/76b5a35@@rte_ethdev at sta/librte_ethdev_rte_flow.c.o' -c ../lib/librte_ethdev/rte_flow.c
In file included from ../lib/librte_ethdev/rte_flow.c:17:
In file included from ../lib/librte_ethdev/rte_ethdev.h:995:
In file included from ../lib/librte_ethdev/rte_eth_ctrl.h:11:
../lib/librte_ethdev/rte_flow.h:3328:1: error: attribute 'section' is ignored, place it after "struct" to apply attribute to type declaration [-Werror,-Wignored-attributes]
__rte_experimental
^
../lib/librte_eal/include/rte_compat.h:18:16: note: expanded from macro '__rte_experimental'
__attribute__((section(".text.experimental")))
               ^
In file included from ../lib/librte_ethdev/rte_flow.c:17:
In file included from ../lib/librte_ethdev/rte_ethdev.h:995:
In file included from ../lib/librte_ethdev/rte_eth_ctrl.h:11:
../lib/librte_ethdev/rte_flow.h:3352:1: error: attribute 'section' is ignored, place it after "struct" to apply attribute to type declaration [-Werror,-Wignored-attributes]
__rte_experimental
^
../lib/librte_eal/include/rte_compat.h:18:16: note: expanded from macro '__rte_experimental'
__attribute__((section(".text.experimental")))
               ^
In file included from ../lib/librte_ethdev/rte_flow.c:17:
In file included from ../lib/librte_ethdev/rte_ethdev.h:995:
In file included from ../lib/librte_ethdev/rte_eth_ctrl.h:11:
../lib/librte_ethdev/rte_flow.h:3382:1: error: attribute 'section' is ignored, place it after "struct" to apply attribute to type declaration [-Werror,-Wignored-attributes]
__rte_experimental
^
../lib/librte_eal/include/rte_compat.h:18:16: note: expanded from macro '__rte_experimental'
__attribute__((section(".text.experimental")))
               ^
3 errors generated.
[124/2200] Compiling C object 'lib/76b5a35@@rte_ethdev at sta/librte_ethdev_rte_mtr.c.o'.
FAILED: lib/76b5a35@@rte_ethdev at sta/librte_ethdev_rte_mtr.c.o 
clang -Ilib/76b5a35@@rte_ethdev at sta -Ilib -I../lib -Ilib/librte_ethdev -I../lib/librte_ethdev -I. -I../ -Iconfig -I../config -Ilib/librte_eal/include -I../lib/librte_eal/include -Ilib/librte_eal/linux/include -I../lib/librte_eal/linux/include -Ilib/librte_eal/x86/include -I../lib/librte_eal/x86/include -Ilib/librte_eal/common -I../lib/librte_eal/common -Ilib/librte_eal -I../lib/librte_eal -Ilib/librte_kvargs -I../lib/librte_kvargs -Ilib/librte_telemetry/../librte_metrics -I../lib/librte_telemetry/../librte_metrics -Ilib/librte_telemetry -I../lib/librte_telemetry -Ilib/librte_net -I../lib/librte_net -Ilib/librte_mbuf -I../lib/librte_mbuf -Ilib/librte_mempool -I../lib/librte_mempool -Ilib/librte_ring -I../lib/librte_ring -Ilib/librte_meter -I../lib/librte_meter -Xclang -fcolor-diagnostics -pipe -D_FILE_OFFSET_BITS=64 -Wall -Winvalid-pch -Werror -O2 -g -include rte_config.h -Wextra -Wcast-qual -Wdeprecated -Wformat-nonliteral -Wformat-security -Wmissing-declarations -Wmissing-prototypes -Wnested-externs -Wold-style-definition -Wpointer-arith -Wsign-compare -Wstrict-prototypes -Wundef -Wwrite-strings -Wno-address-of-packed-member -Wno-missing-field-initializers -D_GNU_SOURCE -fPIC -march=native -DALLOW_EXPERIMENTAL_API -DALLOW_INTERNAL_API -MD -MQ 'lib/76b5a35@@rte_ethdev at sta/librte_ethdev_rte_mtr.c.o' -MF 'lib/76b5a35@@rte_ethdev at sta/librte_ethdev_rte_mtr.c.o.d' -o 'lib/76b5a35@@rte_ethdev at sta/librte_ethdev_rte_mtr.c.o' -c ../lib/librte_ethdev/rte_mtr.c
In file included from ../lib/librte_ethdev/rte_mtr.c:9:
In file included from ../lib/librte_ethdev/rte_ethdev.h:995:
In file included from ../lib/librte_ethdev/rte_eth_ctrl.h:11:
../lib/librte_ethdev/rte_flow.h:3328:1: error: attribute 'section' is ignored, place it after "struct" to apply attribute to type declaration [-Werror,-Wignored-attributes]
__rte_experimental
^
../lib/librte_eal/include/rte_compat.h:18:16: note: expanded from macro '__rte_experimental'
__attribute__((section(".text.experimental")))
               ^
In file included from ../lib/librte_ethdev/rte_mtr.c:9:
In file included from ../lib/librte_ethdev/rte_ethdev.h:995:
In file included from ../lib/librte_ethdev/rte_eth_ctrl.h:11:
../lib/librte_ethdev/rte_flow.h:3352:1: error: attribute 'section' is ignored, place it after "struct" to apply attribute to type declaration [-Werror,-Wignored-attributes]
__rte_experimental
^
../lib/librte_eal/include/rte_compat.h:18:16: note: expanded from macro '__rte_experimental'
__attribute__((section(".text.experimental")))
               ^
In file included from ../lib/librte_ethdev/rte_mtr.c:9:
In file included from ../lib/librte_ethdev/rte_ethdev.h:995:
In file included from ../lib/librte_ethdev/rte_eth_ctrl.h:11:
../lib/librte_ethdev/rte_flow.h:3382:1: error: attribute 'section' is ignored, place it after "struct" to apply attribute to type declaration [-Werror,-Wignored-attributes]
__rte_experimental
^
../lib/librte_eal/include/rte_compat.h:18:16: note: expanded from macro '__rte_experimental'
__attribute__((section(".text.experimental")))
               ^
3 errors generated.
[125/2200] Compiling C object 'lib/76b5a35@@rte_ethdev at sta/librte_ethdev_rte_ethdev.c.o'.
FAILED: lib/76b5a35@@rte_ethdev at sta/librte_ethdev_rte_ethdev.c.o 
clang -Ilib/76b5a35@@rte_ethdev at sta -Ilib -I../lib -Ilib/librte_ethdev -I../lib/librte_ethdev -I. -I../ -Iconfig -I../config -Ilib/librte_eal/include -I../lib/librte_eal/include -Ilib/librte_eal/linux/include -I../lib/librte_eal/linux/include -Ilib/librte_eal/x86/include -I../lib/librte_eal/x86/include -Ilib/librte_eal/common -I../lib/librte_eal/common -Ilib/librte_eal -I../lib/librte_eal -Ilib/librte_kvargs -I../lib/librte_kvargs -Ilib/librte_telemetry/../librte_metrics -I../lib/librte_telemetry/../librte_metrics -Ilib/librte_telemetry -I../lib/librte_telemetry -Ilib/librte_net -I../lib/librte_net -Ilib/librte_mbuf -I../lib/librte_mbuf -Ilib/librte_mempool -I../lib/librte_mempool -Ilib/librte_ring -I../lib/librte_ring -Ilib/librte_meter -I../lib/librte_meter -Xclang -fcolor-diagnostics -pipe -D_FILE_OFFSET_BITS=64 -Wall -Winvalid-pch -Werror -O2 -g -include rte_config.h -Wextra -Wcast-qual -Wdeprecated -Wformat-nonliteral -Wformat-security -Wmissing-declarations -Wmissing-prototypes -Wnested-externs -Wold-style-definition -Wpointer-arith -Wsign-compare -Wstrict-prototypes -Wundef -Wwrite-strings -Wno-address-of-packed-member -Wno-missing-field-initializers -D_GNU_SOURCE -fPIC -march=native -DALLOW_EXPERIMENTAL_API -DALLOW_INTERNAL_API -MD -MQ 'lib/76b5a35@@rte_ethdev at sta/librte_ethdev_rte_ethdev.c.o' -MF 'lib/76b5a35@@rte_ethdev at sta/librte_ethdev_rte_ethdev.c.o.d' -o 'lib/76b5a35@@rte_ethdev at sta/librte_ethdev_rte_ethdev.c.o' -c ../lib/librte_ethdev/rte_ethdev.c
In file included from ../lib/librte_ethdev/rte_ethdev.c:43:
In file included from ../lib/librte_ethdev/rte_ethdev_trace.h:20:
In file included from ../lib/librte_ethdev/rte_ethdev.h:995:
In file included from ../lib/librte_ethdev/rte_eth_ctrl.h:11:
../lib/librte_ethdev/rte_flow.h:3328:1: error: attribute 'section' is ignored, place it after "struct" to apply attribute to type declaration [-Werror,-Wignored-attributes]
__rte_experimental
^
../lib/librte_eal/include/rte_compat.h:18:16: note: expanded from macro '__rte_experimental'
__attribute__((section(".text.experimental")))
               ^
In file included from ../lib/librte_ethdev/rte_ethdev.c:43:
In file included from ../lib/librte_ethdev/rte_ethdev_trace.h:20:
In file included from ../lib/librte_ethdev/rte_ethdev.h:995:
In file included from ../lib/librte_ethdev/rte_eth_ctrl.h:11:
../lib/librte_ethdev/rte_flow.h:3352:1: error: attribute 'section' is ignored, place it after "struct" to apply attribute to type declaration [-Werror,-Wignored-attributes]
__rte_experimental
^
../lib/librte_eal/include/rte_compat.h:18:16: note: expanded from macro '__rte_experimental'
__attribute__((section(".text.experimental")))
               ^
In file included from ../lib/librte_ethdev/rte_ethdev.c:43:
In file included from ../lib/librte_ethdev/rte_ethdev_trace.h:20:
In file included from ../lib/librte_ethdev/rte_ethdev.h:995:
In file included from ../lib/librte_ethdev/rte_eth_ctrl.h:11:
../lib/librte_ethdev/rte_flow.h:3382:1: error: attribute 'section' is ignored, place it after "struct" to apply attribute to type declaration [-Werror,-Wignored-attributes]
__rte_experimental
^
../lib/librte_eal/include/rte_compat.h:18:16: note: expanded from macro '__rte_experimental'
__attribute__((section(".text.experimental")))
               ^
3 errors generated.
[126/2200] Generating eal.sym_chk with a meson_exe.py custom command.
ninja: build stopped: subcommand failed




*Meson Build Failed #3:
OS: FreeBSD1201-64
Target:./build-gcc-static
FAILED: lib/76b5a35@@rte_ethdev at sta/librte_ethdev_ethdev_profile.c.o 
clang -Ilib/76b5a35@@rte_ethdev at sta -Ilib -I../lib -Ilib/librte_ethdev -I../lib/librte_ethdev -I. -I.. -Iconfig -I../config -Ilib/librte_eal/include -I../lib/librte_eal/include -Ilib/librte_eal/freebsd/include -I../lib/librte_eal/freebsd/include -Ilib/librte_eal/x86/include -I../lib/librte_eal/x86/include -Ilib/librte_eal/common -I../lib/librte_eal/common -Ilib/librte_eal -I../lib/librte_eal -Ilib/librte_kvargs -I../lib/librte_kvargs -Ilib/librte_metrics -I../lib/librte_metrics -Ilib/librte_telemetry -I../lib/librte_telemetry -Ilib/librte_net -I../lib/librte_net -Ilib/librte_mbuf -I../lib/librte_mbuf -Ilib/librte_mempool -I../lib/librte_mempool -Ilib/librte_ring -I../lib/librte_ring -Ilib/librte_meter -I../lib/librte_meter -Xclang -fcolor-diagnostics -pipe -D_FILE_OFFSET_BITS=64 -Wall -Winvalid-pch -Werror -O2 -g -include rte_config.h -Wextra -Wcast-qual -Wdeprecated -Wformat-nonliteral -Wformat-security -Wmissing-declarations -Wmissing-prototypes -Wnested-externs -Wold-style-definition -Wpointer-arith -Wsign-compare -Wstrict-prototypes -Wundef -Wwrite-strings -Wno-address-of-packed-member -Wno-missing-field-initializers -D_GNU_SOURCE -D__BSD_VISIBLE -fPIC -march=native -DALLOW_EXPERIMENTAL_API -DALLOW_INTERNAL_API -MD -MQ 'lib/76b5a35@@rte_ethdev at sta/librte_ethdev_ethdev_profile.c.o' -MF 'lib/76b5a35@@rte_ethdev at sta/librte_ethdev_ethdev_profile.c.o.d' -o 'lib/76b5a35@@rte_ethdev at sta/librte_ethdev_ethdev_profile.c.o' -c ../lib/librte_ethdev/ethdev_profile.c
In file included from ../lib/librte_ethdev/ethdev_profile.c:5:
In file included from ../lib/librte_ethdev/ethdev_profile.h:8:
In file included from ../lib/librte_ethdev/rte_ethdev.h:995:
In file included from ../lib/librte_ethdev/rte_eth_ctrl.h:11:
../lib/librte_ethdev/rte_flow.h:3328:1: error: attribute 'section' is ignored, place it after "struct" to apply attribute to type declaration [-Werror,-Wignored-attributes]
__rte_experimental
^
../lib/librte_eal/include/rte_compat.h:18:16: note: expanded from macro '__rte_experimental'
__attribute__((section(".text.experimental")))
               ^
In file included from ../lib/librte_ethdev/ethdev_profile.c:5:
In file included from ../lib/librte_ethdev/ethdev_profile.h:8:
In file included from ../lib/librte_ethdev/rte_ethdev.h:995:
In file included from ../lib/librte_ethdev/rte_eth_ctrl.h:11:
../lib/librte_ethdev/rte_flow.h:3352:1: error: attribute 'section' is ignored, place it after "struct" to apply attribute to type declaration [-Werror,-Wignored-attributes]
__rte_experimental
^
../lib/librte_eal/include/rte_compat.h:18:16: note: expanded from macro '__rte_experimental'
__attribute__((section(".text.experimental")))
               ^
In file included from ../lib/librte_ethdev/ethdev_profile.c:5:
In file included from ../lib/librte_ethdev/ethdev_profile.h:8:
In file included from ../lib/librte_ethdev/rte_ethdev.h:995:
In file included from ../lib/librte_ethdev/rte_eth_ctrl.h:11:
../lib/librte_ethdev/rte_flow.h:3382:1: error: attribute 'section' is ignored, place it after "struct" to apply attribute to type declaration [-Werror,-Wignored-attributes]
__rte_experimental
^
../lib/librte_eal/include/rte_compat.h:18:16: note: expanded from macro '__rte_experimental'
__attribute__((section(".text.experimental")))
               ^
3 errors generated.
[111/1633] Compiling C object 'lib/76b5a35@@rte_ethdev at sta/librte_ethdev_ethdev_private.c.o'
FAILED: lib/76b5a35@@rte_ethdev at sta/librte_ethdev_ethdev_private.c.o 
clang -Ilib/76b5a35@@rte_ethdev at sta -Ilib -I../lib -Ilib/librte_ethdev -I../lib/librte_ethdev -I. -I.. -Iconfig -I../config -Ilib/librte_eal/include -I../lib/librte_eal/include -Ilib/librte_eal/freebsd/include -I../lib/librte_eal/freebsd/include -Ilib/librte_eal/x86/include -I../lib/librte_eal/x86/include -Ilib/librte_eal/common -I../lib/librte_eal/common -Ilib/librte_eal -I../lib/librte_eal -Ilib/librte_kvargs -I../lib/librte_kvargs -Ilib/librte_metrics -I../lib/librte_metrics -Ilib/librte_telemetry -I../lib/librte_telemetry -Ilib/librte_net -I../lib/librte_net -Ilib/librte_mbuf -I../lib/librte_mbuf -Ilib/librte_mempool -I../lib/librte_mempool -Ilib/librte_ring -I../lib/librte_ring -Ilib/librte_meter -I../lib/librte_meter -Xclang -fcolor-diagnostics -pipe -D_FILE_OFFSET_BITS=64 -Wall -Winvalid-pch -Werror -O2 -g -include rte_config.h -Wextra -Wcast-qual -Wdeprecated -Wformat-nonliteral -Wformat-security -Wmissing-declarations -Wmissing-prototypes -Wnested-externs -Wold-style-definition -Wpointer-arith -Wsign-compare -Wstrict-prototypes -Wundef -Wwrite-strings -Wno-address-of-packed-member -Wno-missing-field-initializers -D_GNU_SOURCE -D__BSD_VISIBLE -fPIC -march=native -DALLOW_EXPERIMENTAL_API -DALLOW_INTERNAL_API -MD -MQ 'lib/76b5a35@@rte_ethdev at sta/librte_ethdev_ethdev_private.c.o' -MF 'lib/76b5a35@@rte_ethdev at sta/librte_ethdev_ethdev_private.c.o.d' -o 'lib/76b5a35@@rte_ethdev at sta/librte_ethdev_ethdev_private.c.o' -c ../lib/librte_ethdev/ethdev_private.c
In file included from ../lib/librte_ethdev/ethdev_private.c:5:
In file included from ../lib/librte_ethdev/rte_ethdev.h:995:
In file included from ../lib/librte_ethdev/rte_eth_ctrl.h:11:
../lib/librte_ethdev/rte_flow.h:3328:1: error: attribute 'section' is ignored, place it after "struct" to apply attribute to type declaration [-Werror,-Wignored-attributes]
__rte_experimental
^
../lib/librte_eal/include/rte_compat.h:18:16: note: expanded from macro '__rte_experimental'
__attribute__((section(".text.experimental")))
               ^
In file included from ../lib/librte_ethdev/ethdev_private.c:5:
In file included from ../lib/librte_ethdev/rte_ethdev.h:995:
In file included from ../lib/librte_ethdev/rte_eth_ctrl.h:11:
../lib/librte_ethdev/rte_flow.h:3352:1: error: attribute 'section' is ignored, place it after "struct" to apply attribute to type declaration [-Werror,-Wignored-attributes]
__rte_experimental
^
../lib/librte_eal/include/rte_compat.h:18:16: note: expanded from macro '__rte_experimental'
__attribute__((section(".text.experimental")))
               ^
In file included from ../lib/librte_ethdev/ethdev_private.c:5:
In file included from ../lib/librte_ethdev/rte_ethdev.h:995:
In file included from ../lib/librte_ethdev/rte_eth_ctrl.h:11:
../lib/librte_ethdev/rte_flow.h:3382:1: error: attribute 'section' is ignored, place it after "struct" to apply attribute to type declaration [-Werror,-Wignored-attributes]
__rte_experimental
^
../lib/librte_eal/include/rte_compat.h:18:16: note: expanded from macro '__rte_experimental'
__attribute__((section(".text.experimental")))
               ^
3 errors generated.
[112/1633] Compiling C object 'lib/76b5a35@@rte_ethdev at sta/librte_ethdev_rte_flow.c.o'
FAILED: lib/76b5a35@@rte_ethdev at sta/librte_ethdev_rte_flow.c.o 
clang -Ilib/76b5a35@@rte_ethdev at sta -Ilib -I../lib -Ilib/librte_ethdev -I../lib/librte_ethdev -I. -I.. -Iconfig -I../config -Ilib/librte_eal/include -I../lib/librte_eal/include -Ilib/librte_eal/freebsd/include -I../lib/librte_eal/freebsd/include -Ilib/librte_eal/x86/include -I../lib/librte_eal/x86/include -Ilib/librte_eal/common -I../lib/librte_eal/common -Ilib/librte_eal -I../lib/librte_eal -Ilib/librte_kvargs -I../lib/librte_kvargs -Ilib/librte_metrics -I../lib/librte_metrics -Ilib/librte_telemetry -I../lib/librte_telemetry -Ilib/librte_net -I../lib/librte_net -Ilib/librte_mbuf -I../lib/librte_mbuf -Ilib/librte_mempool -I../lib/librte_mempool -Ilib/librte_ring -I../lib/librte_ring -Ilib/librte_meter -I../lib/librte_meter -Xclang -fcolor-diagnostics -pipe -D_FILE_OFFSET_BITS=64 -Wall -Winvalid-pch -Werror -O2 -g -include rte_config.h -Wextra -Wcast-qual -Wdeprecated -Wformat-nonliteral -Wformat-security -Wmissing-declarations -Wmissing-prototypes -Wnested-externs -Wold-style-definition -Wpointer-arith -Wsign-compare -Wstrict-prototypes -Wundef -Wwrite-strings -Wno-address-of-packed-member -Wno-missing-field-initializers -D_GNU_SOURCE -D__BSD_VISIBLE -fPIC -march=native -DALLOW_EXPERIMENTAL_API -DALLOW_INTERNAL_API -MD -MQ 'lib/76b5a35@@rte_ethdev at sta/librte_ethdev_rte_flow.c.o' -MF 'lib/76b5a35@@rte_ethdev at sta/librte_ethdev_rte_flow.c.o.d' -o 'lib/76b5a35@@rte_ethdev at sta/librte_ethdev_rte_flow.c.o' -c ../lib/librte_ethdev/rte_flow.c
In file included from ../lib/librte_ethdev/rte_flow.c:17:
In file included from ../lib/librte_ethdev/rte_ethdev.h:995:
In file included from ../lib/librte_ethdev/rte_eth_ctrl.h:11:
../lib/librte_ethdev/rte_flow.h:3328:1: error: attribute 'section' is ignored, place it after "struct" to apply attribute to type declaration [-Werror,-Wignored-attributes]
__rte_experimental
^
../lib/librte_eal/include/rte_compat.h:18:16: note: expanded from macro '__rte_experimental'
__attribute__((section(".text.experimental")))
               ^
In file included from ../lib/librte_ethdev/rte_flow.c:17:
In file included from ../lib/librte_ethdev/rte_ethdev.h:995:
In file included from ../lib/librte_ethdev/rte_eth_ctrl.h:11:
../lib/librte_ethdev/rte_flow.h:3352:1: error: attribute 'section' is ignored, place it after "struct" to apply attribute to type declaration [-Werror,-Wignored-attributes]
__rte_experimental
^
../lib/librte_eal/include/rte_compat.h:18:16: note: expanded from macro '__rte_experimental'
__attribute__((section(".text.experimental")))
               ^
In file included from ../lib/librte_ethdev/rte_flow.c:17:
In file included from ../lib/librte_ethdev/rte_ethdev.h:995:
In file included from ../lib/librte_ethdev/rte_eth_ctrl.h:11:
../lib/librte_ethdev/rte_flow.h:3382:1: error: attribute 'section' is ignored, place it after "struct" to apply attribute to type declaration [-Werror,-Wignored-attributes]
__rte_experimental
^
../lib/librte_eal/include/rte_compat.h:18:16: note: expanded from macro '__rte_experimental'
__attribute__((section(".text.experimental")))
               ^
3 errors generated.
[113/1633] Compiling C object 'lib/76b5a35@@rte_ethdev at sta/librte_ethdev_rte_class_eth.c.o'
FAILED: lib/76b5a35@@rte_ethdev at sta/librte_ethdev_rte_class_eth.c.o 
clang -Ilib/76b5a35@@rte_ethdev at sta -Ilib -I../lib -Ilib/librte_ethdev -I../lib/librte_ethdev -I. -I.. -Iconfig -I../config -Ilib/librte_eal/include -I../lib/librte_eal/include -Ilib/librte_eal/freebsd/include -I../lib/librte_eal/freebsd/include -Ilib/librte_eal/x86/include -I../lib/librte_eal/x86/include -Ilib/librte_eal/common -I../lib/librte_eal/common -Ilib/librte_eal -I../lib/librte_eal -Ilib/librte_kvargs -I../lib/librte_kvargs -Ilib/librte_metrics -I../lib/librte_metrics -Ilib/librte_telemetry -I../lib/librte_telemetry -Ilib/librte_net -I../lib/librte_net -Ilib/librte_mbuf -I../lib/librte_mbuf -Ilib/librte_mempool -I../lib/librte_mempool -Ilib/librte_ring -I../lib/librte_ring -Ilib/librte_meter -I../lib/librte_meter -Xclang -fcolor-diagnostics -pipe -D_FILE_OFFSET_BITS=64 -Wall -Winvalid-pch -Werror -O2 -g -include rte_config.h -Wextra -Wcast-qual -Wdeprecated -Wformat-nonliteral -Wformat-security -Wmissing-declarations -Wmissing-prototypes -Wnested-externs -Wold-style-definition -Wpointer-arith -Wsign-compare -Wstrict-prototypes -Wundef -Wwrite-strings -Wno-address-of-packed-member -Wno-missing-field-initializers -D_GNU_SOURCE -D__BSD_VISIBLE -fPIC -march=native -DALLOW_EXPERIMENTAL_API -DALLOW_INTERNAL_API -MD -MQ 'lib/76b5a35@@rte_ethdev at sta/librte_ethdev_rte_class_eth.c.o' -MF 'lib/76b5a35@@rte_ethdev at sta/librte_ethdev_rte_class_eth.c.o.d' -o 'lib/76b5a35@@rte_ethdev at sta/librte_ethdev_rte_class_eth.c.o' -c ../lib/librte_ethdev/rte_class_eth.c
In file included from ../lib/librte_ethdev/rte_class_eth.c:13:
In file included from ../lib/librte_ethdev/rte_ethdev.h:995:
In file included from ../lib/librte_ethdev/rte_eth_ctrl.h:11:
../lib/librte_ethdev/rte_flow.h:3328:1: error: attribute 'section' is ignored, place it after "struct" to apply attribute to type declaration [-Werror,-Wignored-attributes]
__rte_experimental
^
../lib/librte_eal/include/rte_compat.h:18:16: note: expanded from macro '__rte_experimental'
__attribute__((section(".text.experimental")))
               ^
In file included from ../lib/librte_ethdev/rte_class_eth.c:13:
In file included from ../lib/librte_ethdev/rte_ethdev.h:995:
In file included from ../lib/librte_ethdev/rte_eth_ctrl.h:11:
../lib/librte_ethdev/rte_flow.h:3352:1: error: attribute 'section' is ignored, place it after "struct" to apply attribute to type declaration [-Werror,-Wignored-attributes]
__rte_experimental
^
../lib/librte_eal/include/rte_compat.h:18:16: note: expanded from macro '__rte_experimental'
__attribute__((section(".text.experimental")))
               ^
In file included from ../lib/librte_ethdev/rte_class_eth.c:13:
In file included from ../lib/librte_ethdev/rte_ethdev.h:995:
In file included from ../lib/librte_ethdev/rte_eth_ctrl.h:11:
../lib/librte_ethdev/rte_flow.h:3382:1: error: attribute 'section' is ignored, place it after "struct" to apply attribute to type declaration [-Werror,-Wignored-attributes]
__rte_experimental
^
../lib/librte_eal/include/rte_compat.h:18:16: note: expanded from macro '__rte_experimental'
__attribute__((section(".text.experimental")))
               ^
3 errors generated.
[114/1633] Generating meter.sym_chk with a meson_exe.py custom command
[115/1633] Compiling C object 'lib/76b5a35@@rte_ethdev at sta/librte_ethdev_ethdev_trace_points.c.o'
FAILED: lib/76b5a35@@rte_ethdev at sta/librte_ethdev_ethdev_trace_points.c.o 
clang -Ilib/76b5a35@@rte_ethdev at sta -Ilib -I../lib -Ilib/librte_ethdev -I../lib/librte_ethdev -I. -I.. -Iconfig -I../config -Ilib/librte_eal/include -I../lib/librte_eal/include -Ilib/librte_eal/freebsd/include -I../lib/librte_eal/freebsd/include -Ilib/librte_eal/x86/include -I../lib/librte_eal/x86/include -Ilib/librte_eal/common -I../lib/librte_eal/common -Ilib/librte_eal -I../lib/librte_eal -Ilib/librte_kvargs -I../lib/librte_kvargs -Ilib/librte_metrics -I../lib/librte_metrics -Ilib/librte_telemetry -I../lib/librte_telemetry -Ilib/librte_net -I../lib/librte_net -Ilib/librte_mbuf -I../lib/librte_mbuf -Ilib/librte_mempool -I../lib/librte_mempool -Ilib/librte_ring -I../lib/librte_ring -Ilib/librte_meter -I../lib/librte_meter -Xclang -fcolor-diagnostics -pipe -D_FILE_OFFSET_BITS=64 -Wall -Winvalid-pch -Werror -O2 -g -include rte_config.h -Wextra -Wcast-qual -Wdeprecated -Wformat-nonliteral -Wformat-security -Wmissing-declarations -Wmissing-prototypes -Wnested-externs -Wold-style-definition -Wpointer-arith -Wsign-compare -Wstrict-prototypes -Wundef -Wwrite-strings -Wno-address-of-packed-member -Wno-missing-field-initializers -D_GNU_SOURCE -D__BSD_VISIBLE -fPIC -march=native -DALLOW_EXPERIMENTAL_API -DALLOW_INTERNAL_API -MD -MQ 'lib/76b5a35@@rte_ethdev at sta/librte_ethdev_ethdev_trace_points.c.o' -MF 'lib/76b5a35@@rte_ethdev at sta/librte_ethdev_ethdev_trace_points.c.o.d' -o 'lib/76b5a35@@rte_ethdev at sta/librte_ethdev_ethdev_trace_points.c.o' -c ../lib/librte_ethdev/ethdev_trace_points.c
In file included from ../lib/librte_ethdev/ethdev_trace_points.c:7:
In file included from ../lib/librte_ethdev/rte_ethdev_trace.h:20:
In file included from ../lib/librte_ethdev/rte_ethdev.h:995:
In file included from ../lib/librte_ethdev/rte_eth_ctrl.h:11:
../lib/librte_ethdev/rte_flow.h:3328:1: error: attribute 'section' is ignored, place it after "struct" to apply attribute to type declaration [-Werror,-Wignored-attributes]
__rte_experimental
^
../lib/librte_eal/include/rte_compat.h:18:16: note: expanded from macro '__rte_experimental'
__attribute__((section(".text.experimental")))
               ^
In file included from ../lib/librte_ethdev/ethdev_trace_points.c:7:
In file included from ../lib/librte_ethdev/rte_ethdev_trace.h:20:
In file included from ../lib/librte_ethdev/rte_ethdev.h:995:
In file included from ../lib/librte_ethdev/rte_eth_ctrl.h:11:
../lib/librte_ethdev/rte_flow.h:3352:1: error: attribute 'section' is ignored, place it after "struct" to apply attribute to type declaration [-Werror,-Wignored-attributes]
__rte_experimental
^
../lib/librte_eal/include/rte_compat.h:18:16: note: expanded from macro '__rte_experimental'
__attribute__((section(".text.experimental")))
               ^
In file included from ../lib/librte_ethdev/ethdev_trace_points.c:7:
In file included from ../lib/librte_ethdev/rte_ethdev_trace.h:20:
In file included from ../lib/librte_ethdev/rte_ethdev.h:995:
In file included from ../lib/librte_ethdev/rte_eth_ctrl.h:11:
../lib/librte_ethdev/rte_flow.h:3382:1: error: attribute 'section' is ignored, place it after "struct" to apply attribute to type declaration [-Werror,-Wignored-attributes]
__rte_experimental
^
../lib/librte_eal/include/rte_compat.h:18:16: note: expanded from macro '__rte_experimental'
__attribute__((section(".text.experimental")))
               ^
3 errors generated.
[116/1633] Compiling C object 'lib/76b5a35@@rte_ethdev at sta/librte_ethdev_rte_ethdev.c.o'
FAILED: lib/76b5a35@@rte_ethdev at sta/librte_ethdev_rte_ethdev.c.o 
clang -Ilib/76b5a35@@rte_ethdev at sta -Ilib -I../lib -Ilib/librte_ethdev -I../lib/librte_ethdev -I. -I.. -Iconfig -I../config -Ilib/librte_eal/include -I../lib/librte_eal/include -Ilib/librte_eal/freebsd/include -I../lib/librte_eal/freebsd/include -Ilib/librte_eal/x86/include -I../lib/librte_eal/x86/include -Ilib/librte_eal/common -I../lib/librte_eal/common -Ilib/librte_eal -I../lib/librte_eal -Ilib/librte_kvargs -I../lib/librte_kvargs -Ilib/librte_metrics -I../lib/librte_metrics -Ilib/librte_telemetry -I../lib/librte_telemetry -Ilib/librte_net -I../lib/librte_net -Ilib/librte_mbuf -I../lib/librte_mbuf -Ilib/librte_mempool -I../lib/librte_mempool -Ilib/librte_ring -I../lib/librte_ring -Ilib/librte_meter -I../lib/librte_meter -Xclang -fcolor-diagnostics -pipe -D_FILE_OFFSET_BITS=64 -Wall -Winvalid-pch -Werror -O2 -g -include rte_config.h -Wextra -Wcast-qual -Wdeprecated -Wformat-nonliteral -Wformat-security -Wmissing-declarations -Wmissing-prototypes -Wnested-externs -Wold-style-definition -Wpointer-arith -Wsign-compare -Wstrict-prototypes -Wundef -Wwrite-strings -Wno-address-of-packed-member -Wno-missing-field-initializers -D_GNU_SOURCE -D__BSD_VISIBLE -fPIC -march=native -DALLOW_EXPERIMENTAL_API -DALLOW_INTERNAL_API -MD -MQ 'lib/76b5a35@@rte_ethdev at sta/librte_ethdev_rte_ethdev.c.o' -MF 'lib/76b5a35@@rte_ethdev at sta/librte_ethdev_rte_ethdev.c.o.d' -o 'lib/76b5a35@@rte_ethdev at sta/librte_ethdev_rte_ethdev.c.o' -c ../lib/librte_ethdev/rte_ethdev.c
In file included from ../lib/librte_ethdev/rte_ethdev.c:43:
In file included from ../lib/librte_ethdev/rte_ethdev_trace.h:20:
In file included from ../lib/librte_ethdev/rte_ethdev.h:995:
In file included from ../lib/librte_ethdev/rte_eth_ctrl.h:11:
../lib/librte_ethdev/rte_flow.h:3328:1: error: attribute 'section' is ignored, place it after "struct" to apply attribute to type declaration [-Werror,-Wignored-attributes]
__rte_experimental
^
../lib/librte_eal/include/rte_compat.h:18:16: note: expanded from macro '__rte_experimental'
__attribute__((section(".text.experimental")))
               ^
In file included from ../lib/librte_ethdev/rte_ethdev.c:43:
In file included from ../lib/librte_ethdev/rte_ethdev_trace.h:20:
In file included from ../lib/librte_ethdev/rte_ethdev.h:995:
In file included from ../lib/librte_ethdev/rte_eth_ctrl.h:11:
../lib/librte_ethdev/rte_flow.h:3352:1: error: attribute 'section' is ignored, place it after "struct" to apply attribute to type declaration [-Werror,-Wignored-attributes]
__rte_experimental
^
../lib/librte_eal/include/rte_compat.h:18:16: note: expanded from macro '__rte_experimental'
__attribute__((section(".text.experimental")))
               ^
In file included from ../lib/librte_ethdev/rte_ethdev.c:43:
In file included from ../lib/librte_ethdev/rte_ethdev_trace.h:20:
In file included from ../lib/librte_ethdev/rte_ethdev.h:995:
In file included from ../lib/librte_ethdev/rte_eth_ctrl.h:11:
../lib/librte_ethdev/rte_flow.h:3382:1: error: attribute 'section' is ignored, place it after "struct" to apply attribute to type declaration [-Werror,-Wignored-attributes]
__rte_experimental
^
../lib/librte_eal/include/rte_compat.h:18:16: note: expanded from macro '__rte_experimental'
__attribute__((section(".text.experimental")))
               ^
3 errors generated.
[117/1633] Generating net.sym_chk with a meson_exe.py custom command
[118/1633] Generating mbuf.sym_chk with a meson_exe.py custom command
[119/1633] Generating eal.sym_chk with a meson_exe.py custom command
ninja: build stopped: subcommand failed




*Meson Build Failed #4:
OS: SUSE15-64
Target:./build-gcc-static
FAILED: lib/76b5a35@@rte_ethdev at sta/librte_ethdev_ethdev_private.c.o 
clang -Ilib/76b5a35@@rte_ethdev at sta -Ilib -I../lib -Ilib/librte_ethdev -I../lib/librte_ethdev -I. -I../ -Iconfig -I../config -Ilib/librte_eal/include -I../lib/librte_eal/include -Ilib/librte_eal/linux/include -I../lib/librte_eal/linux/include -Ilib/librte_eal/x86/include -I../lib/librte_eal/x86/include -Ilib/librte_eal/common -I../lib/librte_eal/common -Ilib/librte_eal -I../lib/librte_eal -Ilib/librte_kvargs -I../lib/librte_kvargs -Ilib/librte_telemetry/../librte_metrics -I../lib/librte_telemetry/../librte_metrics -Ilib/librte_telemetry -I../lib/librte_telemetry -Ilib/librte_net -I../lib/librte_net -Ilib/librte_mbuf -I../lib/librte_mbuf -Ilib/librte_mempool -I../lib/librte_mempool -Ilib/librte_ring -I../lib/librte_ring -Ilib/librte_meter -I../lib/librte_meter -Xclang -fcolor-diagnostics -pipe -D_FILE_OFFSET_BITS=64 -Wall -Winvalid-pch -Werror -O2 -g -include rte_config.h -Wextra -Wcast-qual -Wdeprecated -Wformat-nonliteral -Wformat-security -Wmissing-declarations -Wmissing-prototypes -Wnested-externs -Wold-style-definition -Wpointer-arith -Wsign-compare -Wstrict-prototypes -Wundef -Wwrite-strings -Wno-address-of-packed-member -Wno-missing-field-initializers -D_GNU_SOURCE -fPIC -march=native -DALLOW_EXPERIMENTAL_API -DALLOW_INTERNAL_API -MD -MQ 'lib/76b5a35@@rte_ethdev at sta/librte_ethdev_ethdev_private.c.o' -MF 'lib/76b5a35@@rte_ethdev at sta/librte_ethdev_ethdev_private.c.o.d' -o 'lib/76b5a35@@rte_ethdev at sta/librte_ethdev_ethdev_private.c.o' -c ../lib/librte_ethdev/ethdev_private.c
In file included from ../lib/librte_ethdev/ethdev_private.c:5:
In file included from ../lib/librte_ethdev/rte_ethdev.h:995:
In file included from ../lib/librte_ethdev/rte_eth_ctrl.h:11:
../lib/librte_ethdev/rte_flow.h:3328:1: error: attribute 'section' is ignored, place it after "struct" to apply attribute to type declaration [-Werror,-Wignored-attributes]
__rte_experimental
^
../lib/librte_eal/include/rte_compat.h:18:16: note: expanded from macro '__rte_experimental'
__attribute__((section(".text.experimental")))
               ^
In file included from ../lib/librte_ethdev/ethdev_private.c:5:
In file included from ../lib/librte_ethdev/rte_ethdev.h:995:
In file included from ../lib/librte_ethdev/rte_eth_ctrl.h:11:
../lib/librte_ethdev/rte_flow.h:3352:1: error: attribute 'section' is ignored, place it after "struct" to apply attribute to type declaration [-Werror,-Wignored-attributes]
__rte_experimental
^
../lib/librte_eal/include/rte_compat.h:18:16: note: expanded from macro '__rte_experimental'
__attribute__((section(".text.experimental")))
               ^
In file included from ../lib/librte_ethdev/ethdev_private.c:5:
In file included from ../lib/librte_ethdev/rte_ethdev.h:995:
In file included from ../lib/librte_ethdev/rte_eth_ctrl.h:11:
../lib/librte_ethdev/rte_flow.h:3382:1: error: attribute 'section' is ignored, place it after "struct" to apply attribute to type declaration [-Werror,-Wignored-attributes]
__rte_experimental
^
../lib/librte_eal/include/rte_compat.h:18:16: note: expanded from macro '__rte_experimental'
__attribute__((section(".text.experimental")))
               ^
3 errors generated.
[118/2103] Generating meter.sym_chk with a meson_exe.py custom command.
[119/2103] Compiling C object 'lib/76b5a35@@rte_ethdev at sta/librte_ethdev_ethdev_trace_points.c.o'.
FAILED: lib/76b5a35@@rte_ethdev at sta/librte_ethdev_ethdev_trace_points.c.o 
clang -Ilib/76b5a35@@rte_ethdev at sta -Ilib -I../lib -Ilib/librte_ethdev -I../lib/librte_ethdev -I. -I../ -Iconfig -I../config -Ilib/librte_eal/include -I../lib/librte_eal/include -Ilib/librte_eal/linux/include -I../lib/librte_eal/linux/include -Ilib/librte_eal/x86/include -I../lib/librte_eal/x86/include -Ilib/librte_eal/common -I../lib/librte_eal/common -Ilib/librte_eal -I../lib/librte_eal -Ilib/librte_kvargs -I../lib/librte_kvargs -Ilib/librte_telemetry/../librte_metrics -I../lib/librte_telemetry/../librte_metrics -Ilib/librte_telemetry -I../lib/librte_telemetry -Ilib/librte_net -I../lib/librte_net -Ilib/librte_mbuf -I../lib/librte_mbuf -Ilib/librte_mempool -I../lib/librte_mempool -Ilib/librte_ring -I../lib/librte_ring -Ilib/librte_meter -I../lib/librte_meter -Xclang -fcolor-diagnostics -pipe -D_FILE_OFFSET_BITS=64 -Wall -Winvalid-pch -Werror -O2 -g -include rte_config.h -Wextra -Wcast-qual -Wdeprecated -Wformat-nonliteral -Wformat-security -Wmissing-declarations -Wmissing-prototypes -Wnested-externs -Wold-style-definition -Wpointer-arith -Wsign-compare -Wstrict-prototypes -Wundef -Wwrite-strings -Wno-address-of-packed-member -Wno-missing-field-initializers -D_GNU_SOURCE -fPIC -march=native -DALLOW_EXPERIMENTAL_API -DALLOW_INTERNAL_API -MD -MQ 'lib/76b5a35@@rte_ethdev at sta/librte_ethdev_ethdev_trace_points.c.o' -MF 'lib/76b5a35@@rte_ethdev at sta/librte_ethdev_ethdev_trace_points.c.o.d' -o 'lib/76b5a35@@rte_ethdev at sta/librte_ethdev_ethdev_trace_points.c.o' -c ../lib/librte_ethdev/ethdev_trace_points.c
In file included from ../lib/librte_ethdev/ethdev_trace_points.c:7:
In file included from ../lib/librte_ethdev/rte_ethdev_trace.h:20:
In file included from ../lib/librte_ethdev/rte_ethdev.h:995:
In file included from ../lib/librte_ethdev/rte_eth_ctrl.h:11:
../lib/librte_ethdev/rte_flow.h:3328:1: error: attribute 'section' is ignored, place it after "struct" to apply attribute to type declaration [-Werror,-Wignored-attributes]
__rte_experimental
^
../lib/librte_eal/include/rte_compat.h:18:16: note: expanded from macro '__rte_experimental'
__attribute__((section(".text.experimental")))
               ^
In file included from ../lib/librte_ethdev/ethdev_trace_points.c:7:
In file included from ../lib/librte_ethdev/rte_ethdev_trace.h:20:
In file included from ../lib/librte_ethdev/rte_ethdev.h:995:
In file included from ../lib/librte_ethdev/rte_eth_ctrl.h:11:
../lib/librte_ethdev/rte_flow.h:3352:1: error: attribute 'section' is ignored, place it after "struct" to apply attribute to type declaration [-Werror,-Wignored-attributes]
__rte_experimental
^
../lib/librte_eal/include/rte_compat.h:18:16: note: expanded from macro '__rte_experimental'
__attribute__((section(".text.experimental")))
               ^
In file included from ../lib/librte_ethdev/ethdev_trace_points.c:7:
In file included from ../lib/librte_ethdev/rte_ethdev_trace.h:20:
In file included from ../lib/librte_ethdev/rte_ethdev.h:995:
In file included from ../lib/librte_ethdev/rte_eth_ctrl.h:11:
../lib/librte_ethdev/rte_flow.h:3382:1: error: attribute 'section' is ignored, place it after "struct" to apply attribute to type declaration [-Werror,-Wignored-attributes]
__rte_experimental
^
../lib/librte_eal/include/rte_compat.h:18:16: note: expanded from macro '__rte_experimental'
__attribute__((section(".text.experimental")))
               ^
3 errors generated.
[120/2103] Compiling C object 'lib/76b5a35@@rte_ethdev at sta/librte_ethdev_ethdev_profile.c.o'.
FAILED: lib/76b5a35@@rte_ethdev at sta/librte_ethdev_ethdev_profile.c.o 
clang -Ilib/76b5a35@@rte_ethdev at sta -Ilib -I../lib -Ilib/librte_ethdev -I../lib/librte_ethdev -I. -I../ -Iconfig -I../config -Ilib/librte_eal/include -I../lib/librte_eal/include -Ilib/librte_eal/linux/include -I../lib/librte_eal/linux/include -Ilib/librte_eal/x86/include -I../lib/librte_eal/x86/include -Ilib/librte_eal/common -I../lib/librte_eal/common -Ilib/librte_eal -I../lib/librte_eal -Ilib/librte_kvargs -I../lib/librte_kvargs -Ilib/librte_telemetry/../librte_metrics -I../lib/librte_telemetry/../librte_metrics -Ilib/librte_telemetry -I../lib/librte_telemetry -Ilib/librte_net -I../lib/librte_net -Ilib/librte_mbuf -I../lib/librte_mbuf -Ilib/librte_mempool -I../lib/librte_mempool -Ilib/librte_ring -I../lib/librte_ring -Ilib/librte_meter -I../lib/librte_meter -Xclang -fcolor-diagnostics -pipe -D_FILE_OFFSET_BITS=64 -Wall -Winvalid-pch -Werror -O2 -g -include rte_config.h -Wextra -Wcast-qual -Wdeprecated -Wformat-nonliteral -Wformat-security -Wmissing-declarations -Wmissing-prototypes -Wnested-externs -Wold-style-definition -Wpointer-arith -Wsign-compare -Wstrict-prototypes -Wundef -Wwrite-strings -Wno-address-of-packed-member -Wno-missing-field-initializers -D_GNU_SOURCE -fPIC -march=native -DALLOW_EXPERIMENTAL_API -DALLOW_INTERNAL_API -MD -MQ 'lib/76b5a35@@rte_ethdev at sta/librte_ethdev_ethdev_profile.c.o' -MF 'lib/76b5a35@@rte_ethdev at sta/librte_ethdev_ethdev_profile.c.o.d' -o 'lib/76b5a35@@rte_ethdev at sta/librte_ethdev_ethdev_profile.c.o' -c ../lib/librte_ethdev/ethdev_profile.c
In file included from ../lib/librte_ethdev/ethdev_profile.c:5:
In file included from ../lib/librte_ethdev/ethdev_profile.h:8:
In file included from ../lib/librte_ethdev/rte_ethdev.h:995:
In file included from ../lib/librte_ethdev/rte_eth_ctrl.h:11:
../lib/librte_ethdev/rte_flow.h:3328:1: error: attribute 'section' is ignored, place it after "struct" to apply attribute to type declaration [-Werror,-Wignored-attributes]
__rte_experimental
^
../lib/librte_eal/include/rte_compat.h:18:16: note: expanded from macro '__rte_experimental'
__attribute__((section(".text.experimental")))
               ^
In file included from ../lib/librte_ethdev/ethdev_profile.c:5:
In file included from ../lib/librte_ethdev/ethdev_profile.h:8:
In file included from ../lib/librte_ethdev/rte_ethdev.h:995:
In file included from ../lib/librte_ethdev/rte_eth_ctrl.h:11:
../lib/librte_ethdev/rte_flow.h:3352:1: error: attribute 'section' is ignored, place it after "struct" to apply attribute to type declaration [-Werror,-Wignored-attributes]
__rte_experimental
^
../lib/librte_eal/include/rte_compat.h:18:16: note: expanded from macro '__rte_experimental'
__attribute__((section(".text.experimental")))
               ^
In file included from ../lib/librte_ethdev/ethdev_profile.c:5:
In file included from ../lib/librte_ethdev/ethdev_profile.h:8:
In file included from ../lib/librte_ethdev/rte_ethdev.h:995:
In file included from ../lib/librte_ethdev/rte_eth_ctrl.h:11:
../lib/librte_ethdev/rte_flow.h:3382:1: error: attribute 'section' is ignored, place it after "struct" to apply attribute to type declaration [-Werror,-Wignored-attributes]
__rte_experimental
^
../lib/librte_eal/include/rte_compat.h:18:16: note: expanded from macro '__rte_experimental'
__attribute__((section(".text.experimental")))
               ^
3 errors generated.
[121/2103] Compiling C object 'lib/76b5a35@@rte_ethdev at sta/librte_ethdev_rte_class_eth.c.o'.
FAILED: lib/76b5a35@@rte_ethdev at sta/librte_ethdev_rte_class_eth.c.o 
clang -Ilib/76b5a35@@rte_ethdev at sta -Ilib -I../lib -Ilib/librte_ethdev -I../lib/librte_ethdev -I. -I../ -Iconfig -I../config -Ilib/librte_eal/include -I../lib/librte_eal/include -Ilib/librte_eal/linux/include -I../lib/librte_eal/linux/include -Ilib/librte_eal/x86/include -I../lib/librte_eal/x86/include -Ilib/librte_eal/common -I../lib/librte_eal/common -Ilib/librte_eal -I../lib/librte_eal -Ilib/librte_kvargs -I../lib/librte_kvargs -Ilib/librte_telemetry/../librte_metrics -I../lib/librte_telemetry/../librte_metrics -Ilib/librte_telemetry -I../lib/librte_telemetry -Ilib/librte_net -I../lib/librte_net -Ilib/librte_mbuf -I../lib/librte_mbuf -Ilib/librte_mempool -I../lib/librte_mempool -Ilib/librte_ring -I../lib/librte_ring -Ilib/librte_meter -I../lib/librte_meter -Xclang -fcolor-diagnostics -pipe -D_FILE_OFFSET_BITS=64 -Wall -Winvalid-pch -Werror -O2 -g -include rte_config.h -Wextra -Wcast-qual -Wdeprecated -Wformat-nonliteral -Wformat-security -Wmissing-declarations -Wmissing-prototypes -Wnested-externs -Wold-style-definition -Wpointer-arith -Wsign-compare -Wstrict-prototypes -Wundef -Wwrite-strings -Wno-address-of-packed-member -Wno-missing-field-initializers -D_GNU_SOURCE -fPIC -march=native -DALLOW_EXPERIMENTAL_API -DALLOW_INTERNAL_API -MD -MQ 'lib/76b5a35@@rte_ethdev at sta/librte_ethdev_rte_class_eth.c.o' -MF 'lib/76b5a35@@rte_ethdev at sta/librte_ethdev_rte_class_eth.c.o.d' -o 'lib/76b5a35@@rte_ethdev at sta/librte_ethdev_rte_class_eth.c.o' -c ../lib/librte_ethdev/rte_class_eth.c
In file included from ../lib/librte_ethdev/rte_class_eth.c:13:
In file included from ../lib/librte_ethdev/rte_ethdev.h:995:
In file included from ../lib/librte_ethdev/rte_eth_ctrl.h:11:
../lib/librte_ethdev/rte_flow.h:3328:1: error: attribute 'section' is ignored, place it after "struct" to apply attribute to type declaration [-Werror,-Wignored-attributes]
__rte_experimental
^
../lib/librte_eal/include/rte_compat.h:18:16: note: expanded from macro '__rte_experimental'
__attribute__((section(".text.experimental")))
               ^
In file included from ../lib/librte_ethdev/rte_class_eth.c:13:
In file included from ../lib/librte_ethdev/rte_ethdev.h:995:
In file included from ../lib/librte_ethdev/rte_eth_ctrl.h:11:
../lib/librte_ethdev/rte_flow.h:3352:1: error: attribute 'section' is ignored, place it after "struct" to apply attribute to type declaration [-Werror,-Wignored-attributes]
__rte_experimental
^
../lib/librte_eal/include/rte_compat.h:18:16: note: expanded from macro '__rte_experimental'
__attribute__((section(".text.experimental")))
               ^
In file included from ../lib/librte_ethdev/rte_class_eth.c:13:
In file included from ../lib/librte_ethdev/rte_ethdev.h:995:
In file included from ../lib/librte_ethdev/rte_eth_ctrl.h:11:
../lib/librte_ethdev/rte_flow.h:3382:1: error: attribute 'section' is ignored, place it after "struct" to apply attribute to type declaration [-Werror,-Wignored-attributes]
__rte_experimental
^
../lib/librte_eal/include/rte_compat.h:18:16: note: expanded from macro '__rte_experimental'
__attribute__((section(".text.experimental")))
               ^
3 errors generated.
[122/2103] Generating mbuf.sym_chk with a meson_exe.py custom command.
[123/2103] Compiling C object 'lib/76b5a35@@rte_ethdev at sta/librte_ethdev_rte_ethdev.c.o'.
FAILED: lib/76b5a35@@rte_ethdev at sta/librte_ethdev_rte_ethdev.c.o 
clang -Ilib/76b5a35@@rte_ethdev at sta -Ilib -I../lib -Ilib/librte_ethdev -I../lib/librte_ethdev -I. -I../ -Iconfig -I../config -Ilib/librte_eal/include -I../lib/librte_eal/include -Ilib/librte_eal/linux/include -I../lib/librte_eal/linux/include -Ilib/librte_eal/x86/include -I../lib/librte_eal/x86/include -Ilib/librte_eal/common -I../lib/librte_eal/common -Ilib/librte_eal -I../lib/librte_eal -Ilib/librte_kvargs -I../lib/librte_kvargs -Ilib/librte_telemetry/../librte_metrics -I../lib/librte_telemetry/../librte_metrics -Ilib/librte_telemetry -I../lib/librte_telemetry -Ilib/librte_net -I../lib/librte_net -Ilib/librte_mbuf -I../lib/librte_mbuf -Ilib/librte_mempool -I../lib/librte_mempool -Ilib/librte_ring -I../lib/librte_ring -Ilib/librte_meter -I../lib/librte_meter -Xclang -fcolor-diagnostics -pipe -D_FILE_OFFSET_BITS=64 -Wall -Winvalid-pch -Werror -O2 -g -include rte_config.h -Wextra -Wcast-qual -Wdeprecated -Wformat-nonliteral -Wformat-security -Wmissing-declarations -Wmissing-prototypes -Wnested-externs -Wold-style-definition -Wpointer-arith -Wsign-compare -Wstrict-prototypes -Wundef -Wwrite-strings -Wno-address-of-packed-member -Wno-missing-field-initializers -D_GNU_SOURCE -fPIC -march=native -DALLOW_EXPERIMENTAL_API -DALLOW_INTERNAL_API -MD -MQ 'lib/76b5a35@@rte_ethdev at sta/librte_ethdev_rte_ethdev.c.o' -MF 'lib/76b5a35@@rte_ethdev at sta/librte_ethdev_rte_ethdev.c.o.d' -o 'lib/76b5a35@@rte_ethdev at sta/librte_ethdev_rte_ethdev.c.o' -c ../lib/librte_ethdev/rte_ethdev.c
In file included from ../lib/librte_ethdev/rte_ethdev.c:43:
In file included from ../lib/librte_ethdev/rte_ethdev_trace.h:20:
In file included from ../lib/librte_ethdev/rte_ethdev.h:995:
In file included from ../lib/librte_ethdev/rte_eth_ctrl.h:11:
../lib/librte_ethdev/rte_flow.h:3328:1: error: attribute 'section' is ignored, place it after "struct" to apply attribute to type declaration [-Werror,-Wignored-attributes]
__rte_experimental
^
../lib/librte_eal/include/rte_compat.h:18:16: note: expanded from macro '__rte_experimental'
__attribute__((section(".text.experimental")))
               ^
In file included from ../lib/librte_ethdev/rte_ethdev.c:43:
In file included from ../lib/librte_ethdev/rte_ethdev_trace.h:20:
In file included from ../lib/librte_ethdev/rte_ethdev.h:995:
In file included from ../lib/librte_ethdev/rte_eth_ctrl.h:11:
../lib/librte_ethdev/rte_flow.h:3352:1: error: attribute 'section' is ignored, place it after "struct" to apply attribute to type declaration [-Werror,-Wignored-attributes]
__rte_experimental
^
../lib/librte_eal/include/rte_compat.h:18:16: note: expanded from macro '__rte_experimental'
__attribute__((section(".text.experimental")))
               ^
In file included from ../lib/librte_ethdev/rte_ethdev.c:43:
In file included from ../lib/librte_ethdev/rte_ethdev_trace.h:20:
In file included from ../lib/librte_ethdev/rte_ethdev.h:995:
In file included from ../lib/librte_ethdev/rte_eth_ctrl.h:11:
../lib/librte_ethdev/rte_flow.h:3382:1: error: attribute 'section' is ignored, place it after "struct" to apply attribute to type declaration [-Werror,-Wignored-attributes]
__rte_experimental
^
../lib/librte_eal/include/rte_compat.h:18:16: note: expanded from macro '__rte_experimental'
__attribute__((section(".text.experimental")))
               ^
3 errors generated.
[124/2103] Compiling C object 'lib/76b5a35@@rte_ethdev at sta/librte_ethdev_rte_flow.c.o'.
FAILED: lib/76b5a35@@rte_ethdev at sta/librte_ethdev_rte_flow.c.o 
clang -Ilib/76b5a35@@rte_ethdev at sta -Ilib -I../lib -Ilib/librte_ethdev -I../lib/librte_ethdev -I. -I../ -Iconfig -I../config -Ilib/librte_eal/include -I../lib/librte_eal/include -Ilib/librte_eal/linux/include -I../lib/librte_eal/linux/include -Ilib/librte_eal/x86/include -I../lib/librte_eal/x86/include -Ilib/librte_eal/common -I../lib/librte_eal/common -Ilib/librte_eal -I../lib/librte_eal -Ilib/librte_kvargs -I../lib/librte_kvargs -Ilib/librte_telemetry/../librte_metrics -I../lib/librte_telemetry/../librte_metrics -Ilib/librte_telemetry -I../lib/librte_telemetry -Ilib/librte_net -I../lib/librte_net -Ilib/librte_mbuf -I../lib/librte_mbuf -Ilib/librte_mempool -I../lib/librte_mempool -Ilib/librte_ring -I../lib/librte_ring -Ilib/librte_meter -I../lib/librte_meter -Xclang -fcolor-diagnostics -pipe -D_FILE_OFFSET_BITS=64 -Wall -Winvalid-pch -Werror -O2 -g -include rte_config.h -Wextra -Wcast-qual -Wdeprecated -Wformat-nonliteral -Wformat-security -Wmissing-declarations -Wmissing-prototypes -Wnested-externs -Wold-style-definition -Wpointer-arith -Wsign-compare -Wstrict-prototypes -Wundef -Wwrite-strings -Wno-address-of-packed-member -Wno-missing-field-initializers -D_GNU_SOURCE -fPIC -march=native -DALLOW_EXPERIMENTAL_API -DALLOW_INTERNAL_API -MD -MQ 'lib/76b5a35@@rte_ethdev at sta/librte_ethdev_rte_flow.c.o' -MF 'lib/76b5a35@@rte_ethdev at sta/librte_ethdev_rte_flow.c.o.d' -o 'lib/76b5a35@@rte_ethdev at sta/librte_ethdev_rte_flow.c.o' -c ../lib/librte_ethdev/rte_flow.c
In file included from ../lib/librte_ethdev/rte_flow.c:17:
In file included from ../lib/librte_ethdev/rte_ethdev.h:995:
In file included from ../lib/librte_ethdev/rte_eth_ctrl.h:11:
../lib/librte_ethdev/rte_flow.h:3328:1: error: attribute 'section' is ignored, place it after "struct" to apply attribute to type declaration [-Werror,-Wignored-attributes]
__rte_experimental
^
../lib/librte_eal/include/rte_compat.h:18:16: note: expanded from macro '__rte_experimental'
__attribute__((section(".text.experimental")))
               ^
In file included from ../lib/librte_ethdev/rte_flow.c:17:
In file included from ../lib/librte_ethdev/rte_ethdev.h:995:
In file included from ../lib/librte_ethdev/rte_eth_ctrl.h:11:
../lib/librte_ethdev/rte_flow.h:3352:1: error: attribute 'section' is ignored, place it after "struct" to apply attribute to type declaration [-Werror,-Wignored-attributes]
__rte_experimental
^
../lib/librte_eal/include/rte_compat.h:18:16: note: expanded from macro '__rte_experimental'
__attribute__((section(".text.experimental")))
               ^
In file included from ../lib/librte_ethdev/rte_flow.c:17:
In file included from ../lib/librte_ethdev/rte_ethdev.h:995:
In file included from ../lib/librte_ethdev/rte_eth_ctrl.h:11:
../lib/librte_ethdev/rte_flow.h:3382:1: error: attribute 'section' is ignored, place it after "struct" to apply attribute to type declaration [-Werror,-Wignored-attributes]
__rte_experimental
^
../lib/librte_eal/include/rte_compat.h:18:16: note: expanded from macro '__rte_experimental'
__attribute__((section(".text.experimental")))
               ^
3 errors generated.
[125/2103] Generating net.sym_chk with a meson_exe.py custom command.
[126/2103] Generating eal.sym_chk with a meson_exe.py custom command.
ninja: build stopped: subcommand failed




*Meson Build Failed #5:
OS: UB1804-32
Target:./build-gcc-static
FAILED: lib/76b5a35@@rte_ethdev at sta/librte_ethdev_ethdev_private.c.o 
clang -Ilib/76b5a35@@rte_ethdev at sta -Ilib -I../lib -Ilib/librte_ethdev -I../lib/librte_ethdev -I. -I../ -Iconfig -I../config -Ilib/librte_eal/include -I../lib/librte_eal/include -Ilib/librte_eal/linux/include -I../lib/librte_eal/linux/include -Ilib/librte_eal/x86/include -I../lib/librte_eal/x86/include -Ilib/librte_eal/common -I../lib/librte_eal/common -Ilib/librte_eal -I../lib/librte_eal -Ilib/librte_kvargs -I../lib/librte_kvargs -Ilib/librte_telemetry/../librte_metrics -I../lib/librte_telemetry/../librte_metrics -Ilib/librte_telemetry -I../lib/librte_telemetry -Ilib/librte_net -I../lib/librte_net -Ilib/librte_mbuf -I../lib/librte_mbuf -Ilib/librte_mempool -I../lib/librte_mempool -Ilib/librte_ring -I../lib/librte_ring -Ilib/librte_meter -I../lib/librte_meter -Xclang -fcolor-diagnostics -pipe -D_FILE_OFFSET_BITS=64 -Wall -Winvalid-pch -Werror -O2 -g -include rte_config.h -Wextra -Wcast-qual -Wdeprecated -Wformat-nonliteral -Wformat-security -Wmissing-declarations -Wmissing-prototypes -Wnested-externs -Wold-style-definition -Wpointer-arith -Wsign-compare -Wstrict-prototypes -Wundef -Wwrite-strings -Wno-address-of-packed-member -Wno-missing-field-initializers -Wno-pointer-to-int-cast -D_GNU_SOURCE -m32 -fPIC -march=native -DALLOW_EXPERIMENTAL_API -DALLOW_INTERNAL_API -MD -MQ 'lib/76b5a35@@rte_ethdev at sta/librte_ethdev_ethdev_private.c.o' -MF 'lib/76b5a35@@rte_ethdev at sta/librte_ethdev_ethdev_private.c.o.d' -o 'lib/76b5a35@@rte_ethdev at sta/librte_ethdev_ethdev_private.c.o' -c ../lib/librte_ethdev/ethdev_private.c
In file included from ../lib/librte_ethdev/ethdev_private.c:5:
In file included from ../lib/librte_ethdev/rte_ethdev.h:995:
In file included from ../lib/librte_ethdev/rte_eth_ctrl.h:11:
../lib/librte_ethdev/rte_flow.h:3328:1: error: attribute 'section' is ignored, place it after "struct" to apply attribute to type declaration [-Werror,-Wignored-attributes]
__rte_experimental
^
../lib/librte_eal/include/rte_compat.h:18:16: note: expanded from macro '__rte_experimental'
__attribute__((section(".text.experimental")))
               ^
In file included from ../lib/librte_ethdev/ethdev_private.c:5:
In file included from ../lib/librte_ethdev/rte_ethdev.h:995:
In file included from ../lib/librte_ethdev/rte_eth_ctrl.h:11:
../lib/librte_ethdev/rte_flow.h:3352:1: error: attribute 'section' is ignored, place it after "struct" to apply attribute to type declaration [-Werror,-Wignored-attributes]
__rte_experimental
^
../lib/librte_eal/include/rte_compat.h:18:16: note: expanded from macro '__rte_experimental'
__attribute__((section(".text.experimental")))
               ^
In file included from ../lib/librte_ethdev/ethdev_private.c:5:
In file included from ../lib/librte_ethdev/rte_ethdev.h:995:
In file included from ../lib/librte_ethdev/rte_eth_ctrl.h:11:
../lib/librte_ethdev/rte_flow.h:3382:1: error: attribute 'section' is ignored, place it after "struct" to apply attribute to type declaration [-Werror,-Wignored-attributes]
__rte_experimental
^
../lib/librte_eal/include/rte_compat.h:18:16: note: expanded from macro '__rte_experimental'
__attribute__((section(".text.experimental")))
               ^
3 errors generated.
[115/1955] Generating mempool.sym_chk with a meson_exe.py custom command.
[116/1955] Compiling C object 'lib/76b5a35@@rte_ethdev at sta/librte_ethdev_ethdev_profile.c.o'.
FAILED: lib/76b5a35@@rte_ethdev at sta/librte_ethdev_ethdev_profile.c.o 
clang -Ilib/76b5a35@@rte_ethdev at sta -Ilib -I../lib -Ilib/librte_ethdev -I../lib/librte_ethdev -I. -I../ -Iconfig -I../config -Ilib/librte_eal/include -I../lib/librte_eal/include -Ilib/librte_eal/linux/include -I../lib/librte_eal/linux/include -Ilib/librte_eal/x86/include -I../lib/librte_eal/x86/include -Ilib/librte_eal/common -I../lib/librte_eal/common -Ilib/librte_eal -I../lib/librte_eal -Ilib/librte_kvargs -I../lib/librte_kvargs -Ilib/librte_telemetry/../librte_metrics -I../lib/librte_telemetry/../librte_metrics -Ilib/librte_telemetry -I../lib/librte_telemetry -Ilib/librte_net -I../lib/librte_net -Ilib/librte_mbuf -I../lib/librte_mbuf -Ilib/librte_mempool -I../lib/librte_mempool -Ilib/librte_ring -I../lib/librte_ring -Ilib/librte_meter -I../lib/librte_meter -Xclang -fcolor-diagnostics -pipe -D_FILE_OFFSET_BITS=64 -Wall -Winvalid-pch -Werror -O2 -g -include rte_config.h -Wextra -Wcast-qual -Wdeprecated -Wformat-nonliteral -Wformat-security -Wmissing-declarations -Wmissing-prototypes -Wnested-externs -Wold-style-definition -Wpointer-arith -Wsign-compare -Wstrict-prototypes -Wundef -Wwrite-strings -Wno-address-of-packed-member -Wno-missing-field-initializers -Wno-pointer-to-int-cast -D_GNU_SOURCE -m32 -fPIC -march=native -DALLOW_EXPERIMENTAL_API -DALLOW_INTERNAL_API -MD -MQ 'lib/76b5a35@@rte_ethdev at sta/librte_ethdev_ethdev_profile.c.o' -MF 'lib/76b5a35@@rte_ethdev at sta/librte_ethdev_ethdev_profile.c.o.d' -o 'lib/76b5a35@@rte_ethdev at sta/librte_ethdev_ethdev_profile.c.o' -c ../lib/librte_ethdev/ethdev_profile.c
In file included from ../lib/librte_ethdev/ethdev_profile.c:5:
In file included from ../lib/librte_ethdev/ethdev_profile.h:8:
In file included from ../lib/librte_ethdev/rte_ethdev.h:995:
In file included from ../lib/librte_ethdev/rte_eth_ctrl.h:11:
../lib/librte_ethdev/rte_flow.h:3328:1: error: attribute 'section' is ignored, place it after "struct" to apply attribute to type declaration [-Werror,-Wignored-attributes]
__rte_experimental
^
../lib/librte_eal/include/rte_compat.h:18:16: note: expanded from macro '__rte_experimental'
__attribute__((section(".text.experimental")))
               ^
In file included from ../lib/librte_ethdev/ethdev_profile.c:5:
In file included from ../lib/librte_ethdev/ethdev_profile.h:8:
In file included from ../lib/librte_ethdev/rte_ethdev.h:995:
In file included from ../lib/librte_ethdev/rte_eth_ctrl.h:11:
../lib/librte_ethdev/rte_flow.h:3352:1: error: attribute 'section' is ignored, place it after "struct" to apply attribute to type declaration [-Werror,-Wignored-attributes]
__rte_experimental
^
../lib/librte_eal/include/rte_compat.h:18:16: note: expanded from macro '__rte_experimental'
__attribute__((section(".text.experimental")))
               ^
In file included from ../lib/librte_ethdev/ethdev_profile.c:5:
In file included from ../lib/librte_ethdev/ethdev_profile.h:8:
In file included from ../lib/librte_ethdev/rte_ethdev.h:995:
In file included from ../lib/librte_ethdev/rte_eth_ctrl.h:11:
../lib/librte_ethdev/rte_flow.h:3382:1: error: attribute 'section' is ignored, place it after "struct" to apply attribute to type declaration [-Werror,-Wignored-attributes]
__rte_experimental
^
../lib/librte_eal/include/rte_compat.h:18:16: note: expanded from macro '__rte_experimental'
__attribute__((section(".text.experimental")))
               ^
3 errors generated.
[117/1955] Generating meter.sym_chk with a meson_exe.py custom command.
[118/1955] Compiling C object 'lib/76b5a35@@rte_ethdev at sta/librte_ethdev_rte_class_eth.c.o'.
FAILED: lib/76b5a35@@rte_ethdev at sta/librte_ethdev_rte_class_eth.c.o 
clang -Ilib/76b5a35@@rte_ethdev at sta -Ilib -I../lib -Ilib/librte_ethdev -I../lib/librte_ethdev -I. -I../ -Iconfig -I../config -Ilib/librte_eal/include -I../lib/librte_eal/include -Ilib/librte_eal/linux/include -I../lib/librte_eal/linux/include -Ilib/librte_eal/x86/include -I../lib/librte_eal/x86/include -Ilib/librte_eal/common -I../lib/librte_eal/common -Ilib/librte_eal -I../lib/librte_eal -Ilib/librte_kvargs -I../lib/librte_kvargs -Ilib/librte_telemetry/../librte_metrics -I../lib/librte_telemetry/../librte_metrics -Ilib/librte_telemetry -I../lib/librte_telemetry -Ilib/librte_net -I../lib/librte_net -Ilib/librte_mbuf -I../lib/librte_mbuf -Ilib/librte_mempool -I../lib/librte_mempool -Ilib/librte_ring -I../lib/librte_ring -Ilib/librte_meter -I../lib/librte_meter -Xclang -fcolor-diagnostics -pipe -D_FILE_OFFSET_BITS=64 -Wall -Winvalid-pch -Werror -O2 -g -include rte_config.h -Wextra -Wcast-qual -Wdeprecated -Wformat-nonliteral -Wformat-security -Wmissing-declarations -Wmissing-prototypes -Wnested-externs -Wold-style-definition -Wpointer-arith -Wsign-compare -Wstrict-prototypes -Wundef -Wwrite-strings -Wno-address-of-packed-member -Wno-missing-field-initializers -Wno-pointer-to-int-cast -D_GNU_SOURCE -m32 -fPIC -march=native -DALLOW_EXPERIMENTAL_API -DALLOW_INTERNAL_API -MD -MQ 'lib/76b5a35@@rte_ethdev at sta/librte_ethdev_rte_class_eth.c.o' -MF 'lib/76b5a35@@rte_ethdev at sta/librte_ethdev_rte_class_eth.c.o.d' -o 'lib/76b5a35@@rte_ethdev at sta/librte_ethdev_rte_class_eth.c.o' -c ../lib/librte_ethdev/rte_class_eth.c
In file included from ../lib/librte_ethdev/rte_class_eth.c:13:
In file included from ../lib/librte_ethdev/rte_ethdev.h:995:
In file included from ../lib/librte_ethdev/rte_eth_ctrl.h:11:
../lib/librte_ethdev/rte_flow.h:3328:1: error: attribute 'section' is ignored, place it after "struct" to apply attribute to type declaration [-Werror,-Wignored-attributes]
__rte_experimental
^
../lib/librte_eal/include/rte_compat.h:18:16: note: expanded from macro '__rte_experimental'
__attribute__((section(".text.experimental")))
               ^
In file included from ../lib/librte_ethdev/rte_class_eth.c:13:
In file included from ../lib/librte_ethdev/rte_ethdev.h:995:
In file included from ../lib/librte_ethdev/rte_eth_ctrl.h:11:
../lib/librte_ethdev/rte_flow.h:3352:1: error: attribute 'section' is ignored, place it after "struct" to apply attribute to type declaration [-Werror,-Wignored-attributes]
__rte_experimental
^
../lib/librte_eal/include/rte_compat.h:18:16: note: expanded from macro '__rte_experimental'
__attribute__((section(".text.experimental")))
               ^
In file included from ../lib/librte_ethdev/rte_class_eth.c:13:
In file included from ../lib/librte_ethdev/rte_ethdev.h:995:
In file included from ../lib/librte_ethdev/rte_eth_ctrl.h:11:
../lib/librte_ethdev/rte_flow.h:3382:1: error: attribute 'section' is ignored, place it after "struct" to apply attribute to type declaration [-Werror,-Wignored-attributes]
__rte_experimental
^
../lib/librte_eal/include/rte_compat.h:18:16: note: expanded from macro '__rte_experimental'
__attribute__((section(".text.experimental")))
               ^
3 errors generated.
[119/1955] Compiling C object 'lib/76b5a35@@rte_ethdev at sta/librte_ethdev_ethdev_trace_points.c.o'.
FAILED: lib/76b5a35@@rte_ethdev at sta/librte_ethdev_ethdev_trace_points.c.o 
clang -Ilib/76b5a35@@rte_ethdev at sta -Ilib -I../lib -Ilib/librte_ethdev -I../lib/librte_ethdev -I. -I../ -Iconfig -I../config -Ilib/librte_eal/include -I../lib/librte_eal/include -Ilib/librte_eal/linux/include -I../lib/librte_eal/linux/include -Ilib/librte_eal/x86/include -I../lib/librte_eal/x86/include -Ilib/librte_eal/common -I../lib/librte_eal/common -Ilib/librte_eal -I../lib/librte_eal -Ilib/librte_kvargs -I../lib/librte_kvargs -Ilib/librte_telemetry/../librte_metrics -I../lib/librte_telemetry/../librte_metrics -Ilib/librte_telemetry -I../lib/librte_telemetry -Ilib/librte_net -I../lib/librte_net -Ilib/librte_mbuf -I../lib/librte_mbuf -Ilib/librte_mempool -I../lib/librte_mempool -Ilib/librte_ring -I../lib/librte_ring -Ilib/librte_meter -I../lib/librte_meter -Xclang -fcolor-diagnostics -pipe -D_FILE_OFFSET_BITS=64 -Wall -Winvalid-pch -Werror -O2 -g -include rte_config.h -Wextra -Wcast-qual -Wdeprecated -Wformat-nonliteral -Wformat-security -Wmissing-declarations -Wmissing-prototypes -Wnested-externs -Wold-style-definition -Wpointer-arith -Wsign-compare -Wstrict-prototypes -Wundef -Wwrite-strings -Wno-address-of-packed-member -Wno-missing-field-initializers -Wno-pointer-to-int-cast -D_GNU_SOURCE -m32 -fPIC -march=native -DALLOW_EXPERIMENTAL_API -DALLOW_INTERNAL_API -MD -MQ 'lib/76b5a35@@rte_ethdev at sta/librte_ethdev_ethdev_trace_points.c.o' -MF 'lib/76b5a35@@rte_ethdev at sta/librte_ethdev_ethdev_trace_points.c.o.d' -o 'lib/76b5a35@@rte_ethdev at sta/librte_ethdev_ethdev_trace_points.c.o' -c ../lib/librte_ethdev/ethdev_trace_points.c
In file included from ../lib/librte_ethdev/ethdev_trace_points.c:7:
In file included from ../lib/librte_ethdev/rte_ethdev_trace.h:20:
In file included from ../lib/librte_ethdev/rte_ethdev.h:995:
In file included from ../lib/librte_ethdev/rte_eth_ctrl.h:11:
../lib/librte_ethdev/rte_flow.h:3328:1: error: attribute 'section' is ignored, place it after "struct" to apply attribute to type declaration [-Werror,-Wignored-attributes]
__rte_experimental
^
../lib/librte_eal/include/rte_compat.h:18:16: note: expanded from macro '__rte_experimental'
__attribute__((section(".text.experimental")))
               ^
In file included from ../lib/librte_ethdev/ethdev_trace_points.c:7:
In file included from ../lib/librte_ethdev/rte_ethdev_trace.h:20:
In file included from ../lib/librte_ethdev/rte_ethdev.h:995:
In file included from ../lib/librte_ethdev/rte_eth_ctrl.h:11:
../lib/librte_ethdev/rte_flow.h:3352:1: error: attribute 'section' is ignored, place it after "struct" to apply attribute to type declaration [-Werror,-Wignored-attributes]
__rte_experimental
^
../lib/librte_eal/include/rte_compat.h:18:16: note: expanded from macro '__rte_experimental'
__attribute__((section(".text.experimental")))
               ^
In file included from ../lib/librte_ethdev/ethdev_trace_points.c:7:
In file included from ../lib/librte_ethdev/rte_ethdev_trace.h:20:
In file included from ../lib/librte_ethdev/rte_ethdev.h:995:
In file included from ../lib/librte_ethdev/rte_eth_ctrl.h:11:
../lib/librte_ethdev/rte_flow.h:3382:1: error: attribute 'section' is ignored, place it after "struct" to apply attribute to type declaration [-Werror,-Wignored-attributes]
__rte_experimental
^
../lib/librte_eal/include/rte_compat.h:18:16: note: expanded from macro '__rte_experimental'
__attribute__((section(".text.experimental")))
               ^
3 errors generated.
[120/1955] Generating net.sym_chk with a meson_exe.py custom command.
[121/1955] Compiling C object 'lib/76b5a35@@rte_ethdev at sta/librte_ethdev_rte_flow.c.o'.
FAILED: lib/76b5a35@@rte_ethdev at sta/librte_ethdev_rte_flow.c.o 
clang -Ilib/76b5a35@@rte_ethdev at sta -Ilib -I../lib -Ilib/librte_ethdev -I../lib/librte_ethdev -I. -I../ -Iconfig -I../config -Ilib/librte_eal/include -I../lib/librte_eal/include -Ilib/librte_eal/linux/include -I../lib/librte_eal/linux/include -Ilib/librte_eal/x86/include -I../lib/librte_eal/x86/include -Ilib/librte_eal/common -I../lib/librte_eal/common -Ilib/librte_eal -I../lib/librte_eal -Ilib/librte_kvargs -I../lib/librte_kvargs -Ilib/librte_telemetry/../librte_metrics -I../lib/librte_telemetry/../librte_metrics -Ilib/librte_telemetry -I../lib/librte_telemetry -Ilib/librte_net -I../lib/librte_net -Ilib/librte_mbuf -I../lib/librte_mbuf -Ilib/librte_mempool -I../lib/librte_mempool -Ilib/librte_ring -I../lib/librte_ring -Ilib/librte_meter -I../lib/librte_meter -Xclang -fcolor-diagnostics -pipe -D_FILE_OFFSET_BITS=64 -Wall -Winvalid-pch -Werror -O2 -g -include rte_config.h -Wextra -Wcast-qual -Wdeprecated -Wformat-nonliteral -Wformat-security -Wmissing-declarations -Wmissing-prototypes -Wnested-externs -Wold-style-definition -Wpointer-arith -Wsign-compare -Wstrict-prototypes -Wundef -Wwrite-strings -Wno-address-of-packed-member -Wno-missing-field-initializers -Wno-pointer-to-int-cast -D_GNU_SOURCE -m32 -fPIC -march=native -DALLOW_EXPERIMENTAL_API -DALLOW_INTERNAL_API -MD -MQ 'lib/76b5a35@@rte_ethdev at sta/librte_ethdev_rte_flow.c.o' -MF 'lib/76b5a35@@rte_ethdev at sta/librte_ethdev_rte_flow.c.o.d' -o 'lib/76b5a35@@rte_ethdev at sta/librte_ethdev_rte_flow.c.o' -c ../lib/librte_ethdev/rte_flow.c
In file included from ../lib/librte_ethdev/rte_flow.c:17:
In file included from ../lib/librte_ethdev/rte_ethdev.h:995:
In file included from ../lib/librte_ethdev/rte_eth_ctrl.h:11:
../lib/librte_ethdev/rte_flow.h:3328:1: error: attribute 'section' is ignored, place it after "struct" to apply attribute to type declaration [-Werror,-Wignored-attributes]
__rte_experimental
^
../lib/librte_eal/include/rte_compat.h:18:16: note: expanded from macro '__rte_experimental'
__attribute__((section(".text.experimental")))
               ^
In file included from ../lib/librte_ethdev/rte_flow.c:17:
In file included from ../lib/librte_ethdev/rte_ethdev.h:995:
In file included from ../lib/librte_ethdev/rte_eth_ctrl.h:11:
../lib/librte_ethdev/rte_flow.h:3352:1: error: attribute 'section' is ignored, place it after "struct" to apply attribute to type declaration [-Werror,-Wignored-attributes]
__rte_experimental
^
../lib/librte_eal/include/rte_compat.h:18:16: note: expanded from macro '__rte_experimental'
__attribute__((section(".text.experimental")))
               ^
In file included from ../lib/librte_ethdev/rte_flow.c:17:
In file included from ../lib/librte_ethdev/rte_ethdev.h:995:
In file included from ../lib/librte_ethdev/rte_eth_ctrl.h:11:
../lib/librte_ethdev/rte_flow.h:3382:1: error: attribute 'section' is ignored, place it after "struct" to apply attribute to type declaration [-Werror,-Wignored-attributes]
__rte_experimental
^
../lib/librte_eal/include/rte_compat.h:18:16: note: expanded from macro '__rte_experimental'
__attribute__((section(".text.experimental")))
               ^
3 errors generated.
[122/1955] Generating mbuf.sym_chk with a meson_exe.py custom command.
[123/1955] Compiling C object 'lib/76b5a35@@rte_ethdev at sta/librte_ethdev_rte_mtr.c.o'.
FAILED: lib/76b5a35@@rte_ethdev at sta/librte_ethdev_rte_mtr.c.o 
clang -Ilib/76b5a35@@rte_ethdev at sta -Ilib -I../lib -Ilib/librte_ethdev -I../lib/librte_ethdev -I. -I../ -Iconfig -I../config -Ilib/librte_eal/include -I../lib/librte_eal/include -Ilib/librte_eal/linux/include -I../lib/librte_eal/linux/include -Ilib/librte_eal/x86/include -I../lib/librte_eal/x86/include -Ilib/librte_eal/common -I../lib/librte_eal/common -Ilib/librte_eal -I../lib/librte_eal -Ilib/librte_kvargs -I../lib/librte_kvargs -Ilib/librte_telemetry/../librte_metrics -I../lib/librte_telemetry/../librte_metrics -Ilib/librte_telemetry -I../lib/librte_telemetry -Ilib/librte_net -I../lib/librte_net -Ilib/librte_mbuf -I../lib/librte_mbuf -Ilib/librte_mempool -I../lib/librte_mempool -Ilib/librte_ring -I../lib/librte_ring -Ilib/librte_meter -I../lib/librte_meter -Xclang -fcolor-diagnostics -pipe -D_FILE_OFFSET_BITS=64 -Wall -Winvalid-pch -Werror -O2 -g -include rte_config.h -Wextra -Wcast-qual -Wdeprecated -Wformat-nonliteral -Wformat-security -Wmissing-declarations -Wmissing-prototypes -Wnested-externs -Wold-style-definition -Wpointer-arith -Wsign-compare -Wstrict-prototypes -Wundef -Wwrite-strings -Wno-address-of-packed-member -Wno-missing-field-initializers -Wno-pointer-to-int-cast -D_GNU_SOURCE -m32 -fPIC -march=native -DALLOW_EXPERIMENTAL_API -DALLOW_INTERNAL_API -MD -MQ 'lib/76b5a35@@rte_ethdev at sta/librte_ethdev_rte_mtr.c.o' -MF 'lib/76b5a35@@rte_ethdev at sta/librte_ethdev_rte_mtr.c.o.d' -o 'lib/76b5a35@@rte_ethdev at sta/librte_ethdev_rte_mtr.c.o' -c ../lib/librte_ethdev/rte_mtr.c
In file included from ../lib/librte_ethdev/rte_mtr.c:9:
In file included from ../lib/librte_ethdev/rte_ethdev.h:995:
In file included from ../lib/librte_ethdev/rte_eth_ctrl.h:11:
../lib/librte_ethdev/rte_flow.h:3328:1: error: attribute 'section' is ignored, place it after "struct" to apply attribute to type declaration [-Werror,-Wignored-attributes]
__rte_experimental
^
../lib/librte_eal/include/rte_compat.h:18:16: note: expanded from macro '__rte_experimental'
__attribute__((section(".text.experimental")))
               ^
In file included from ../lib/librte_ethdev/rte_mtr.c:9:
In file included from ../lib/librte_ethdev/rte_ethdev.h:995:
In file included from ../lib/librte_ethdev/rte_eth_ctrl.h:11:
../lib/librte_ethdev/rte_flow.h:3352:1: error: attribute 'section' is ignored, place it after "struct" to apply attribute to type declaration [-Werror,-Wignored-attributes]
__rte_experimental
^
../lib/librte_eal/include/rte_compat.h:18:16: note: expanded from macro '__rte_experimental'
__attribute__((section(".text.experimental")))
               ^
In file included from ../lib/librte_ethdev/rte_mtr.c:9:
In file included from ../lib/librte_ethdev/rte_ethdev.h:995:
In file included from ../lib/librte_ethdev/rte_eth_ctrl.h:11:
../lib/librte_ethdev/rte_flow.h:3382:1: error: attribute 'section' is ignored, place it after "struct" to apply attribute to type declaration [-Werror,-Wignored-attributes]
__rte_experimental
^
../lib/librte_eal/include/rte_compat.h:18:16: note: expanded from macro '__rte_experimental'
__attribute__((section(".text.experimental")))
               ^
3 errors generated.
[124/1955] Compiling C object 'lib/76b5a35@@rte_ethdev at sta/librte_ethdev_rte_ethdev.c.o'.
FAILED: lib/76b5a35@@rte_ethdev at sta/librte_ethdev_rte_ethdev.c.o 
clang -Ilib/76b5a35@@rte_ethdev at sta -Ilib -I../lib -Ilib/librte_ethdev -I../lib/librte_ethdev -I. -I../ -Iconfig -I../config -Ilib/librte_eal/include -I../lib/librte_eal/include -Ilib/librte_eal/linux/include -I../lib/librte_eal/linux/include -Ilib/librte_eal/x86/include -I../lib/librte_eal/x86/include -Ilib/librte_eal/common -I../lib/librte_eal/common -Ilib/librte_eal -I../lib/librte_eal -Ilib/librte_kvargs -I../lib/librte_kvargs -Ilib/librte_telemetry/../librte_metrics -I../lib/librte_telemetry/../librte_metrics -Ilib/librte_telemetry -I../lib/librte_telemetry -Ilib/librte_net -I../lib/librte_net -Ilib/librte_mbuf -I../lib/librte_mbuf -Ilib/librte_mempool -I../lib/librte_mempool -Ilib/librte_ring -I../lib/librte_ring -Ilib/librte_meter -I../lib/librte_meter -Xclang -fcolor-diagnostics -pipe -D_FILE_OFFSET_BITS=64 -Wall -Winvalid-pch -Werror -O2 -g -include rte_config.h -Wextra -Wcast-qual -Wdeprecated -Wformat-nonliteral -Wformat-security -Wmissing-declarations -Wmissing-prototypes -Wnested-externs -Wold-style-definition -Wpointer-arith -Wsign-compare -Wstrict-prototypes -Wundef -Wwrite-strings -Wno-address-of-packed-member -Wno-missing-field-initializers -Wno-pointer-to-int-cast -D_GNU_SOURCE -m32 -fPIC -march=native -DALLOW_EXPERIMENTAL_API -DALLOW_INTERNAL_API -MD -MQ 'lib/76b5a35@@rte_ethdev at sta/librte_ethdev_rte_ethdev.c.o' -MF 'lib/76b5a35@@rte_ethdev at sta/librte_ethdev_rte_ethdev.c.o.d' -o 'lib/76b5a35@@rte_ethdev at sta/librte_ethdev_rte_ethdev.c.o' -c ../lib/librte_ethdev/rte_ethdev.c
In file included from ../lib/librte_ethdev/rte_ethdev.c:43:
In file included from ../lib/librte_ethdev/rte_ethdev_trace.h:20:
In file included from ../lib/librte_ethdev/rte_ethdev.h:995:
In file included from ../lib/librte_ethdev/rte_eth_ctrl.h:11:
../lib/librte_ethdev/rte_flow.h:3328:1: error: attribute 'section' is ignored, place it after "struct" to apply attribute to type declaration [-Werror,-Wignored-attributes]
__rte_experimental
^
../lib/librte_eal/include/rte_compat.h:18:16: note: expanded from macro '__rte_experimental'
__attribute__((section(".text.experimental")))
               ^
In file included from ../lib/librte_ethdev/rte_ethdev.c:43:
In file included from ../lib/librte_ethdev/rte_ethdev_trace.h:20:
In file included from ../lib/librte_ethdev/rte_ethdev.h:995:
In file included from ../lib/librte_ethdev/rte_eth_ctrl.h:11:
../lib/librte_ethdev/rte_flow.h:3352:1: error: attribute 'section' is ignored, place it after "struct" to apply attribute to type declaration [-Werror,-Wignored-attributes]
__rte_experimental
^
../lib/librte_eal/include/rte_compat.h:18:16: note: expanded from macro '__rte_experimental'
__attribute__((section(".text.experimental")))
               ^
In file included from ../lib/librte_ethdev/rte_ethdev.c:43:
In file included from ../lib/librte_ethdev/rte_ethdev_trace.h:20:
In file included from ../lib/librte_ethdev/rte_ethdev.h:995:
In file included from ../lib/librte_ethdev/rte_eth_ctrl.h:11:
../lib/librte_ethdev/rte_flow.h:3382:1: error: attribute 'section' is ignored, place it after "struct" to apply attribute to type declaration [-Werror,-Wignored-attributes]
__rte_experimental
^
../lib/librte_eal/include/rte_compat.h:18:16: note: expanded from macro '__rte_experimental'
__attribute__((section(".text.experimental")))
               ^
3 errors generated.
[125/1955] Generating eal.sym_chk with a meson_exe.py custom command.
ninja: build stopped: subcommand failed




*Meson Build Failed #6:
OS: UB2004-64
Target:./build-gcc-static
FAILED: lib/76b5a35@@rte_ethdev at sta/librte_ethdev_ethdev_private.c.o 
clang -Ilib/76b5a35@@rte_ethdev at sta -Ilib -I../lib -Ilib/librte_ethdev -I../lib/librte_ethdev -I. -I../ -Iconfig -I../config -Ilib/librte_eal/include -I../lib/librte_eal/include -Ilib/librte_eal/linux/include -I../lib/librte_eal/linux/include -Ilib/librte_eal/x86/include -I../lib/librte_eal/x86/include -Ilib/librte_eal/common -I../lib/librte_eal/common -Ilib/librte_eal -I../lib/librte_eal -Ilib/librte_kvargs -I../lib/librte_kvargs -Ilib/librte_telemetry/../librte_metrics -I../lib/librte_telemetry/../librte_metrics -Ilib/librte_telemetry -I../lib/librte_telemetry -Ilib/librte_net -I../lib/librte_net -Ilib/librte_mbuf -I../lib/librte_mbuf -Ilib/librte_mempool -I../lib/librte_mempool -Ilib/librte_ring -I../lib/librte_ring -Ilib/librte_meter -I../lib/librte_meter -Xclang -fcolor-diagnostics -pipe -D_FILE_OFFSET_BITS=64 -Wall -Winvalid-pch -Werror -O2 -g -include rte_config.h -Wextra -Wcast-qual -Wdeprecated -Wformat-nonliteral -Wformat-security -Wmissing-declarations -Wmissing-prototypes -Wnested-externs -Wold-style-definition -Wpointer-arith -Wsign-compare -Wstrict-prototypes -Wundef -Wwrite-strings -Wno-address-of-packed-member -Wno-missing-field-initializers -D_GNU_SOURCE -fPIC -march=native -DALLOW_EXPERIMENTAL_API -DALLOW_INTERNAL_API -MD -MQ 'lib/76b5a35@@rte_ethdev at sta/librte_ethdev_ethdev_private.c.o' -MF 'lib/76b5a35@@rte_ethdev at sta/librte_ethdev_ethdev_private.c.o.d' -o 'lib/76b5a35@@rte_ethdev at sta/librte_ethdev_ethdev_private.c.o' -c ../lib/librte_ethdev/ethdev_private.c
In file included from ../lib/librte_ethdev/ethdev_private.c:5:
In file included from ../lib/librte_ethdev/rte_ethdev.h:995:
In file included from ../lib/librte_ethdev/rte_eth_ctrl.h:11:
../lib/librte_ethdev/rte_flow.h:3328:1: error: attribute 'section' is ignored, place it after "struct" to apply attribute to type declaration [-Werror,-Wignored-attributes]
__rte_experimental
^
../lib/librte_eal/include/rte_compat.h:18:16: note: expanded from macro '__rte_experimental'
__attribute__((section(".text.experimental")))
               ^
In file included from ../lib/librte_ethdev/ethdev_private.c:5:
In file included from ../lib/librte_ethdev/rte_ethdev.h:995:
In file included from ../lib/librte_ethdev/rte_eth_ctrl.h:11:
../lib/librte_ethdev/rte_flow.h:3352:1: error: attribute 'section' is ignored, place it after "struct" to apply attribute to type declaration [-Werror,-Wignored-attributes]
__rte_experimental
^
../lib/librte_eal/include/rte_compat.h:18:16: note: expanded from macro '__rte_experimental'
__attribute__((section(".text.experimental")))
               ^
In file included from ../lib/librte_ethdev/ethdev_private.c:5:
In file included from ../lib/librte_ethdev/rte_ethdev.h:995:
In file included from ../lib/librte_ethdev/rte_eth_ctrl.h:11:
../lib/librte_ethdev/rte_flow.h:3382:1: error: attribute 'section' is ignored, place it after "struct" to apply attribute to type declaration [-Werror,-Wignored-attributes]
__rte_experimental
^
../lib/librte_eal/include/rte_compat.h:18:16: note: expanded from macro '__rte_experimental'
__attribute__((section(".text.experimental")))
               ^
3 errors generated.
[115/2191] Generating mempool.sym_chk with a meson_exe.py custom command.
[116/2191] Compiling C object 'lib/76b5a35@@rte_net at sta/librte_net_rte_net.c.o'.
[117/2191] Generating mbuf.sym_chk with a meson_exe.py custom command.
[118/2191] Compiling C object 'lib/76b5a35@@rte_ethdev at sta/librte_ethdev_ethdev_profile.c.o'.
FAILED: lib/76b5a35@@rte_ethdev at sta/librte_ethdev_ethdev_profile.c.o 
clang -Ilib/76b5a35@@rte_ethdev at sta -Ilib -I../lib -Ilib/librte_ethdev -I../lib/librte_ethdev -I. -I../ -Iconfig -I../config -Ilib/librte_eal/include -I../lib/librte_eal/include -Ilib/librte_eal/linux/include -I../lib/librte_eal/linux/include -Ilib/librte_eal/x86/include -I../lib/librte_eal/x86/include -Ilib/librte_eal/common -I../lib/librte_eal/common -Ilib/librte_eal -I../lib/librte_eal -Ilib/librte_kvargs -I../lib/librte_kvargs -Ilib/librte_telemetry/../librte_metrics -I../lib/librte_telemetry/../librte_metrics -Ilib/librte_telemetry -I../lib/librte_telemetry -Ilib/librte_net -I../lib/librte_net -Ilib/librte_mbuf -I../lib/librte_mbuf -Ilib/librte_mempool -I../lib/librte_mempool -Ilib/librte_ring -I../lib/librte_ring -Ilib/librte_meter -I../lib/librte_meter -Xclang -fcolor-diagnostics -pipe -D_FILE_OFFSET_BITS=64 -Wall -Winvalid-pch -Werror -O2 -g -include rte_config.h -Wextra -Wcast-qual -Wdeprecated -Wformat-nonliteral -Wformat-security -Wmissing-declarations -Wmissing-prototypes -Wnested-externs -Wold-style-definition -Wpointer-arith -Wsign-compare -Wstrict-prototypes -Wundef -Wwrite-strings -Wno-address-of-packed-member -Wno-missing-field-initializers -D_GNU_SOURCE -fPIC -march=native -DALLOW_EXPERIMENTAL_API -DALLOW_INTERNAL_API -MD -MQ 'lib/76b5a35@@rte_ethdev at sta/librte_ethdev_ethdev_profile.c.o' -MF 'lib/76b5a35@@rte_ethdev at sta/librte_ethdev_ethdev_profile.c.o.d' -o 'lib/76b5a35@@rte_ethdev at sta/librte_ethdev_ethdev_profile.c.o' -c ../lib/librte_ethdev/ethdev_profile.c
In file included from ../lib/librte_ethdev/ethdev_profile.c:5:
In file included from ../lib/librte_ethdev/ethdev_profile.h:8:
In file included from ../lib/librte_ethdev/rte_ethdev.h:995:
In file included from ../lib/librte_ethdev/rte_eth_ctrl.h:11:
../lib/librte_ethdev/rte_flow.h:3328:1: error: attribute 'section' is ignored, place it after "struct" to apply attribute to type declaration [-Werror,-Wignored-attributes]
__rte_experimental
^
../lib/librte_eal/include/rte_compat.h:18:16: note: expanded from macro '__rte_experimental'
__attribute__((section(".text.experimental")))
               ^
In file included from ../lib/librte_ethdev/ethdev_profile.c:5:
In file included from ../lib/librte_ethdev/ethdev_profile.h:8:
In file included from ../lib/librte_ethdev/rte_ethdev.h:995:
In file included from ../lib/librte_ethdev/rte_eth_ctrl.h:11:
../lib/librte_ethdev/rte_flow.h:3352:1: error: attribute 'section' is ignored, place it after "struct" to apply attribute to type declaration [-Werror,-Wignored-attributes]
__rte_experimental
^
../lib/librte_eal/include/rte_compat.h:18:16: note: expanded from macro '__rte_experimental'
__attribute__((section(".text.experimental")))
               ^
In file included from ../lib/librte_ethdev/ethdev_profile.c:5:
In file included from ../lib/librte_ethdev/ethdev_profile.h:8:
In file included from ../lib/librte_ethdev/rte_ethdev.h:995:
In file included from ../lib/librte_ethdev/rte_eth_ctrl.h:11:
../lib/librte_ethdev/rte_flow.h:3382:1: error: attribute 'section' is ignored, place it after "struct" to apply attribute to type declaration [-Werror,-Wignored-attributes]
__rte_experimental
^
../lib/librte_eal/include/rte_compat.h:18:16: note: expanded from macro '__rte_experimental'
__attribute__((section(".text.experimental")))
               ^
3 errors generated.
[119/2191] Compiling C object 'lib/76b5a35@@rte_ethdev at sta/librte_ethdev_rte_class_eth.c.o'.
FAILED: lib/76b5a35@@rte_ethdev at sta/librte_ethdev_rte_class_eth.c.o 
clang -Ilib/76b5a35@@rte_ethdev at sta -Ilib -I../lib -Ilib/librte_ethdev -I../lib/librte_ethdev -I. -I../ -Iconfig -I../config -Ilib/librte_eal/include -I../lib/librte_eal/include -Ilib/librte_eal/linux/include -I../lib/librte_eal/linux/include -Ilib/librte_eal/x86/include -I../lib/librte_eal/x86/include -Ilib/librte_eal/common -I../lib/librte_eal/common -Ilib/librte_eal -I../lib/librte_eal -Ilib/librte_kvargs -I../lib/librte_kvargs -Ilib/librte_telemetry/../librte_metrics -I../lib/librte_telemetry/../librte_metrics -Ilib/librte_telemetry -I../lib/librte_telemetry -Ilib/librte_net -I../lib/librte_net -Ilib/librte_mbuf -I../lib/librte_mbuf -Ilib/librte_mempool -I../lib/librte_mempool -Ilib/librte_ring -I../lib/librte_ring -Ilib/librte_meter -I../lib/librte_meter -Xclang -fcolor-diagnostics -pipe -D_FILE_OFFSET_BITS=64 -Wall -Winvalid-pch -Werror -O2 -g -include rte_config.h -Wextra -Wcast-qual -Wdeprecated -Wformat-nonliteral -Wformat-security -Wmissing-declarations -Wmissing-prototypes -Wnested-externs -Wold-style-definition -Wpointer-arith -Wsign-compare -Wstrict-prototypes -Wundef -Wwrite-strings -Wno-address-of-packed-member -Wno-missing-field-initializers -D_GNU_SOURCE -fPIC -march=native -DALLOW_EXPERIMENTAL_API -DALLOW_INTERNAL_API -MD -MQ 'lib/76b5a35@@rte_ethdev at sta/librte_ethdev_rte_class_eth.c.o' -MF 'lib/76b5a35@@rte_ethdev at sta/librte_ethdev_rte_class_eth.c.o.d' -o 'lib/76b5a35@@rte_ethdev at sta/librte_ethdev_rte_class_eth.c.o' -c ../lib/librte_ethdev/rte_class_eth.c
In file included from ../lib/librte_ethdev/rte_class_eth.c:13:
In file included from ../lib/librte_ethdev/rte_ethdev.h:995:
In file included from ../lib/librte_ethdev/rte_eth_ctrl.h:11:
../lib/librte_ethdev/rte_flow.h:3328:1: error: attribute 'section' is ignored, place it after "struct" to apply attribute to type declaration [-Werror,-Wignored-attributes]
__rte_experimental
^
../lib/librte_eal/include/rte_compat.h:18:16: note: expanded from macro '__rte_experimental'
__attribute__((section(".text.experimental")))
               ^
In file included from ../lib/librte_ethdev/rte_class_eth.c:13:
In file included from ../lib/librte_ethdev/rte_ethdev.h:995:
In file included from ../lib/librte_ethdev/rte_eth_ctrl.h:11:
../lib/librte_ethdev/rte_flow.h:3352:1: error: attribute 'section' is ignored, place it after "struct" to apply attribute to type declaration [-Werror,-Wignored-attributes]
__rte_experimental
^
../lib/librte_eal/include/rte_compat.h:18:16: note: expanded from macro '__rte_experimental'
__attribute__((section(".text.experimental")))
               ^
In file included from ../lib/librte_ethdev/rte_class_eth.c:13:
In file included from ../lib/librte_ethdev/rte_ethdev.h:995:
In file included from ../lib/librte_ethdev/rte_eth_ctrl.h:11:
../lib/librte_ethdev/rte_flow.h:3382:1: error: attribute 'section' is ignored, place it after "struct" to apply attribute to type declaration [-Werror,-Wignored-attributes]
__rte_experimental
^
../lib/librte_eal/include/rte_compat.h:18:16: note: expanded from macro '__rte_experimental'
__attribute__((section(".text.experimental")))
               ^
3 errors generated.
[120/2191] Compiling C object 'lib/76b5a35@@rte_bitratestats at sta/librte_bitratestats_rte_bitrate.c.o'.
FAILED: lib/76b5a35@@rte_bitratestats at sta/librte_bitratestats_rte_bitrate.c.o 
clang -Ilib/76b5a35@@rte_bitratestats at sta -Ilib -I../lib -Ilib/librte_bitratestats -I../lib/librte_bitratestats -I. -I../ -Iconfig -I../config -Ilib/librte_eal/include -I../lib/librte_eal/include -Ilib/librte_eal/linux/include -I../lib/librte_eal/linux/include -Ilib/librte_eal/x86/include -I../lib/librte_eal/x86/include -Ilib/librte_eal/common -I../lib/librte_eal/common -Ilib/librte_eal -I../lib/librte_eal -Ilib/librte_kvargs -I../lib/librte_kvargs -Ilib/librte_telemetry/../librte_metrics -I../lib/librte_telemetry/../librte_metrics -Ilib/librte_telemetry -I../lib/librte_telemetry -Ilib/librte_ethdev -I../lib/librte_ethdev -Ilib/librte_net -I../lib/librte_net -Ilib/librte_mbuf -I../lib/librte_mbuf -Ilib/librte_mempool -I../lib/librte_mempool -Ilib/librte_ring -I../lib/librte_ring -Ilib/librte_meter -I../lib/librte_meter -Ilib/librte_metrics -I../lib/librte_metrics -Xclang -fcolor-diagnostics -pipe -D_FILE_OFFSET_BITS=64 -Wall -Winvalid-pch -Werror -O2 -g -include rte_config.h -Wextra -Wcast-qual -Wdeprecated -Wformat-nonliteral -Wformat-security -Wmissing-declarations -Wmissing-prototypes -Wnested-externs -Wold-style-definition -Wpointer-arith -Wsign-compare -Wstrict-prototypes -Wundef -Wwrite-strings -Wno-address-of-packed-member -Wno-missing-field-initializers -D_GNU_SOURCE -fPIC -march=native -DALLOW_EXPERIMENTAL_API -DALLOW_INTERNAL_API -MD -MQ 'lib/76b5a35@@rte_bitratestats at sta/librte_bitratestats_rte_bitrate.c.o' -MF 'lib/76b5a35@@rte_bitratestats at sta/librte_bitratestats_rte_bitrate.c.o.d' -o 'lib/76b5a35@@rte_bitratestats at sta/librte_bitratestats_rte_bitrate.c.o' -c ../lib/librte_bitratestats/rte_bitrate.c
In file included from ../lib/librte_bitratestats/rte_bitrate.c:6:
In file included from ../lib/librte_ethdev/rte_ethdev.h:995:
In file included from ../lib/librte_ethdev/rte_eth_ctrl.h:11:
../lib/librte_ethdev/rte_flow.h:3328:1: error: attribute 'section' is ignored, place it after "struct" to apply attribute to type declaration [-Werror,-Wignored-attributes]
__rte_experimental
^
../lib/librte_eal/include/rte_compat.h:18:16: note: expanded from macro '__rte_experimental'
__attribute__((section(".text.experimental")))
               ^
In file included from ../lib/librte_bitratestats/rte_bitrate.c:6:
In file included from ../lib/librte_ethdev/rte_ethdev.h:995:
In file included from ../lib/librte_ethdev/rte_eth_ctrl.h:11:
../lib/librte_ethdev/rte_flow.h:3352:1: error: attribute 'section' is ignored, place it after "struct" to apply attribute to type declaration [-Werror,-Wignored-attributes]
__rte_experimental
^
../lib/librte_eal/include/rte_compat.h:18:16: note: expanded from macro '__rte_experimental'
__attribute__((section(".text.experimental")))
               ^
In file included from ../lib/librte_bitratestats/rte_bitrate.c:6:
In file included from ../lib/librte_ethdev/rte_ethdev.h:995:
In file included from ../lib/librte_ethdev/rte_eth_ctrl.h:11:
../lib/librte_ethdev/rte_flow.h:3382:1: error: attribute 'section' is ignored, place it after "struct" to apply attribute to type declaration [-Werror,-Wignored-attributes]
__rte_experimental
^
../lib/librte_eal/include/rte_compat.h:18:16: note: expanded from macro '__rte_experimental'
__attribute__((section(".text.experimental")))
               ^
3 errors generated.
[121/2191] Compiling C object 'lib/76b5a35@@rte_ethdev at sta/librte_ethdev_ethdev_trace_points.c.o'.
FAILED: lib/76b5a35@@rte_ethdev at sta/librte_ethdev_ethdev_trace_points.c.o 
clang -Ilib/76b5a35@@rte_ethdev at sta -Ilib -I../lib -Ilib/librte_ethdev -I../lib/librte_ethdev -I. -I../ -Iconfig -I../config -Ilib/librte_eal/include -I../lib/librte_eal/include -Ilib/librte_eal/linux/include -I../lib/librte_eal/linux/include -Ilib/librte_eal/x86/include -I../lib/librte_eal/x86/include -Ilib/librte_eal/common -I../lib/librte_eal/common -Ilib/librte_eal -I../lib/librte_eal -Ilib/librte_kvargs -I../lib/librte_kvargs -Ilib/librte_telemetry/../librte_metrics -I../lib/librte_telemetry/../librte_metrics -Ilib/librte_telemetry -I../lib/librte_telemetry -Ilib/librte_net -I../lib/librte_net -Ilib/librte_mbuf -I../lib/librte_mbuf -Ilib/librte_mempool -I../lib/librte_mempool -Ilib/librte_ring -I../lib/librte_ring -Ilib/librte_meter -I../lib/librte_meter -Xclang -fcolor-diagnostics -pipe -D_FILE_OFFSET_BITS=64 -Wall -Winvalid-pch -Werror -O2 -g -include rte_config.h -Wextra -Wcast-qual -Wdeprecated -Wformat-nonliteral -Wformat-security -Wmissing-declarations -Wmissing-prototypes -Wnested-externs -Wold-style-definition -Wpointer-arith -Wsign-compare -Wstrict-prototypes -Wundef -Wwrite-strings -Wno-address-of-packed-member -Wno-missing-field-initializers -D_GNU_SOURCE -fPIC -march=native -DALLOW_EXPERIMENTAL_API -DALLOW_INTERNAL_API -MD -MQ 'lib/76b5a35@@rte_ethdev at sta/librte_ethdev_ethdev_trace_points.c.o' -MF 'lib/76b5a35@@rte_ethdev at sta/librte_ethdev_ethdev_trace_points.c.o.d' -o 'lib/76b5a35@@rte_ethdev at sta/librte_ethdev_ethdev_trace_points.c.o' -c ../lib/librte_ethdev/ethdev_trace_points.c
In file included from ../lib/librte_ethdev/ethdev_trace_points.c:7:
In file included from ../lib/librte_ethdev/rte_ethdev_trace.h:20:
In file included from ../lib/librte_ethdev/rte_ethdev.h:995:
In file included from ../lib/librte_ethdev/rte_eth_ctrl.h:11:
../lib/librte_ethdev/rte_flow.h:3328:1: error: attribute 'section' is ignored, place it after "struct" to apply attribute to type declaration [-Werror,-Wignored-attributes]
__rte_experimental
^
../lib/librte_eal/include/rte_compat.h:18:16: note: expanded from macro '__rte_experimental'
__attribute__((section(".text.experimental")))
               ^
In file included from ../lib/librte_ethdev/ethdev_trace_points.c:7:
In file included from ../lib/librte_ethdev/rte_ethdev_trace.h:20:
In file included from ../lib/librte_ethdev/rte_ethdev.h:995:
In file included from ../lib/librte_ethdev/rte_eth_ctrl.h:11:
../lib/librte_ethdev/rte_flow.h:3352:1: error: attribute 'section' is ignored, place it after "struct" to apply attribute to type declaration [-Werror,-Wignored-attributes]
__rte_experimental
^
../lib/librte_eal/include/rte_compat.h:18:16: note: expanded from macro '__rte_experimental'
__attribute__((section(".text.experimental")))
               ^
In file included from ../lib/librte_ethdev/ethdev_trace_points.c:7:
In file included from ../lib/librte_ethdev/rte_ethdev_trace.h:20:
In file included from ../lib/librte_ethdev/rte_ethdev.h:995:
In file included from ../lib/librte_ethdev/rte_eth_ctrl.h:11:
../lib/librte_ethdev/rte_flow.h:3382:1: error: attribute 'section' is ignored, place it after "struct" to apply attribute to type declaration [-Werror,-Wignored-attributes]
__rte_experimental
^
../lib/librte_eal/include/rte_compat.h:18:16: note: expanded from macro '__rte_experimental'
__attribute__((section(".text.experimental")))
               ^
3 errors generated.
[122/2191] Compiling C object 'lib/76b5a35@@rte_ethdev at sta/librte_ethdev_rte_ethdev.c.o'.
FAILED: lib/76b5a35@@rte_ethdev at sta/librte_ethdev_rte_ethdev.c.o 
clang -Ilib/76b5a35@@rte_ethdev at sta -Ilib -I../lib -Ilib/librte_ethdev -I../lib/librte_ethdev -I. -I../ -Iconfig -I../config -Ilib/librte_eal/include -I../lib/librte_eal/include -Ilib/librte_eal/linux/include -I../lib/librte_eal/linux/include -Ilib/librte_eal/x86/include -I../lib/librte_eal/x86/include -Ilib/librte_eal/common -I../lib/librte_eal/common -Ilib/librte_eal -I../lib/librte_eal -Ilib/librte_kvargs -I../lib/librte_kvargs -Ilib/librte_telemetry/../librte_metrics -I../lib/librte_telemetry/../librte_metrics -Ilib/librte_telemetry -I../lib/librte_telemetry -Ilib/librte_net -I../lib/librte_net -Ilib/librte_mbuf -I../lib/librte_mbuf -Ilib/librte_mempool -I../lib/librte_mempool -Ilib/librte_ring -I../lib/librte_ring -Ilib/librte_meter -I../lib/librte_meter -Xclang -fcolor-diagnostics -pipe -D_FILE_OFFSET_BITS=64 -Wall -Winvalid-pch -Werror -O2 -g -include rte_config.h -Wextra -Wcast-qual -Wdeprecated -Wformat-nonliteral -Wformat-security -Wmissing-declarations -Wmissing-prototypes -Wnested-externs -Wold-style-definition -Wpointer-arith -Wsign-compare -Wstrict-prototypes -Wundef -Wwrite-strings -Wno-address-of-packed-member -Wno-missing-field-initializers -D_GNU_SOURCE -fPIC -march=native -DALLOW_EXPERIMENTAL_API -DALLOW_INTERNAL_API -MD -MQ 'lib/76b5a35@@rte_ethdev at sta/librte_ethdev_rte_ethdev.c.o' -MF 'lib/76b5a35@@rte_ethdev at sta/librte_ethdev_rte_ethdev.c.o.d' -o 'lib/76b5a35@@rte_ethdev at sta/librte_ethdev_rte_ethdev.c.o' -c ../lib/librte_ethdev/rte_ethdev.c
In file included from ../lib/librte_ethdev/rte_ethdev.c:43:
In file included from ../lib/librte_ethdev/rte_ethdev_trace.h:20:
In file included from ../lib/librte_ethdev/rte_ethdev.h:995:
In file included from ../lib/librte_ethdev/rte_eth_ctrl.h:11:
../lib/librte_ethdev/rte_flow.h:3328:1: error: attribute 'section' is ignored, place it after "struct" to apply attribute to type declaration [-Werror,-Wignored-attributes]
__rte_experimental
^
../lib/librte_eal/include/rte_compat.h:18:16: note: expanded from macro '__rte_experimental'
__attribute__((section(".text.experimental")))
               ^
In file included from ../lib/librte_ethdev/rte_ethdev.c:43:
In file included from ../lib/librte_ethdev/rte_ethdev_trace.h:20:
In file included from ../lib/librte_ethdev/rte_ethdev.h:995:
In file included from ../lib/librte_ethdev/rte_eth_ctrl.h:11:
../lib/librte_ethdev/rte_flow.h:3352:1: error: attribute 'section' is ignored, place it after "struct" to apply attribute to type declaration [-Werror,-Wignored-attributes]
__rte_experimental
^
../lib/librte_eal/include/rte_compat.h:18:16: note: expanded from macro '__rte_experimental'
__attribute__((section(".text.experimental")))
               ^
In file included from ../lib/librte_ethdev/rte_ethdev.c:43:
In file included from ../lib/librte_ethdev/rte_ethdev_trace.h:20:
In file included from ../lib/librte_ethdev/rte_ethdev.h:995:
In file included from ../lib/librte_ethdev/rte_eth_ctrl.h:11:
../lib/librte_ethdev/rte_flow.h:3382:1: error: attribute 'section' is ignored, place it after "struct" to apply attribute to type declaration [-Werror,-Wignored-attributes]
__rte_experimental
^
../lib/librte_eal/include/rte_compat.h:18:16: note: expanded from macro '__rte_experimental'
__attribute__((section(".text.experimental")))
               ^
3 errors generated.
[123/2191] Compiling C object 'lib/76b5a35@@rte_ethdev at sta/librte_ethdev_rte_flow.c.o'.
FAILED: lib/76b5a35@@rte_ethdev at sta/librte_ethdev_rte_flow.c.o 
clang -Ilib/76b5a35@@rte_ethdev at sta -Ilib -I../lib -Ilib/librte_ethdev -I../lib/librte_ethdev -I. -I../ -Iconfig -I../config -Ilib/librte_eal/include -I../lib/librte_eal/include -Ilib/librte_eal/linux/include -I../lib/librte_eal/linux/include -Ilib/librte_eal/x86/include -I../lib/librte_eal/x86/include -Ilib/librte_eal/common -I../lib/librte_eal/common -Ilib/librte_eal -I../lib/librte_eal -Ilib/librte_kvargs -I../lib/librte_kvargs -Ilib/librte_telemetry/../librte_metrics -I../lib/librte_telemetry/../librte_metrics -Ilib/librte_telemetry -I../lib/librte_telemetry -Ilib/librte_net -I../lib/librte_net -Ilib/librte_mbuf -I../lib/librte_mbuf -Ilib/librte_mempool -I../lib/librte_mempool -Ilib/librte_ring -I../lib/librte_ring -Ilib/librte_meter -I../lib/librte_meter -Xclang -fcolor-diagnostics -pipe -D_FILE_OFFSET_BITS=64 -Wall -Winvalid-pch -Werror -O2 -g -include rte_config.h -Wextra -Wcast-qual -Wdeprecated -Wformat-nonliteral -Wformat-security -Wmissing-declarations -Wmissing-prototypes -Wnested-externs -Wold-style-definition -Wpointer-arith -Wsign-compare -Wstrict-prototypes -Wundef -Wwrite-strings -Wno-address-of-packed-member -Wno-missing-field-initializers -D_GNU_SOURCE -fPIC -march=native -DALLOW_EXPERIMENTAL_API -DALLOW_INTERNAL_API -MD -MQ 'lib/76b5a35@@rte_ethdev at sta/librte_ethdev_rte_flow.c.o' -MF 'lib/76b5a35@@rte_ethdev at sta/librte_ethdev_rte_flow.c.o.d' -o 'lib/76b5a35@@rte_ethdev at sta/librte_ethdev_rte_flow.c.o' -c ../lib/librte_ethdev/rte_flow.c
In file included from ../lib/librte_ethdev/rte_flow.c:17:
In file included from ../lib/librte_ethdev/rte_ethdev.h:995:
In file included from ../lib/librte_ethdev/rte_eth_ctrl.h:11:
../lib/librte_ethdev/rte_flow.h:3328:1: error: attribute 'section' is ignored, place it after "struct" to apply attribute to type declaration [-Werror,-Wignored-attributes]
__rte_experimental
^
../lib/librte_eal/include/rte_compat.h:18:16: note: expanded from macro '__rte_experimental'
__attribute__((section(".text.experimental")))
               ^
In file included from ../lib/librte_ethdev/rte_flow.c:17:
In file included from ../lib/librte_ethdev/rte_ethdev.h:995:
In file included from ../lib/librte_ethdev/rte_eth_ctrl.h:11:
../lib/librte_ethdev/rte_flow.h:3352:1: error: attribute 'section' is ignored, place it after "struct" to apply attribute to type declaration [-Werror,-Wignored-attributes]
__rte_experimental
^
../lib/librte_eal/include/rte_compat.h:18:16: note: expanded from macro '__rte_experimental'
__attribute__((section(".text.experimental")))
               ^
In file included from ../lib/librte_ethdev/rte_flow.c:17:
In file included from ../lib/librte_ethdev/rte_ethdev.h:995:
In file included from ../lib/librte_ethdev/rte_eth_ctrl.h:11:
../lib/librte_ethdev/rte_flow.h:3382:1: error: attribute 'section' is ignored, place it after "struct" to apply attribute to type declaration [-Werror,-Wignored-attributes]
__rte_experimental
^
../lib/librte_eal/include/rte_compat.h:18:16: note: expanded from macro '__rte_experimental'
__attribute__((section(".text.experimental")))
               ^
3 errors generated.
[124/2191] Compiling C object 'lib/76b5a35@@rte_ethdev at sta/librte_ethdev_rte_mtr.c.o'.
FAILED: lib/76b5a35@@rte_ethdev at sta/librte_ethdev_rte_mtr.c.o 
clang -Ilib/76b5a35@@rte_ethdev at sta -Ilib -I../lib -Ilib/librte_ethdev -I../lib/librte_ethdev -I. -I../ -Iconfig -I../config -Ilib/librte_eal/include -I../lib/librte_eal/include -Ilib/librte_eal/linux/include -I../lib/librte_eal/linux/include -Ilib/librte_eal/x86/include -I../lib/librte_eal/x86/include -Ilib/librte_eal/common -I../lib/librte_eal/common -Ilib/librte_eal -I../lib/librte_eal -Ilib/librte_kvargs -I../lib/librte_kvargs -Ilib/librte_telemetry/../librte_metrics -I../lib/librte_telemetry/../librte_metrics -Ilib/librte_telemetry -I../lib/librte_telemetry -Ilib/librte_net -I../lib/librte_net -Ilib/librte_mbuf -I../lib/librte_mbuf -Ilib/librte_mempool -I../lib/librte_mempool -Ilib/librte_ring -I../lib/librte_ring -Ilib/librte_meter -I../lib/librte_meter -Xclang -fcolor-diagnostics -pipe -D_FILE_OFFSET_BITS=64 -Wall -Winvalid-pch -Werror -O2 -g -include rte_config.h -Wextra -Wcast-qual -Wdeprecated -Wformat-nonliteral -Wformat-security -Wmissing-declarations -Wmissing-prototypes -Wnested-externs -Wold-style-definition -Wpointer-arith -Wsign-compare -Wstrict-prototypes -Wundef -Wwrite-strings -Wno-address-of-packed-member -Wno-missing-field-initializers -D_GNU_SOURCE -fPIC -march=native -DALLOW_EXPERIMENTAL_API -DALLOW_INTERNAL_API -MD -MQ 'lib/76b5a35@@rte_ethdev at sta/librte_ethdev_rte_mtr.c.o' -MF 'lib/76b5a35@@rte_ethdev at sta/librte_ethdev_rte_mtr.c.o.d' -o 'lib/76b5a35@@rte_ethdev at sta/librte_ethdev_rte_mtr.c.o' -c ../lib/librte_ethdev/rte_mtr.c
In file included from ../lib/librte_ethdev/rte_mtr.c:9:
In file included from ../lib/librte_ethdev/rte_ethdev.h:995:
In file included from ../lib/librte_ethdev/rte_eth_ctrl.h:11:
../lib/librte_ethdev/rte_flow.h:3328:1: error: attribute 'section' is ignored, place it after "struct" to apply attribute to type declaration [-Werror,-Wignored-attributes]
__rte_experimental
^
../lib/librte_eal/include/rte_compat.h:18:16: note: expanded from macro '__rte_experimental'
__attribute__((section(".text.experimental")))
               ^
In file included from ../lib/librte_ethdev/rte_mtr.c:9:
In file included from ../lib/librte_ethdev/rte_ethdev.h:995:
In file included from ../lib/librte_ethdev/rte_eth_ctrl.h:11:
../lib/librte_ethdev/rte_flow.h:3352:1: error: attribute 'section' is ignored, place it after "struct" to apply attribute to type declaration [-Werror,-Wignored-attributes]
__rte_experimental
^
../lib/librte_eal/include/rte_compat.h:18:16: note: expanded from macro '__rte_experimental'
__attribute__((section(".text.experimental")))
               ^
In file included from ../lib/librte_ethdev/rte_mtr.c:9:
In file included from ../lib/librte_ethdev/rte_ethdev.h:995:
In file included from ../lib/librte_ethdev/rte_eth_ctrl.h:11:
../lib/librte_ethdev/rte_flow.h:3382:1: error: attribute 'section' is ignored, place it after "struct" to apply attribute to type declaration [-Werror,-Wignored-attributes]
__rte_experimental
^
../lib/librte_eal/include/rte_compat.h:18:16: note: expanded from macro '__rte_experimental'
__attribute__((section(".text.experimental")))
               ^
3 errors generated.
[125/2191] Generating eal.sym_chk with a meson_exe.py custom command.
ninja: build stopped: subcommand failed



*Makefile Build Failed #1:
OS: CENTOS82-64
Target: x86_64-native-linuxapp-clang
In file included from /root/CENTOS82-64_K4.18.0_Clang7.0.1/x86_64-native-linuxapp-clang/216e6407c36b4f7dbd900afe6621ca29/dpdk/x86_64-native-linuxapp-clang/include/rte_ethdev_driver.h:18:
In file included from /root/CENTOS82-64_K4.18.0_Clang7.0.1/x86_64-native-linuxapp-clang/216e6407c36b4f7dbd900afe6621ca29/dpdk/x86_64-native-linuxapp-clang/include/rte_ethdev.h:995:
In file included from /root/CENTOS82-64_K4.18.0_Clang7.0.1/x86_64-native-linuxapp-clang/216e6407c36b4f7dbd900afe6621ca29/dpdk/x86_64-native-linuxapp-clang/include/rte_eth_ctrl.h:11:
/root/CENTOS82-64_K4.18.0_Clang7.0.1/x86_64-native-linuxapp-clang/216e6407c36b4f7dbd900afe6621ca29/dpdk/x86_64-native-linuxapp-clang/include/rte_flow.h:3328:1: error: attribute 'section' is ignored, place it after "struct" to apply attribute to type declaration [-Werror,-Wignored-attributes]
__rte_experimental
^
/root/CENTOS82-64_K4.18.0_Clang7.0.1/x86_64-native-linuxapp-clang/216e6407c36b4f7dbd900afe6621ca29/dpdk/x86_64-native-linuxapp-clang/include/rte_compat.h:18:16: note: expanded from macro '__rte_experimental'
--
In file included from /root/CENTOS82-64_K4.18.0_Clang7.0.1/x86_64-native-linuxapp-clang/216e6407c36b4f7dbd900afe6621ca29/dpdk/x86_64-native-linuxapp-clang/include/rte_ethdev_driver.h:18:
In file included from /root/CENTOS82-64_K4.18.0_Clang7.0.1/x86_64-native-linuxapp-clang/216e6407c36b4f7dbd900afe6621ca29/dpdk/x86_64-native-linuxapp-clang/include/rte_ethdev.h:995:
In file included from /root/CENTOS82-64_K4.18.0_Clang7.0.1/x86_64-native-linuxapp-clang/216e6407c36b4f7dbd900afe6621ca29/dpdk/x86_64-native-linuxapp-clang/include/rte_eth_ctrl.h:11:
/root/CENTOS82-64_K4.18.0_Clang7.0.1/x86_64-native-linuxapp-clang/216e6407c36b4f7dbd900afe6621ca29/dpdk/x86_64-native-linuxapp-clang/include/rte_flow.h:3352:1: error: attribute 'section' is ignored, place it after "struct" to apply attribute to type declaration [-Werror,-Wignored-attributes]
__rte_experimental
^
/root/CENTOS82-64_K4.18.0_Clang7.0.1/x86_64-native-linuxapp-clang/216e6407c36b4f7dbd900afe6621ca29/dpdk/x86_64-native-linuxapp-clang/include/rte_compat.h:18:16: note: expanded from macro '__rte_experimental'
--
In file included from /root/CENTOS82-64_K4.18.0_Clang7.0.1/x86_64-native-linuxapp-clang/216e6407c36b4f7dbd900afe6621ca29/dpdk/x86_64-native-linuxapp-clang/include/rte_ethdev_driver.h:18:
In file included from /root/CENTOS82-64_K4.18.0_Clang7.0.1/x86_64-native-linuxapp-clang/216e6407c36b4f7dbd900afe6621ca29/dpdk/x86_64-native-linuxapp-clang/include/rte_ethdev.h:995:
In file included from /root/CENTOS82-64_K4.18.0_Clang7.0.1/x86_64-native-linuxapp-clang/216e6407c36b4f7dbd900afe6621ca29/dpdk/x86_64-native-linuxapp-clang/include/rte_eth_ctrl.h:11:
/root/CENTOS82-64_K4.18.0_Clang7.0.1/x86_64-native-linuxapp-clang/216e6407c36b4f7dbd900afe6621ca29/dpdk/x86_64-native-linuxapp-clang/include/rte_flow.h:3382:1: error: attribute 'section' is ignored, place it after "struct" to apply attribute to type declaration [-Werror,-Wignored-attributes]
__rte_experimental
^
/root/CENTOS82-64_K4.18.0_Clang7.0.1/x86_64-native-linuxapp-clang/216e6407c36b4f7dbd900afe6621ca29/dpdk/x86_64-native-linuxapp-clang/include/rte_compat.h:18:16: note: expanded from macro '__rte_experimental'
__attribute__((section(".text.experimental")))
               ^
3 errors generated.
make[6]: *** [/root/CENTOS82-64_K4.18.0_Clang7.0.1/x86_64-native-linuxapp-clang/216e6407c36b4f7dbd900afe6621ca29/dpdk/mk/internal/rte.compile-pre.mk:114: ark_ethdev.o] Error 1
make[5]: *** [/root/CENTOS82-64_K4.18.0_Clang7.0.1/x86_64-native-linuxapp-clang/216e6407c36b4f7dbd900afe6621ca29/dpdk/mk/rte.subdir.mk:37: ark] Error 2
make[4]: *** [/root/CENTOS82-64_K4.18.0_Clang7.0.1/x86_64-native-linuxapp-clang/216e6407c36b4f7dbd900afe6621ca29/dpdk/mk/rte.subdir.mk:35: net] Error 2
make[4]: *** Waiting for unfinished jobs....
  CC qat_common.o
  CC otx_cryptodev_mbox.o
--
3 warnings generated.
  AR librte_pmd_octeontx2_crypto.a
  INSTALL-LIB librte_pmd_octeontx2_crypto.a
make[3]: *** [/root/CENTOS82-64_K4.18.0_Clang7.0.1/x86_64-native-linuxapp-clang/216e6407c36b4f7dbd900afe6621ca29/dpdk/mk/rte.sdkbuild.mk:51: drivers] Error 2
make[2]: *** [/root/CENTOS82-64_K4.18.0_Clang7.0.1/x86_64-native-linuxapp-clang/216e6407c36b4f7dbd900afe6621ca29/dpdk/mk/rte.sdkroot.mk:99: all] Error 2
make[1]: *** [/root/CENTOS82-64_K4.18.0_Clang7.0.1/x86_64-native-linuxapp-clang/216e6407c36b4f7dbd900afe6621ca29/dpdk/mk/rte.sdkinstall.mk:61: pre_install] Error 2
make: *** [/root/CENTOS82-64_K4.18.0_Clang7.0.1/x86_64-native-linuxapp-clang/216e6407c36b4f7dbd900afe6621ca29/dpdk/mk/rte.sdkroot.mk:77: install] Error 2


*Makefile Build Failed #2:
OS: CENTOS82-64
Target: x86_64-native-linuxapp-icc
  PMDINFO bbdev_null.o.pmd.c
  CC bbdev_null.o.pmd.o
compilation aborted for /root/CENTOS82-64_K4.18.0_ICC19.1.1/x86_64-native-linuxapp-icc/216e6407c36b4f7dbd900afe6621ca29/dpdk/drivers/net/ark/ark_ethdev.c (code 2)
make[6]: *** [/root/CENTOS82-64_K4.18.0_ICC19.1.1/x86_64-native-linuxapp-icc/216e6407c36b4f7dbd900afe6621ca29/dpdk/mk/internal/rte.compile-pre.mk:114: ark_ethdev.o] Error 2
make[5]: *** [/root/CENTOS82-64_K4.18.0_ICC19.1.1/x86_64-native-linuxapp-icc/216e6407c36b4f7dbd900afe6621ca29/dpdk/mk/rte.subdir.mk:37: ark] Error 2
make[5]: *** Waiting for unfinished jobs....
  CC qat_sym_session.o
  PMDINFO isal_compress_pmd.o.pmd.c
--
  AR librte_pmd_atlantic.a
  LD otx_zip_pmd.o
  INSTALL-LIB librte_pmd_atlantic.a
make[4]: *** [/root/CENTOS82-64_K4.18.0_ICC19.1.1/x86_64-native-linuxapp-icc/216e6407c36b4f7dbd900afe6621ca29/dpdk/mk/rte.subdir.mk:35: net] Error 2
make[4]: *** Waiting for unfinished jobs....
== Build drivers/crypto/dpaa_sec
  CC otx_zip.o
--
  INSTALL-LIB librte_pmd_octeontx_crypto.a
  AR librte_pmd_octeontx2_crypto.a
  INSTALL-LIB librte_pmd_octeontx2_crypto.a
make[3]: *** [/root/CENTOS82-64_K4.18.0_ICC19.1.1/x86_64-native-linuxapp-icc/216e6407c36b4f7dbd900afe6621ca29/dpdk/mk/rte.sdkbuild.mk:51: drivers] Error 2
make[2]: *** [/root/CENTOS82-64_K4.18.0_ICC19.1.1/x86_64-native-linuxapp-icc/216e6407c36b4f7dbd900afe6621ca29/dpdk/mk/rte.sdkroot.mk:99: all] Error 2
make[1]: *** [/root/CENTOS82-64_K4.18.0_ICC19.1.1/x86_64-native-linuxapp-icc/216e6407c36b4f7dbd900afe6621ca29/dpdk/mk/rte.sdkinstall.mk:61: pre_install] Error 2
make: *** [/root/CENTOS82-64_K4.18.0_ICC19.1.1/x86_64-native-linuxapp-icc/216e6407c36b4f7dbd900afe6621ca29/dpdk/mk/rte.sdkroot.mk:77: install] Error 2


*Makefile Build Failed #3:
OS: FC32-64
Target: x86_64-native-linuxapp-clang
In file included from /root/FC32-64_K5.6.0_Clang10.0.0/x86_64-native-linuxapp-clang/216e6407c36b4f7dbd900afe6621ca29/dpdk/x86_64-native-linuxapp-clang/include/rte_ethdev_driver.h:18:
In file included from /root/FC32-64_K5.6.0_Clang10.0.0/x86_64-native-linuxapp-clang/216e6407c36b4f7dbd900afe6621ca29/dpdk/x86_64-native-linuxapp-clang/include/rte_ethdev.h:995:
In file included from /root/FC32-64_K5.6.0_Clang10.0.0/x86_64-native-linuxapp-clang/216e6407c36b4f7dbd900afe6621ca29/dpdk/x86_64-native-linuxapp-clang/include/rte_eth_ctrl.h:11:
/root/FC32-64_K5.6.0_Clang10.0.0/x86_64-native-linuxapp-clang/216e6407c36b4f7dbd900afe6621ca29/dpdk/x86_64-native-linuxapp-clang/include/rte_flow.h:3328:1: error: attribute 'section' is ignored, place it after "struct" to apply attribute to type declaration [-Werror,-Wignored-attributes]
__rte_experimental
^
/root/FC32-64_K5.6.0_Clang10.0.0/x86_64-native-linuxapp-clang/216e6407c36b4f7dbd900afe6621ca29/dpdk/x86_64-native-linuxapp-clang/include/rte_compat.h:18:16: note: expanded from macro '__rte_experimental'
--
In file included from /root/FC32-64_K5.6.0_Clang10.0.0/x86_64-native-linuxapp-clang/216e6407c36b4f7dbd900afe6621ca29/dpdk/x86_64-native-linuxapp-clang/include/rte_ethdev_driver.h:18:
In file included from /root/FC32-64_K5.6.0_Clang10.0.0/x86_64-native-linuxapp-clang/216e6407c36b4f7dbd900afe6621ca29/dpdk/x86_64-native-linuxapp-clang/include/rte_ethdev.h:995:
In file included from /root/FC32-64_K5.6.0_Clang10.0.0/x86_64-native-linuxapp-clang/216e6407c36b4f7dbd900afe6621ca29/dpdk/x86_64-native-linuxapp-clang/include/rte_eth_ctrl.h:11:
/root/FC32-64_K5.6.0_Clang10.0.0/x86_64-native-linuxapp-clang/216e6407c36b4f7dbd900afe6621ca29/dpdk/x86_64-native-linuxapp-clang/include/rte_flow.h:3352:1: error: attribute 'section' is ignored, place it after "struct" to apply attribute to type declaration [-Werror,-Wignored-attributes]
__rte_experimental
^
/root/FC32-64_K5.6.0_Clang10.0.0/x86_64-native-linuxapp-clang/216e6407c36b4f7dbd900afe6621ca29/dpdk/x86_64-native-linuxapp-clang/include/rte_compat.h:18:16: note: expanded from macro '__rte_experimental'
--
In file included from /root/FC32-64_K5.6.0_Clang10.0.0/x86_64-native-linuxapp-clang/216e6407c36b4f7dbd900afe6621ca29/dpdk/x86_64-native-linuxapp-clang/include/rte_ethdev_driver.h:18:
In file included from /root/FC32-64_K5.6.0_Clang10.0.0/x86_64-native-linuxapp-clang/216e6407c36b4f7dbd900afe6621ca29/dpdk/x86_64-native-linuxapp-clang/include/rte_ethdev.h:995:
In file included from /root/FC32-64_K5.6.0_Clang10.0.0/x86_64-native-linuxapp-clang/216e6407c36b4f7dbd900afe6621ca29/dpdk/x86_64-native-linuxapp-clang/include/rte_eth_ctrl.h:11:
/root/FC32-64_K5.6.0_Clang10.0.0/x86_64-native-linuxapp-clang/216e6407c36b4f7dbd900afe6621ca29/dpdk/x86_64-native-linuxapp-clang/include/rte_flow.h:3382:1: error: attribute 'section' is ignored, place it after "struct" to apply attribute to type declaration [-Werror,-Wignored-attributes]
__rte_experimental
^
/root/FC32-64_K5.6.0_Clang10.0.0/x86_64-native-linuxapp-clang/216e6407c36b4f7dbd900afe6621ca29/dpdk/x86_64-native-linuxapp-clang/include/rte_compat.h:18:16: note: expanded from macro '__rte_experimental'
__attribute__((section(".text.experimental")))
               ^
3 errors generated.
make[6]: *** [/root/FC32-64_K5.6.0_Clang10.0.0/x86_64-native-linuxapp-clang/216e6407c36b4f7dbd900afe6621ca29/dpdk/mk/internal/rte.compile-pre.mk:116: ark_ethdev.o] Error 1
  PMDINFO rte_aesni_mb_pmd.o.pmd.c
make[5]: *** [/root/FC32-64_K5.6.0_Clang10.0.0/x86_64-native-linuxapp-clang/216e6407c36b4f7dbd900afe6621ca29/dpdk/mk/rte.subdir.mk:37: ark] Error 2
make[5]: *** Waiting for unfinished jobs....
  CC rte_aesni_mb_pmd.o.pmd.o
  CC otx_cryptodev_ops.o
--
3 warnings generated.
  AR librte_pmd_atlantic.a
  INSTALL-LIB librte_pmd_atlantic.a
make[4]: *** [/root/FC32-64_K5.6.0_Clang10.0.0/x86_64-native-linuxapp-clang/216e6407c36b4f7dbd900afe6621ca29/dpdk/mk/rte.subdir.mk:35: net] Error 2
make[4]: *** Waiting for unfinished jobs....
== Build drivers/crypto/dpaa_sec
  PMDINFO bbdev_turbo_software.o.pmd.c
--
  LD dpaa2_sec_dpseci.o
  AR librte_pmd_dpaa2_sec.a
  INSTALL-LIB librte_pmd_dpaa2_sec.a
make[3]: *** [/root/FC32-64_K5.6.0_Clang10.0.0/x86_64-native-linuxapp-clang/216e6407c36b4f7dbd900afe6621ca29/dpdk/mk/rte.sdkbuild.mk:51: drivers] Error 2
make[2]: *** [/root/FC32-64_K5.6.0_Clang10.0.0/x86_64-native-linuxapp-clang/216e6407c36b4f7dbd900afe6621ca29/dpdk/mk/rte.sdkroot.mk:99: all] Error 2
make[1]: *** [/root/FC32-64_K5.6.0_Clang10.0.0/x86_64-native-linuxapp-clang/216e6407c36b4f7dbd900afe6621ca29/dpdk/mk/rte.sdkinstall.mk:61: pre_install] Error 2
make: *** [/root/FC32-64_K5.6.0_Clang10.0.0/x86_64-native-linuxapp-clang/216e6407c36b4f7dbd900afe6621ca29/dpdk/mk/rte.sdkroot.mk:77: install] Error 2


*Makefile Build Failed #4:
OS: FreeBSD1201-64
Target: x86_64-native-bsdapp-clang
awk -f /usr/src/sys/tools/makeobjops.awk /usr/src/sys/kern/bus_if.m -h
awk -f /usr/src/sys/tools/makeobjops.awk /usr/src/sys/kern/bus_if.m -h
Warning: Object directory not changed from original /root/FreeBSD1201-64_K12.1_Clang8.0.1/x86_64-native-bsdapp-clang/216e6407c36b4f7dbd900afe6621ca29/dpdk/x86_64-native-bsdapp-clang/build/kernel/freebsd/contigmem
cc  -Winline -Wall -Werror -include /root/FreeBSD1201-64_K12.1_Clang8.0.1/x86_64-native-bsdapp-clang/216e6407c36b4f7dbd900afe6621ca29/dpdk/x86_64-native-bsdapp-clang/include/rte_config.h  -Werror -D_KERNEL -DKLD_MODULE -nostdinc  -I/root/FreeBSD1201-64_K12.1_Clang8.0.1/x86_64-native-bsdapp-clang/216e6407c36b4f7dbd900afe6621ca29/dpdk/kernel/freebsd/contigmem -I/root/FreeBSD1201-64_K12.1_Clang8.0.1/x86_64-native-bsdapp-clang/216e6407c36b4f7dbd900afe6621ca29/dpdk/x86_64-native-bsdapp-clang/include -I. -I/usr/src/sys -I/usr/src/sys/contrib/ck/include -fno-common  -fno-omit-frame-pointer -mno-omit-leaf-frame-pointer -fdebug-prefix-map=./machine=/usr/src/sys/amd64/include -fdebug-prefix-map=./x86=/usr/src/sys/x86/include   -MD  -MF.depend.contigmem.o -MTcontigmem.o -mcmodel=kernel -mno-red-zone -mno-mmx -mno-sse -msoft-float  -fno-asynchronous-unwind-tables -ffreestanding -fwrapv -fstack-protector -Wall -Wredundant-decls -Wnested-externs -Wstrict-prototypes -Wmissing-prototypes -Wpointer-arith -Wcast-qual -Wundef -Wno-pointer-sign -D__printf__=__freebsd_kprintf__ -Wmissing-include-dirs -fdiagnostics-show-option -Wno-unknown-pragmas -Wno-error-tautological-compare -Wno-error-empty-body -Wno-error-parentheses-equality -Wno-error-unused-function -Wno-error-pointer-sign -Wno-error-shift-negative-value -Wno-address-of-packed-member  -mno-aes -mno-avx  -std=iso9899:1999 -c contigmem.c -o contigmem.o
awk -f /usr/src/sys/tools/makeobjops.awk /usr/src/sys/dev/pci/pci_if.m -h
== Build drivers/common
Warning: Object directory not changed from original /root/FreeBSD1201-64_K12.1_Clang8.0.1/x86_64-native-bsdapp-clang/216e6407c36b4f7dbd900afe6621ca29/dpdk/x86_64-native-bsdapp-clang/build/kernel/freebsd/nic_uio
cc  -Winline -Wall -Werror -include /root/FreeBSD1201-64_K12.1_Clang8.0.1/x86_64-native-bsdapp-clang/216e6407c36b4f7dbd900afe6621ca29/dpdk/x86_64-native-bsdapp-clang/include/rte_config.h  -Werror -D_KERNEL -DKLD_MODULE -nostdinc  -I/root/FreeBSD1201-64_K12.1_Clang8.0.1/x86_64-native-bsdapp-clang/216e6407c36b4f7dbd900afe6621ca29/dpdk/kernel/freebsd/nic_uio -I/root/FreeBSD1201-64_K12.1_Clang8.0.1/x86_64-native-bsdapp-clang/216e6407c36b4f7dbd900afe6621ca29/dpdk/x86_64-native-bsdapp-clang/include -I. -I/usr/src/sys -I/usr/src/sys/contrib/ck/include -fno-common  -fno-omit-frame-pointer -mno-omit-leaf-frame-pointer -fdebug-prefix-map=./machine=/usr/src/sys/amd64/include -fdebug-prefix-map=./x86=/usr/src/sys/x86/include   -MD  -MF.depend.nic_uio.o -MTnic_uio.o -mcmodel=kernel -mno-red-zone -mno-mmx -mno-sse -msoft-float  -fno-asynchronous-unwind-tables -ffreestanding -fwrapv -fstack-protector -Wall -Wredundant-decls -Wnested-externs -Wstrict-prototypes -Wmissing-prototypes -Wpointer-arith -Wcast-qual -Wundef -Wno-pointer-sign -D__printf__=__freebsd_kprintf__ -Wmissing-include-dirs -fdiagnostics-show-option -Wno-unknown-pragmas -Wno-error-tautological-compare -Wno-error-empty-body -Wno-error-parentheses-equality -Wno-error-unused-function -Wno-error-pointer-sign -Wno-error-shift-negative-value -Wno-address-of-packed-member  -mno-aes -mno-avx  -std=iso9899:1999 -c nic_uio.c -o nic_uio.o
== Build drivers/common/octeontx
== Build drivers/common/cpt
== Build drivers/common/iavf
--
In file included from /root/FreeBSD1201-64_K12.1_Clang8.0.1/x86_64-native-bsdapp-clang/216e6407c36b4f7dbd900afe6621ca29/dpdk/x86_64-native-bsdapp-clang/include/rte_ethdev_driver.h:18:
In file included from /root/FreeBSD1201-64_K12.1_Clang8.0.1/x86_64-native-bsdapp-clang/216e6407c36b4f7dbd900afe6621ca29/dpdk/x86_64-native-bsdapp-clang/include/rte_ethdev.h:995:
In file included from /root/FreeBSD1201-64_K12.1_Clang8.0.1/x86_64-native-bsdapp-clang/216e6407c36b4f7dbd900afe6621ca29/dpdk/x86_64-native-bsdapp-clang/include/rte_eth_ctrl.h:11:
/root/FreeBSD1201-64_K12.1_Clang8.0.1/x86_64-native-bsdapp-clang/216e6407c36b4f7dbd900afe6621ca29/dpdk/x86_64-native-bsdapp-clang/include/rte_flow.h:3328:1: error: attribute 'section' is ignored, place it after "struct" to apply attribute to type declaration [-Werror,-Wignored-attributes]
__rte_experimental
^
/root/FreeBSD1201-64_K12.1_Clang8.0.1/x86_64-native-bsdapp-clang/216e6407c36b4f7dbd900afe6621ca29/dpdk/x86_64-native-bsdapp-clang/include/rte_compat.h:18:16: note: expanded from macro '__rte_experimental'
--
In file included from /root/FreeBSD1201-64_K12.1_Clang8.0.1/x86_64-native-bsdapp-clang/216e6407c36b4f7dbd900afe6621ca29/dpdk/x86_64-native-bsdapp-clang/include/rte_ethdev_driver.h:18:
In file included from /root/FreeBSD1201-64_K12.1_Clang8.0.1/x86_64-native-bsdapp-clang/216e6407c36b4f7dbd900afe6621ca29/dpdk/x86_64-native-bsdapp-clang/include/rte_ethdev.h:995:
In file included from /root/FreeBSD1201-64_K12.1_Clang8.0.1/x86_64-native-bsdapp-clang/216e6407c36b4f7dbd900afe6621ca29/dpdk/x86_64-native-bsdapp-clang/include/rte_eth_ctrl.h:11:
/root/FreeBSD1201-64_K12.1_Clang8.0.1/x86_64-native-bsdapp-clang/216e6407c36b4f7dbd900afe6621ca29/dpdk/x86_64-native-bsdapp-clang/include/rte_flow.h:3352:1: error: attribute 'section' is ignored, place it after "struct" to apply attribute to type declaration [-Werror,-Wignored-attributes]
__rte_experimental
^
/root/FreeBSD1201-64_K12.1_Clang8.0.1/x86_64-native-bsdapp-clang/216e6407c36b4f7dbd900afe6621ca29/dpdk/x86_64-native-bsdapp-clang/include/rte_compat.h:18:16: note: expanded from macro '__rte_experimental'
--
In file included from /root/FreeBSD1201-64_K12.1_Clang8.0.1/x86_64-native-bsdapp-clang/216e6407c36b4f7dbd900afe6621ca29/dpdk/x86_64-native-bsdapp-clang/include/rte_ethdev_driver.h:18:
In file included from /root/FreeBSD1201-64_K12.1_Clang8.0.1/x86_64-native-bsdapp-clang/216e6407c36b4f7dbd900afe6621ca29/dpdk/x86_64-native-bsdapp-clang/include/rte_ethdev.h:995:
In file included from /root/FreeBSD1201-64_K12.1_Clang8.0.1/x86_64-native-bsdapp-clang/216e6407c36b4f7dbd900afe6621ca29/dpdk/x86_64-native-bsdapp-clang/include/rte_eth_ctrl.h:11:
/root/FreeBSD1201-64_K12.1_Clang8.0.1/x86_64-native-bsdapp-clang/216e6407c36b4f7dbd900afe6621ca29/dpdk/x86_64-native-bsdapp-clang/include/rte_flow.h:3382:1: error: attribute 'section' is ignored, place it after "struct" to apply attribute to type declaration [-Werror,-Wignored-attributes]
__rte_experimental
^
/root/FreeBSD1201-64_K12.1_Clang8.0.1/x86_64-native-bsdapp-clang/216e6407c36b4f7dbd900afe6621ca29/dpdk/x86_64-native-bsdapp-clang/include/rte_compat.h:18:16: note: expanded from macro '__rte_experimental'
--
               ^
3 errors generated.
  LD null_crypto_pmd.o
gmake[6]: *** [/root/FreeBSD1201-64_K12.1_Clang8.0.1/x86_64-native-bsdapp-clang/216e6407c36b4f7dbd900afe6621ca29/dpdk/mk/internal/rte.compile-pre.mk:116: ark_ethdev.o] Error 1
gmake[5]: *** [/root/FreeBSD1201-64_K12.1_Clang8.0.1/x86_64-native-bsdapp-clang/216e6407c36b4f7dbd900afe6621ca29/dpdk/mk/rte.subdir.mk:37: ark] Error 2
gmake[4]: *** [/root/FreeBSD1201-64_K12.1_Clang8.0.1/x86_64-native-bsdapp-clang/216e6407c36b4f7dbd900afe6621ca29/dpdk/mk/rte.subdir.mk:37: net] Error 2
gmake[4]: *** Waiting for unfinished jobs....
  CC otx_zip.o
  CC qat_sym.o
--
3 warnings generated.
  AR librte_pmd_octeontx2_crypto.a
  INSTALL-LIB librte_pmd_octeontx2_crypto.a
gmake[3]: *** [/root/FreeBSD1201-64_K12.1_Clang8.0.1/x86_64-native-bsdapp-clang/216e6407c36b4f7dbd900afe6621ca29/dpdk/mk/rte.sdkbuild.mk:51: drivers] Error 2
gmake[2]: *** [/root/FreeBSD1201-64_K12.1_Clang8.0.1/x86_64-native-bsdapp-clang/216e6407c36b4f7dbd900afe6621ca29/dpdk/mk/rte.sdkroot.mk:99: all] Error 2
gmake[1]: *** [/root/FreeBSD1201-64_K12.1_Clang8.0.1/x86_64-native-bsdapp-clang/216e6407c36b4f7dbd900afe6621ca29/dpdk/mk/rte.sdkinstall.mk:61: pre_install] Error 2
gmake: *** [/root/FreeBSD1201-64_K12.1_Clang8.0.1/x86_64-native-bsdapp-clang/216e6407c36b4f7dbd900afe6621ca29/dpdk/mk/rte.sdkroot.mk:77: install] Error 2


*Makefile Build Failed #5:
OS: SUSE15-64
Target: x86_64-native-linuxapp-clang
In file included from /root/SUSE15-64_K4.12.14_Clang5.0.1/x86_64-native-linuxapp-clang/216e6407c36b4f7dbd900afe6621ca29/dpdk/x86_64-native-linuxapp-clang/include/rte_ethdev_driver.h:18:
In file included from /root/SUSE15-64_K4.12.14_Clang5.0.1/x86_64-native-linuxapp-clang/216e6407c36b4f7dbd900afe6621ca29/dpdk/x86_64-native-linuxapp-clang/include/rte_ethdev.h:995:
In file included from /root/SUSE15-64_K4.12.14_Clang5.0.1/x86_64-native-linuxapp-clang/216e6407c36b4f7dbd900afe6621ca29/dpdk/x86_64-native-linuxapp-clang/include/rte_eth_ctrl.h:11:
/root/SUSE15-64_K4.12.14_Clang5.0.1/x86_64-native-linuxapp-clang/216e6407c36b4f7dbd900afe6621ca29/dpdk/x86_64-native-linuxapp-clang/include/rte_flow.h:3328:1: error: attribute 'section' is ignored, place it after "struct" to apply attribute to type declaration [-Werror,-Wignored-attributes]
__rte_experimental
^
/root/SUSE15-64_K4.12.14_Clang5.0.1/x86_64-native-linuxapp-clang/216e6407c36b4f7dbd900afe6621ca29/dpdk/x86_64-native-linuxapp-clang/include/rte_compat.h:18:16: note: expanded from macro '__rte_experimental'
--
In file included from /root/SUSE15-64_K4.12.14_Clang5.0.1/x86_64-native-linuxapp-clang/216e6407c36b4f7dbd900afe6621ca29/dpdk/x86_64-native-linuxapp-clang/include/rte_ethdev_driver.h:18:
In file included from /root/SUSE15-64_K4.12.14_Clang5.0.1/x86_64-native-linuxapp-clang/216e6407c36b4f7dbd900afe6621ca29/dpdk/x86_64-native-linuxapp-clang/include/rte_ethdev.h:995:
In file included from /root/SUSE15-64_K4.12.14_Clang5.0.1/x86_64-native-linuxapp-clang/216e6407c36b4f7dbd900afe6621ca29/dpdk/x86_64-native-linuxapp-clang/include/rte_eth_ctrl.h:11:
/root/SUSE15-64_K4.12.14_Clang5.0.1/x86_64-native-linuxapp-clang/216e6407c36b4f7dbd900afe6621ca29/dpdk/x86_64-native-linuxapp-clang/include/rte_flow.h:3352:1: error: attribute 'section' is ignored, place it after "struct" to apply attribute to type declaration [-Werror,-Wignored-attributes]
__rte_experimental
^
/root/SUSE15-64_K4.12.14_Clang5.0.1/x86_64-native-linuxapp-clang/216e6407c36b4f7dbd900afe6621ca29/dpdk/x86_64-native-linuxapp-clang/include/rte_compat.h:18:16: note: expanded from macro '__rte_experimental'
--
In file included from /root/SUSE15-64_K4.12.14_Clang5.0.1/x86_64-native-linuxapp-clang/216e6407c36b4f7dbd900afe6621ca29/dpdk/x86_64-native-linuxapp-clang/include/rte_ethdev_driver.h:18:
In file included from /root/SUSE15-64_K4.12.14_Clang5.0.1/x86_64-native-linuxapp-clang/216e6407c36b4f7dbd900afe6621ca29/dpdk/x86_64-native-linuxapp-clang/include/rte_ethdev.h:995:
In file included from /root/SUSE15-64_K4.12.14_Clang5.0.1/x86_64-native-linuxapp-clang/216e6407c36b4f7dbd900afe6621ca29/dpdk/x86_64-native-linuxapp-clang/include/rte_eth_ctrl.h:11:
/root/SUSE15-64_K4.12.14_Clang5.0.1/x86_64-native-linuxapp-clang/216e6407c36b4f7dbd900afe6621ca29/dpdk/x86_64-native-linuxapp-clang/include/rte_flow.h:3382:1: error: attribute 'section' is ignored, place it after "struct" to apply attribute to type declaration [-Werror,-Wignored-attributes]
__rte_experimental
^
/root/SUSE15-64_K4.12.14_Clang5.0.1/x86_64-native-linuxapp-clang/216e6407c36b4f7dbd900afe6621ca29/dpdk/x86_64-native-linuxapp-clang/include/rte_compat.h:18:16: note: expanded from macro '__rte_experimental'
--
In file included from /root/SUSE15-64_K4.12.14_Clang5.0.1/x86_64-native-linuxapp-clang/216e6407c36b4f7dbd900afe6621ca29/dpdk/x86_64-native-linuxapp-clang/include/rte_ethdev_driver.h:18:
In file included from /root/SUSE15-64_K4.12.14_Clang5.0.1/x86_64-native-linuxapp-clang/216e6407c36b4f7dbd900afe6621ca29/dpdk/x86_64-native-linuxapp-clang/include/rte_ethdev.h:995:
In file included from /root/SUSE15-64_K4.12.14_Clang5.0.1/x86_64-native-linuxapp-clang/216e6407c36b4f7dbd900afe6621ca29/dpdk/x86_64-native-linuxapp-clang/include/rte_eth_ctrl.h:11:
/root/SUSE15-64_K4.12.14_Clang5.0.1/x86_64-native-linuxapp-clang/216e6407c36b4f7dbd900afe6621ca29/dpdk/x86_64-native-linuxapp-clang/include/rte_flow.h:3328:1: error: attribute 'section' is ignored, place it after "struct" to apply attribute to type declaration [-Werror,-Wignored-attributes]
__rte_experimental
^
/root/SUSE15-64_K4.12.14_Clang5.0.1/x86_64-native-linuxapp-clang/216e6407c36b4f7dbd900afe6621ca29/dpdk/x86_64-native-linuxapp-clang/include/rte_compat.h:18:16: note: expanded from macro '__rte_experimental'
--
In file included from /root/SUSE15-64_K4.12.14_Clang5.0.1/x86_64-native-linuxapp-clang/216e6407c36b4f7dbd900afe6621ca29/dpdk/x86_64-native-linuxapp-clang/include/rte_ethdev_driver.h:18:
In file included from /root/SUSE15-64_K4.12.14_Clang5.0.1/x86_64-native-linuxapp-clang/216e6407c36b4f7dbd900afe6621ca29/dpdk/x86_64-native-linuxapp-clang/include/rte_ethdev.h:995:
In file included from /root/SUSE15-64_K4.12.14_Clang5.0.1/x86_64-native-linuxapp-clang/216e6407c36b4f7dbd900afe6621ca29/dpdk/x86_64-native-linuxapp-clang/include/rte_eth_ctrl.h:11:
/root/SUSE15-64_K4.12.14_Clang5.0.1/x86_64-native-linuxapp-clang/216e6407c36b4f7dbd900afe6621ca29/dpdk/x86_64-native-linuxapp-clang/include/rte_flow.h:3352:1: error: attribute 'section' is ignored, place it after "struct" to apply attribute to type declaration [-Werror,-Wignored-attributes]
__rte_experimental
^
/root/SUSE15-64_K4.12.14_Clang5.0.1/x86_64-native-linuxapp-clang/216e6407c36b4f7dbd900afe6621ca29/dpdk/x86_64-native-linuxapp-clang/include/rte_compat.h:18:16: note: expanded from macro '__rte_experimental'
--
In file included from /root/SUSE15-64_K4.12.14_Clang5.0.1/x86_64-native-linuxapp-clang/216e6407c36b4f7dbd900afe6621ca29/dpdk/x86_64-native-linuxapp-clang/include/rte_ethdev_driver.h:18:
In file included from /root/SUSE15-64_K4.12.14_Clang5.0.1/x86_64-native-linuxapp-clang/216e6407c36b4f7dbd900afe6621ca29/dpdk/x86_64-native-linuxapp-clang/include/rte_ethdev.h:995:
In file included from /root/SUSE15-64_K4.12.14_Clang5.0.1/x86_64-native-linuxapp-clang/216e6407c36b4f7dbd900afe6621ca29/dpdk/x86_64-native-linuxapp-clang/include/rte_eth_ctrl.h:11:
/root/SUSE15-64_K4.12.14_Clang5.0.1/x86_64-native-linuxapp-clang/216e6407c36b4f7dbd900afe6621ca29/dpdk/x86_64-native-linuxapp-clang/include/rte_flow.h:3382:1: error: attribute 'section' is ignored, place it after "struct" to apply attribute to type declaration [-Werror,-Wignored-attributes]
__rte_experimental
^
/root/SUSE15-64_K4.12.14_Clang5.0.1/x86_64-native-linuxapp-clang/216e6407c36b4f7dbd900afe6621ca29/dpdk/x86_64-native-linuxapp-clang/include/rte_compat.h:18:16: note: expanded from macro '__rte_experimental'
--
  LD otx2_cryptodev.o
  LD atl_ethdev.o
  CC otx2_cryptodev_capabilities.o
make[6]: *** [/root/SUSE15-64_K4.12.14_Clang5.0.1/x86_64-native-linuxapp-clang/216e6407c36b4f7dbd900afe6621ca29/dpdk/mk/internal/rte.compile-pre.mk:116: ark_ethdev.o] Error 1
make[6]: *** Waiting for unfinished jobs....
make[6]: *** [/root/SUSE15-64_K4.12.14_Clang5.0.1/x86_64-native-linuxapp-clang/216e6407c36b4f7dbd900afe6621ca29/dpdk/mk/internal/rte.compile-pre.mk:116: ark_ethdev_rx.o] Error 1
  CC ark_ethdev_tx.o
== Build drivers/crypto/scheduler
  CC otx2_cryptodev_hw_access.o
--
In file included from /root/SUSE15-64_K4.12.14_Clang5.0.1/x86_64-native-linuxapp-clang/216e6407c36b4f7dbd900afe6621ca29/dpdk/x86_64-native-linuxapp-clang/include/rte_ethdev_driver.h:18:
In file included from /root/SUSE15-64_K4.12.14_Clang5.0.1/x86_64-native-linuxapp-clang/216e6407c36b4f7dbd900afe6621ca29/dpdk/x86_64-native-linuxapp-clang/include/rte_ethdev.h:995:
In file included from /root/SUSE15-64_K4.12.14_Clang5.0.1/x86_64-native-linuxapp-clang/216e6407c36b4f7dbd900afe6621ca29/dpdk/x86_64-native-linuxapp-clang/include/rte_eth_ctrl.h:11:
/root/SUSE15-64_K4.12.14_Clang5.0.1/x86_64-native-linuxapp-clang/216e6407c36b4f7dbd900afe6621ca29/dpdk/x86_64-native-linuxapp-clang/include/rte_flow.h:3328:1: error: attribute 'section' is ignored, place it after "struct" to apply attribute to type declaration [-Werror,-Wignored-attributes]
__rte_experimental
^
/root/SUSE15-64_K4.12.14_Clang5.0.1/x86_64-native-linuxapp-clang/216e6407c36b4f7dbd900afe6621ca29/dpdk/x86_64-native-linuxapp-clang/include/rte_compat.h:18:16: note: expanded from macro '__rte_experimental'
--
In file included from /root/SUSE15-64_K4.12.14_Clang5.0.1/x86_64-native-linuxapp-clang/216e6407c36b4f7dbd900afe6621ca29/dpdk/x86_64-native-linuxapp-clang/include/rte_ethdev_driver.h:18:
In file included from /root/SUSE15-64_K4.12.14_Clang5.0.1/x86_64-native-linuxapp-clang/216e6407c36b4f7dbd900afe6621ca29/dpdk/x86_64-native-linuxapp-clang/include/rte_ethdev.h:995:
In file included from /root/SUSE15-64_K4.12.14_Clang5.0.1/x86_64-native-linuxapp-clang/216e6407c36b4f7dbd900afe6621ca29/dpdk/x86_64-native-linuxapp-clang/include/rte_eth_ctrl.h:11:
/root/SUSE15-64_K4.12.14_Clang5.0.1/x86_64-native-linuxapp-clang/216e6407c36b4f7dbd900afe6621ca29/dpdk/x86_64-native-linuxapp-clang/include/rte_flow.h:3352:1: error: attribute 'section' is ignored, place it after "struct" to apply attribute to type declaration [-Werror,-Wignored-attributes]
__rte_experimental
^
/root/SUSE15-64_K4.12.14_Clang5.0.1/x86_64-native-linuxapp-clang/216e6407c36b4f7dbd900afe6621ca29/dpdk/x86_64-native-linuxapp-clang/include/rte_compat.h:18:16: note: expanded from macro '__rte_experimental'
--
In file included from /root/SUSE15-64_K4.12.14_Clang5.0.1/x86_64-native-linuxapp-clang/216e6407c36b4f7dbd900afe6621ca29/dpdk/x86_64-native-linuxapp-clang/include/rte_ethdev_driver.h:18:
In file included from /root/SUSE15-64_K4.12.14_Clang5.0.1/x86_64-native-linuxapp-clang/216e6407c36b4f7dbd900afe6621ca29/dpdk/x86_64-native-linuxapp-clang/include/rte_ethdev.h:995:
In file included from /root/SUSE15-64_K4.12.14_Clang5.0.1/x86_64-native-linuxapp-clang/216e6407c36b4f7dbd900afe6621ca29/dpdk/x86_64-native-linuxapp-clang/include/rte_eth_ctrl.h:11:
/root/SUSE15-64_K4.12.14_Clang5.0.1/x86_64-native-linuxapp-clang/216e6407c36b4f7dbd900afe6621ca29/dpdk/x86_64-native-linuxapp-clang/include/rte_flow.h:3382:1: error: attribute 'section' is ignored, place it after "struct" to apply attribute to type declaration [-Werror,-Wignored-attributes]
__rte_experimental
^
/root/SUSE15-64_K4.12.14_Clang5.0.1/x86_64-native-linuxapp-clang/216e6407c36b4f7dbd900afe6621ca29/dpdk/x86_64-native-linuxapp-clang/include/rte_compat.h:18:16: note: expanded from macro '__rte_experimental'
__attribute__((section(".text.experimental")))
               ^
3 errors generated.
make[6]: *** [/root/SUSE15-64_K4.12.14_Clang5.0.1/x86_64-native-linuxapp-clang/216e6407c36b4f7dbd900afe6621ca29/dpdk/mk/internal/rte.compile-pre.mk:116: ark_ethdev_tx.o] Error 1
make[5]: *** [/root/SUSE15-64_K4.12.14_Clang5.0.1/x86_64-native-linuxapp-clang/216e6407c36b4f7dbd900afe6621ca29/dpdk/mk/rte.subdir.mk:37: ark] Error 2
make[5]: *** Waiting for unfinished jobs....
== Build drivers/crypto/null
  CC atl_hw_regs.o
--
  AR librte_pmd_atlantic.a
  CC nitrox_logs.o
  INSTALL-LIB librte_pmd_atlantic.a
make[4]: *** [/root/SUSE15-64_K4.12.14_Clang5.0.1/x86_64-native-linuxapp-clang/216e6407c36b4f7dbd900afe6621ca29/dpdk/mk/rte.subdir.mk:35: net] Error 2
make[4]: *** Waiting for unfinished jobs....
  CC virtio_rxtx.o
  CC virtio_cryptodev.o
--
  LD dpaa_sec.o
  AR librte_pmd_dpaa_sec.a
  INSTALL-LIB librte_pmd_dpaa_sec.a
make[3]: *** [/root/SUSE15-64_K4.12.14_Clang5.0.1/x86_64-native-linuxapp-clang/216e6407c36b4f7dbd900afe6621ca29/dpdk/mk/rte.sdkbuild.mk:51: drivers] Error 2
make[2]: *** [/root/SUSE15-64_K4.12.14_Clang5.0.1/x86_64-native-linuxapp-clang/216e6407c36b4f7dbd900afe6621ca29/dpdk/mk/rte.sdkroot.mk:99: all] Error 2
make[1]: *** [/root/SUSE15-64_K4.12.14_Clang5.0.1/x86_64-native-linuxapp-clang/216e6407c36b4f7dbd900afe6621ca29/dpdk/mk/rte.sdkinstall.mk:61: pre_install] Error 2
make: *** [/root/SUSE15-64_K4.12.14_Clang5.0.1/x86_64-native-linuxapp-clang/216e6407c36b4f7dbd900afe6621ca29/dpdk/mk/rte.sdkroot.mk:77: install] Error 2


*Makefile Build Failed #6:
OS: UB2004-64
Target: x86_64-native-linuxapp-clang
In file included from /root/UB2004-64_K5.4.0_Clang10.0.0/x86_64-native-linuxapp-clang/216e6407c36b4f7dbd900afe6621ca29/dpdk/x86_64-native-linuxapp-clang/include/rte_ethdev_driver.h:18:
In file included from /root/UB2004-64_K5.4.0_Clang10.0.0/x86_64-native-linuxapp-clang/216e6407c36b4f7dbd900afe6621ca29/dpdk/x86_64-native-linuxapp-clang/include/rte_ethdev.h:995:
In file included from /root/UB2004-64_K5.4.0_Clang10.0.0/x86_64-native-linuxapp-clang/216e6407c36b4f7dbd900afe6621ca29/dpdk/x86_64-native-linuxapp-clang/include/rte_eth_ctrl.h:11:
/root/UB2004-64_K5.4.0_Clang10.0.0/x86_64-native-linuxapp-clang/216e6407c36b4f7dbd900afe6621ca29/dpdk/x86_64-native-linuxapp-clang/include/rte_flow.h:3328:1: error: attribute 'section' is ignored, place it after "struct" to apply attribute to type declaration [-Werror,-Wignored-attributes]
__rte_experimental
^
/root/UB2004-64_K5.4.0_Clang10.0.0/x86_64-native-linuxapp-clang/216e6407c36b4f7dbd900afe6621ca29/dpdk/x86_64-native-linuxapp-clang/include/rte_compat.h:18:16: note: expanded from macro '__rte_experimental'
--
In file included from /root/UB2004-64_K5.4.0_Clang10.0.0/x86_64-native-linuxapp-clang/216e6407c36b4f7dbd900afe6621ca29/dpdk/x86_64-native-linuxapp-clang/include/rte_ethdev_driver.h:18:
In file included from /root/UB2004-64_K5.4.0_Clang10.0.0/x86_64-native-linuxapp-clang/216e6407c36b4f7dbd900afe6621ca29/dpdk/x86_64-native-linuxapp-clang/include/rte_ethdev.h:995:
In file included from /root/UB2004-64_K5.4.0_Clang10.0.0/x86_64-native-linuxapp-clang/216e6407c36b4f7dbd900afe6621ca29/dpdk/x86_64-native-linuxapp-clang/include/rte_eth_ctrl.h:11:
/root/UB2004-64_K5.4.0_Clang10.0.0/x86_64-native-linuxapp-clang/216e6407c36b4f7dbd900afe6621ca29/dpdk/x86_64-native-linuxapp-clang/include/rte_flow.h:3352:1: error: attribute 'section' is ignored, place it after "struct" to apply attribute to type declaration [-Werror,-Wignored-attributes]
__rte_experimental
^
/root/UB2004-64_K5.4.0_Clang10.0.0/x86_64-native-linuxapp-clang/216e6407c36b4f7dbd900afe6621ca29/dpdk/x86_64-native-linuxapp-clang/include/rte_compat.h:18:16: note: expanded from macro '__rte_experimental'
--
In file included from /root/UB2004-64_K5.4.0_Clang10.0.0/x86_64-native-linuxapp-clang/216e6407c36b4f7dbd900afe6621ca29/dpdk/x86_64-native-linuxapp-clang/include/rte_ethdev_driver.h:18:
In file included from /root/UB2004-64_K5.4.0_Clang10.0.0/x86_64-native-linuxapp-clang/216e6407c36b4f7dbd900afe6621ca29/dpdk/x86_64-native-linuxapp-clang/include/rte_ethdev.h:995:
In file included from /root/UB2004-64_K5.4.0_Clang10.0.0/x86_64-native-linuxapp-clang/216e6407c36b4f7dbd900afe6621ca29/dpdk/x86_64-native-linuxapp-clang/include/rte_eth_ctrl.h:11:
/root/UB2004-64_K5.4.0_Clang10.0.0/x86_64-native-linuxapp-clang/216e6407c36b4f7dbd900afe6621ca29/dpdk/x86_64-native-linuxapp-clang/include/rte_flow.h:3382:1: error: attribute 'section' is ignored, place it after "struct" to apply attribute to type declaration [-Werror,-Wignored-attributes]
__rte_experimental
^
/root/UB2004-64_K5.4.0_Clang10.0.0/x86_64-native-linuxapp-clang/216e6407c36b4f7dbd900afe6621ca29/dpdk/x86_64-native-linuxapp-clang/include/rte_compat.h:18:16: note: expanded from macro '__rte_experimental'
--
               ^
  LD ifcvf_vdpa.o
3 errors generated.
make[6]: *** [/root/UB2004-64_K5.4.0_Clang10.0.0/x86_64-native-linuxapp-clang/216e6407c36b4f7dbd900afe6621ca29/dpdk/mk/internal/rte.compile-pre.mk:116: ark_ethdev.o] Error 1
make[5]: *** [/root/UB2004-64_K5.4.0_Clang10.0.0/x86_64-native-linuxapp-clang/216e6407c36b4f7dbd900afe6621ca29/dpdk/mk/rte.subdir.mk:35: ark] Error 2
make[5]: *** Waiting for unfinished jobs....
  CC rte_aesni_mb_pmd_ops.o
3 warnings generated.
--
  LD fpga_lte_fec.o
  AR librte_pmd_atlantic.a
  INSTALL-LIB librte_pmd_atlantic.a
make[4]: *** [/root/UB2004-64_K5.4.0_Clang10.0.0/x86_64-native-linuxapp-clang/216e6407c36b4f7dbd900afe6621ca29/dpdk/mk/rte.subdir.mk:35: net] Error 2
make[4]: *** Waiting for unfinished jobs....
  CC mc/dpseci.o
  AR librte_pmd_bbdev_fpga_lte_fec.a
--
  INSTALL-LIB librte_pmd_dpaa_sec.a
  AR librte_pmd_octeontx_crypto.a
  INSTALL-LIB librte_pmd_octeontx_crypto.a
make[3]: *** [/root/UB2004-64_K5.4.0_Clang10.0.0/x86_64-native-linuxapp-clang/216e6407c36b4f7dbd900afe6621ca29/dpdk/mk/rte.sdkbuild.mk:51: drivers] Error 2
make[2]: *** [/root/UB2004-64_K5.4.0_Clang10.0.0/x86_64-native-linuxapp-clang/216e6407c36b4f7dbd900afe6621ca29/dpdk/mk/rte.sdkroot.mk:99: all] Error 2
make[1]: *** [/root/UB2004-64_K5.4.0_Clang10.0.0/x86_64-native-linuxapp-clang/216e6407c36b4f7dbd900afe6621ca29/dpdk/mk/rte.sdkinstall.mk:61: pre_install] Error 2
make: *** [/root/UB2004-64_K5.4.0_Clang10.0.0/x86_64-native-linuxapp-clang/216e6407c36b4f7dbd900afe6621ca29/dpdk/mk/rte.sdkroot.mk:77: install] Error 2


*Makefile Build Failed #7:
OS: UB2004-64
Target: x86_64-native-linuxapp-icc
  ^

compilation aborted for /root/UB2004-64_K5.4.0_ICC19.1.0/x86_64-native-linuxapp-icc/216e6407c36b4f7dbd900afe6621ca29/dpdk/drivers/net/ark/ark_ethdev.c (code 2)
make[6]: *** [/root/UB2004-64_K5.4.0_ICC19.1.0/x86_64-native-linuxapp-icc/216e6407c36b4f7dbd900afe6621ca29/dpdk/mk/internal/rte.compile-pre.mk:116: ark_ethdev.o] Error 2
make[5]: *** [/root/UB2004-64_K5.4.0_ICC19.1.0/x86_64-native-linuxapp-icc/216e6407c36b4f7dbd900afe6621ca29/dpdk/mk/rte.subdir.mk:35: ark] Error 2
make[5]: *** Waiting for unfinished jobs....
  CC isal_compress_pmd_ops.o
  PMDINFO rte_eth_af_packet.o.pmd.c
--
== Build drivers/crypto/scheduler
  AR librte_pmd_atlantic.a
  INSTALL-LIB librte_pmd_atlantic.a
make[4]: *** [/root/UB2004-64_K5.4.0_ICC19.1.0/x86_64-native-linuxapp-icc/216e6407c36b4f7dbd900afe6621ca29/dpdk/mk/rte.subdir.mk:35: net] Error 2
make[4]: *** Waiting for unfinished jobs....
== Build drivers/crypto/null
  AR librte_pmd_qat.a
--
  INSTALL-LIB librte_pmd_octeontx2_crypto.a
  AR librte_pmd_octeontx_crypto.a
  INSTALL-LIB librte_pmd_octeontx_crypto.a
make[3]: *** [/root/UB2004-64_K5.4.0_ICC19.1.0/x86_64-native-linuxapp-icc/216e6407c36b4f7dbd900afe6621ca29/dpdk/mk/rte.sdkbuild.mk:51: drivers] Error 2
make[2]: *** [/root/UB2004-64_K5.4.0_ICC19.1.0/x86_64-native-linuxapp-icc/216e6407c36b4f7dbd900afe6621ca29/dpdk/mk/rte.sdkroot.mk:99: all] Error 2
make[1]: *** [/root/UB2004-64_K5.4.0_ICC19.1.0/x86_64-native-linuxapp-icc/216e6407c36b4f7dbd900afe6621ca29/dpdk/mk/rte.sdkinstall.mk:61: pre_install] Error 2
make: *** [/root/UB2004-64_K5.4.0_ICC19.1.0/x86_64-native-linuxapp-icc/216e6407c36b4f7dbd900afe6621ca29/dpdk/mk/rte.sdkroot.mk:77: install] Error 2
DPDK STV team


More information about the test-report mailing list