[dpdk-test-report] |FAILURE| pw65139[2/2] crypto/dpaa_sec: reorganize structure members

sys_stv at intel.com sys_stv at intel.com
Fri Mar 6 04:46:59 CET 2020


Test-Label: Intel-compilation
Test-Status: FAILURE
http://dpdk.org/patch/65139

_apply issues_

Submitter: Gagandeep Singh <g.singh at nxp.com>
Date: 2020-01-27 09:07:24
Reply_mail: 20200127090724.1667-2-g.singh at nxp.com
DPDK git baseline:
	Repo:dpdk-next-crypto, CommitID: 345187bda58f2685e34a00c7bca917637395aad4
	Repo:dpdk, CommitID: f3dd46b8603fcd2ed43be38fec8add255c06b026

Apply patchset failed, the failed patch is:                                    http://dpdk.org/patch/65138
*Repo: dpdk
have dependencies on crypto drivers.
    
    /usr/bin/ld: cannot find -lrte_pmd_dpaa_sec
    collect2: error: ld returned 1 exit status
    make[9]: *** [.../mk/rte.lib.mk:100:
            librte_pmd_dpaa_event.so.20.0.2] Error 1
    
    Fixes: b0f66a68ca74 ("event/dpaa: support crypto adapter")
    Fixes: 3721c39f405a ("event/dpaa2: support crypto adapter")
    Cc: stable at dpdk.org

DPDK STV team


More information about the test-report mailing list