[dpdk-test-report] |FAILURE| pw66865[v1, 17/32] eal/trace: add alarm tracepoints

sys_stv at intel.com sys_stv at intel.com
Wed Mar 18 21:06:46 CET 2020


Test-Label: Intel-compilation
Test-Status: FAILURE
http://dpdk.org/patch/66865

_Compilation issues_

Submitter: Jerin Jacob Kollanukkaran <jerinj at marvell.com>
Date: 2020-03-18 19:02:26
Reply_mail: 20200318190241.3150971-18-jerinj at marvell.com
DPDK git baseline: Repo:dpdk, CommitID: 716f9bb42ecb6df640d4dffebe1ec55aaab29ba0

Makefile build Summary: 23 Builds Done, 23 Successful, 0 Failures

Meson build Summary: 8 Builds Done, 2 Successful, 6 Failures

               +==============================================+===========+==========+
               |                   Makefile                   |   Meson   | Document |
+----------------+------+-------+------+------------+-----------+-----------+----------+
| os             | gcc  | clang | icc  | gcc+shared | gcc+debug | gcc/clang | pdf/html |
+----------------+------+-------+------+------------+-----------+-----------+----------+
| RHEL80-64      | pass |       |      |            |           |           |          |
| UB1804-64      | pass | pass  | pass |            |           | FAIL      | pass     |
| UB1604-32      | pass |       |      |            |           | FAIL      |          |
| CENTOS77-64    | pass | pass  | pass | pass       | pass      | FAIL      |          |
| UB1604-64      | pass | pass  |      |            |           |           |          |
| WIN10-64       |      |       |      |            |           | pass      |          |
| UB1910-64      | pass |       |      |            |           |           |          |
| FC31-64        | pass | pass  |      |            |           | FAIL      |          |
| CENTOS80-64    | pass |       |      |            |           |           |          |
| FreeBSD1201-64 | pass | pass  |      | pass       | pass      | FAIL      |          |
| RHEL77-64      | pass |       |      |            |           |           |          |
| SUSE15-64      | pass | pass  |      |            |           | FAIL      |          |
+----------------+------+-------+------+------------+-----------+-----------+----------+

Test environment and configuration as below:

** Makefile build **


OS: UB1804-64
	Kernel Version: 4.15.0-20-generic
	CPU info: Intel(R) Xeon(R) CPU E5-2699 v3 @ 2.30GHz
	GCC Version: gcc (Ubuntu 7.3.0-16ubuntu3) 7.3.0
	Clang Version: 6.0.0-1ubuntu2 (tags/RELEASE_600/final)
	x86_64-native-linuxapp-clang
	x86_64-native-linuxapp-icc
	x86_64-native-linuxapp-gcc


OS: UB1604-32
	Kernel Version: 4.4.0-131-generic
	CPU info: Intel(R) Xeon(R) Platinum 8180 CPU @ 2.50GHz
	GCC Version: gcc (Ubuntu 5.4.0-6ubuntu1~16.04.11) 5.4.0 20160609
	Clang Version: 3.8.0-2ubuntu4 (tags/RELEASE_380/final)
	i686-native-linuxapp-gcc


OS: CENTOS77-64
	Kernel Version: 3.10.0-1062.9.1.el7.x86_64
	CPU info: Intel(R) Xeon(R) CPU E5-2699 v3 @ 2.30GHz
	GCC Version: gcc (GCC) 4.8.5 20150623 (Red Hat 4.8.5-39)
	Clang Version: 3.4.2 (tags/RELEASE_34/dot2-final)
	x86_64-native-linuxapp-clang
	x86_64-native-linuxapp-gcc+shared
	x86_64-native-linuxapp-gcc
	x86_64-native-linuxapp-gcc+debug
	x86_64-native-linuxapp-icc


OS: UB1604-64
	Kernel Version: 4.4.0-174-generic
	CPU info: Intel(R) Xeon(R) CPU E5-2699 v3 @ 2.30GHz
	GCC Version: gcc (Ubuntu 5.4.0-6ubuntu1~16.04.12) 5.4.0 20160609
	Clang Version: 3.8.0-2ubuntu4 (tags/RELEASE_380/final)
	x86_64-native-linuxapp-clang
	x86_64-native-linuxapp-gcc


OS: CENTOS80-64
	Kernel Version: 4.18.0-80.11.2.el8_0.x86_64
	CPU info: Intel(R) Xeon(R) CPU E5-2699 v3 @ 2.30GHz
	GCC Version: gcc (GCC) 8.2.1 20180905 (Red Hat 8.2.1-3)
	Clang Version: 7.0.1 (tags/RELEASE_701/final)
	x86_64-native-linuxapp-gcc


OS: UB1910-64
	Kernel Version: 5.3.0-18-generic
	CPU info: Intel(R) Xeon(R) Platinum 8180 CPU @ 2.50GHz
	GCC Version: gcc (Ubuntu 9.2.1-9ubuntu2) 9.2.1 20191008
	Clang Version: 9.0.0-2 (tags/RELEASE_900/final)
	x86_64-native-linuxapp-gcc


OS: FC31-64
	Kernel Version: 5.3.15-300.fc31.x86_64
	CPU info: Intel(R) Xeon(R) CPU E5-2699 v4 @ 2.20GHz
	GCC Version: gcc (GCC) 9.2.1 20190827 (Red Hat 9.2.1-1)
	Clang Version: 9.0.0 (Fedora 9.0.0-1.fc31)
	x86_64-native-linuxapp-gcc
	x86_64-native-linuxapp-clang


OS: RHEL80-64
	Kernel Version: 4.18.0-80.el8.x86_64
	CPU info: Intel(R) Xeon(R) CPU E5-2699 v4 @ 2.20GHz
	GCC Version: gcc (GCC) 8.2.1 20180905 (Red Hat 8.2.1-3)
	Clang Version: 6.0.1 (tags/RELEASE_601/final)
	x86_64-native-linuxapp-gcc


OS: FreeBSD1201-64
	Kernel Version: 12.1-RELEASE
	CPU info: Intel(R) Xeon(R) CPU E5-2699 v3 @ 2.30GHz (2294.73-MHz K8-class CPU)
	GCC Version: gcc (FreeBSD Ports Collection) 9.2.0
	Clang Version: 8.0.1 (tags/RELEASE_801/final 366581) (based on LLVM 8.0.1)
	x86_64-native-bsdapp-gcc+shared
	x86_64-native-bsdapp-gcc+debug
	x86_64-native-bsdapp-gcc
	x86_64-native-bsdapp-clang


OS: RHEL77-64
	Kernel Version: 3.10.0-1062.9.1.el7.x86_64
	CPU info: Intel(R) Xeon(R) CPU E5-2699 v4 @ 2.20GHz
	GCC Version: gcc (GCC) 4.8.5 20150623 (Red Hat 4.8.5-39)
	Clang Version: 3.4.2 (tags/RELEASE_34/dot2-final)
	x86_64-native-linuxapp-gcc


OS: SUSE15-64
	Kernel Version: 4.12.14-lp150.11-default
	CPU info: Intel(R) Xeon(R) CPU E5-2699 v4 @ 2.20GHz
	GCC Version: gcc (SUSE Linux) 7.3.1 20180323 [gcc-7-branch revision 258812]
	Clang Version: 5.0.1 (tags/RELEASE_501/final 312548)
	x86_64-native-linuxapp-gcc
	x86_64-native-linuxapp-clang


** Meson build **


OS: UB1804-64
	Kernel Version: 4.15.0-20-generic
	CPU info: Intel(R) Xeon(R) CPU E5-2699 v4 @ 2.20GHz
	GCC Version: gcc (Ubuntu 7.3.0-27ubuntu1~18.04) 7.3.0
	Clang Version: 6.0.0-1ubuntu2 (tags/RELEASE_600/final)
	x86_64-native-linuxapp-doc
	./build-gcc-static
	./build-gcc-shared
	./build-clang-static
	./build-clang-shared
	./build-x86-default


OS: UB1604-32
	Kernel Version: 4.4.0-131-generic
	CPU info: Intel(R) Xeon(R) CPU E5-2699 v4 @ 2.20GHz
	GCC Version: gcc (Ubuntu 5.4.0-6ubuntu1~16.04.11) 5.4.0 20160609
	Clang Version: 3.8.0-2ubuntu4 (tags/RELEASE_380/final)
	./build-gcc-static
	./build-gcc-shared
	./build-clang-static
	./build-clang-shared
	./build-x86-default


OS: CENTOS77-64
	Kernel Version: 3.10.0-1062.12.1.el7.x86_64
	CPU info: Intel(R) Xeon(R) CPU E5-2699 v4 @ 2.20GHz
	GCC Version: gcc (GCC) 4.8.5 20150623 (Red Hat 4.8.5-39)
	Clang Version: 3.4.2 (tags/RELEASE_34/dot2-final)
	./build-gcc-static
	./build-gcc-shared
	./build-clang-static
	./build-clang-shared
	./build-x86-default


OS: WIN10-64
	Kernel Version: N/A
	CPU info: N/A
	GCC Version: N/A
	Clang Version: Clang 8.0.0
	x86_64-windows-clang


OS: FC31-64
	Kernel Version: 5.4.18-200.fc31.x86_64
	CPU info: Intel(R) Xeon(R) CPU E5-2699 v4 @ 2.20GHz
	GCC Version: gcc (GCC) 9.2.1 20190827 (Red Hat 9.2.1-1)
	Clang Version: 9.0.0 (Fedora 9.0.0-1.fc31)
	./build-gcc-static
	./build-gcc-shared
	./build-clang-static
	./build-clang-shared
	./build-x86-default


OS: FreeBSD1201-64
	Kernel Version: 12.1-RELEASE
	CPU info: Intel(R) Xeon(R) CPU E5-2699 v4 @ 2.20GHz (2194.98-MHz K8-class CPU)
	GCC Version: gcc (FreeBSD Ports Collection) 9.2.0
	Clang Version: 8.0.1 (tags/RELEASE_801/final 366581) (based on LLVM 8.0.1)
	./build-gcc-static
	./build-gcc-shared
	./build-clang-static
	./build-clang-shared
	./build-x86-default


OS: SUSE15-64
	Kernel Version: 4.12.14-lp150.12.82-default
	CPU info: Intel(R) Xeon(R) CPU E5-2699 v4 @ 2.20GHz
	GCC Version: gcc (SUSE Linux) 7.4.1 20190905 [gcc-7-branch revision 275407]
	Clang Version: 5.0.1 (tags/RELEASE_501/final 312548)
	./build-gcc-static
	./build-gcc-shared
	./build-clang-static
	./build-clang-shared
	./build-x86-default


*Meson Build Failed #1:
OS: CENTOS77-64
Target:./build-gcc-static
FAILED: lib/76b5a35@@rte_eal at sta/librte_eal_common_eal_common_trace.c.o 
gcc -Ilib/76b5a35@@rte_eal at sta -Ilib -I../lib -I. -I../ -Iconfig -I../config -Ilib/librte_eal/common/include -I../lib/librte_eal/common/include -I../lib/librte_eal/linux/eal/include -Ilib/librte_eal/common -I../lib/librte_eal/common -Ilib/librte_eal/common/include/arch/x86 -I../lib/librte_eal/common/include/arch/x86 -Ilib/librte_eal -I../lib/librte_eal -Ilib/librte_kvargs -I../lib/librte_kvargs -pipe -D_FILE_OFFSET_BITS=64 -Wall -Winvalid-pch -Werror -O2 -g -include rte_config.h -Wextra -Wcast-qual -Wdeprecated -Wformat-nonliteral -Wformat-security -Wmissing-declarations -Wmissing-prototypes -Wnested-externs -Wold-style-definition -Wpointer-arith -Wsign-compare -Wstrict-prototypes -Wundef -Wwrite-strings -Wno-missing-field-initializers -D_GNU_SOURCE -fPIC -march=native -DHAVE_GETOPT_H -DHAVE_GETOPT -DHAVE_GETOPT_LONG -DALLOW_EXPERIMENTAL_API -MD -MQ 'lib/76b5a35@@rte_eal at sta/librte_eal_common_eal_common_trace.c.o' -MF 'lib/76b5a35@@rte_eal at sta/librte_eal_common_eal_common_trace.c.o.d' -o 'lib/76b5a35@@rte_eal at sta/librte_eal_common_eal_common_trace.c.o' -c ../lib/librte_eal/common/eal_common_trace.c
../lib/librte_eal/common/eal_common_trace.c: In function ‘rte_trace_pattern’:
../lib/librte_eal/common/eal_common_trace.c:304:6: error: ‘rc’ may be used uninitialized in this function [-Werror=maybe-uninitialized]
   if (rc < 0)
      ^
../lib/librte_eal/common/eal_common_trace.c: In function ‘rte_trace_regexp’:
../lib/librte_eal/common/eal_common_trace.c:332:6: error: ‘rc’ may be used uninitialized in this function [-Werror=maybe-uninitialized]
   if (rc < 0)
      ^
cc1: all warnings being treated as errors
[31/2249] Compiling C object 'lib/76b5a35@@rte_eal at sta/librte_eal_common_eal_common_proc.c.o'.
[32/2249] Compiling C object 'lib/76b5a35@@rte_eal at sta/librte_eal_common_malloc_elem.c.o'.
[33/2249] Compiling C object 'lib/76b5a35@@rte_eal at sta/librte_eal_common_hotplug_mp.c.o'.
[34/2249] Generating kvargs.exp_chk with a meson_exe.py custom command.
[35/2249] Compiling C object 'lib/76b5a35@@rte_eal at sta/librte_eal_common_rte_keepalive.c.o'.
[36/2249] Compiling C object 'lib/76b5a35@@rte_eal at sta/librte_eal_common_eal_common_trace_utils.c.o'.
[37/2249] Compiling C object 'lib/76b5a35@@rte_eal at sta/librte_eal_common_malloc_mp.c.o'.
[38/2249] Compiling C object 'lib/76b5a35@@rte_eal at sta/librte_eal_common_eal_common_options.c.o'.
[39/2249] Compiling C object 'lib/76b5a35@@rte_eal at sta/librte_eal_common_malloc_heap.c.o'.
ninja: build stopped: subcommand failed




*Meson Build Failed #2:
OS: UB1604-32
Target:./build-gcc-static
FAILED: examples/c590b3c@@dpdk-eventdev_pipeline at exe/eventdev_pipeline_main.c.o 
gcc -Iexamples/c590b3c@@dpdk-eventdev_pipeline at exe -Iexamples -I../examples -Iexamples/eventdev_pipeline -I../examples/eventdev_pipeline -I. -I../ -Iconfig -I../config -Ilib/librte_eal/common/include -I../lib/librte_eal/common/include -I../lib/librte_eal/linux/eal/include -Ilib/librte_eal/common -I../lib/librte_eal/common -Ilib/librte_eal/common/include/arch/x86 -I../lib/librte_eal/common/include/arch/x86 -Ilib/librte_eal -I../lib/librte_eal -Ilib/librte_kvargs -I../lib/librte_kvargs -Ilib/librte_mempool -I../lib/librte_mempool -Ilib/librte_ring -I../lib/librte_ring -Ilib/librte_net -I../lib/librte_net -Ilib/librte_mbuf -I../lib/librte_mbuf -Ilib/librte_ethdev -I../lib/librte_ethdev -Ilib/librte_meter -I../lib/librte_meter -Ilib/librte_cmdline -I../lib/librte_cmdline -Ilib/librte_eventdev -I../lib/librte_eventdev -Ilib/librte_hash -I../lib/librte_hash -Ilib/librte_timer -I../lib/librte_timer -Ilib/librte_cryptodev -I../lib/librte_cryptodev -fdiagnostics-color=always -pipe -D_FILE_OFFSET_BITS=64 -Wall -Winvalid-pch -Werror -O2 -g -include rte_config.h -Wextra -Wcast-qual -Wdeprecated -Wformat-nonliteral -Wformat-security -Wmissing-declarations -Wmissing-prototypes -Wnested-externs -Wold-style-definition -Wpointer-arith -Wsign-compare -Wstrict-prototypes -Wundef -Wwrite-strings -Wno-missing-field-initializers -Wno-pointer-to-int-cast -D_GNU_SOURCE -march=native -MD -MQ 'examples/c590b3c@@dpdk-eventdev_pipeline at exe/eventdev_pipeline_main.c.o' -MF 'examples/c590b3c@@dpdk-eventdev_pipeline at exe/eventdev_pipeline_main.c.o.d' -o 'examples/c590b3c@@dpdk-eventdev_pipeline at exe/eventdev_pipeline_main.c.o' -c ../examples/eventdev_pipeline/main.c
In file included from ../lib/librte_eal/common/include/rte_trace.h:580:0,
                 from ../lib/librte_mempool/rte_trace_mempool_fp.h:18,
                 from ../lib/librte_mempool/rte_mempool.h:54,
                 from ../examples/eventdev_pipeline/pipeline_common.h:10,
                 from ../examples/eventdev_pipeline/main.c:11:
../lib/librte_eal/common/include/rte_trace_provider.h: In function ‘__rte_trace_mem_get’:
../lib/librte_eal/common/include/rte_trace_provider.h:54:3: error: ‘__rte_trace_mem_per_thread_alloc’ is deprecated: Symbol is not yet part of stable ABI [-Werror=deprecated-declarations]
   __rte_trace_mem_per_thread_alloc();
   ^
In file included from ../lib/librte_mempool/rte_trace_mempool_fp.h:18:0,
                 from ../lib/librte_mempool/rte_mempool.h:54,
                 from ../examples/eventdev_pipeline/pipeline_common.h:10,
                 from ../examples/eventdev_pipeline/main.c:11:
../lib/librte_eal/common/include/rte_trace.h:534:6: note: declared here
 void __rte_trace_mem_per_thread_alloc(void);
      ^
cc1: all warnings being treated as errors
[1808/1983] Compiling C object 'examples/c590b3c@@dpdk-bond at exe/bond_main.c.o'.
[1809/1983] Compiling C object 'examples/c590b3c@@dpdk-fips_validation at exe/fips_validation_fips_validation_sha.c.o'.
[1810/1983] Compiling C object 'examples/c590b3c@@dpdk-bbdev_app at exe/bbdev_app_main.c.o'.
[1811/1983] Compiling C object 'examples/c590b3c@@dpdk-fips_validation at exe/fips_validation_fips_dev_self_test.c.o'.
[1812/1983] Compiling C object 'app/test/3062f5d@@dpdk-test at exe/test_memcpy_perf.c.o'.
[1813/1983] Compiling C object 'app/test/3062f5d@@dpdk-test at exe/test_trace_perf.c.o'.
[1814/1983] Compiling C object 'app/test/3062f5d@@dpdk-test at exe/test_ring.c.o'.
[1815/1983] Compiling C object 'drivers/a715181@@tmp_rte_pmd_octeontx2_event at sta/event_octeontx2_otx2_worker.c.o'.
[1816/1983] Compiling C object 'drivers/a715181@@tmp_rte_pmd_octeontx2_event at sta/event_octeontx2_otx2_worker_dual.c.o'.
ninja: build stopped: subcommand failed




*Meson Build Failed #3:
OS: FC31-64
Target:./build-gcc-static
FAILED: examples/c590b3c@@dpdk-eventdev_pipeline at exe/eventdev_pipeline_pipeline_worker_generic.c.o 
gcc -Iexamples/c590b3c@@dpdk-eventdev_pipeline at exe -Iexamples -I../examples -Iexamples/eventdev_pipeline -I../examples/eventdev_pipeline -I. -I../ -Iconfig -I../config -Ilib/librte_eal/common/include -I../lib/librte_eal/common/include -I../lib/librte_eal/linux/eal/include -Ilib/librte_eal/common -I../lib/librte_eal/common -Ilib/librte_eal/common/include/arch/x86 -I../lib/librte_eal/common/include/arch/x86 -Ilib/librte_eal -I../lib/librte_eal -Ilib/librte_kvargs -I../lib/librte_kvargs -Ilib/librte_mempool -I../lib/librte_mempool -Ilib/librte_ring -I../lib/librte_ring -Ilib/librte_net -I../lib/librte_net -Ilib/librte_mbuf -I../lib/librte_mbuf -Ilib/librte_ethdev -I../lib/librte_ethdev -Ilib/librte_meter -I../lib/librte_meter -Ilib/librte_cmdline -I../lib/librte_cmdline -Ilib/librte_eventdev -I../lib/librte_eventdev -Ilib/librte_hash -I../lib/librte_hash -Ilib/librte_timer -I../lib/librte_timer -Ilib/librte_cryptodev -I../lib/librte_cryptodev -fdiagnostics-color=always -pipe -D_FILE_OFFSET_BITS=64 -Wall -Winvalid-pch -Werror -O2 -g -include rte_config.h -Wextra -Wcast-qual -Wdeprecated -Wformat-nonliteral -Wformat-security -Wmissing-declarations -Wmissing-prototypes -Wnested-externs -Wold-style-definition -Wpointer-arith -Wsign-compare -Wstrict-prototypes -Wundef -Wwrite-strings -Wno-address-of-packed-member -Wno-packed-not-aligned -Wno-missing-field-initializers -D_GNU_SOURCE -march=native -Wno-format-truncation -MD -MQ 'examples/c590b3c@@dpdk-eventdev_pipeline at exe/eventdev_pipeline_pipeline_worker_generic.c.o' -MF 'examples/c590b3c@@dpdk-eventdev_pipeline at exe/eventdev_pipeline_pipeline_worker_generic.c.o.d' -o 'examples/c590b3c@@dpdk-eventdev_pipeline at exe/eventdev_pipeline_pipeline_worker_generic.c.o' -c ../examples/eventdev_pipeline/pipeline_worker_generic.c
In file included from ../lib/librte_eal/common/include/rte_trace.h:580,
                 from ../lib/librte_mempool/rte_trace_mempool_fp.h:18,
                 from ../lib/librte_mempool/rte_mempool.h:54,
                 from ../examples/eventdev_pipeline/pipeline_common.h:10,
                 from ../examples/eventdev_pipeline/pipeline_worker_generic.c:7:
../lib/librte_eal/common/include/rte_trace_provider.h: In function ‘__rte_trace_mem_get’:
../lib/librte_eal/common/include/rte_trace_provider.h:54:3: error: ‘__rte_trace_mem_per_thread_alloc’ is deprecated: Symbol is not yet part of stable ABI [-Werror=deprecated-declarations]
   54 |   __rte_trace_mem_per_thread_alloc();
      |   ^~~~~~~~~~~~~~~~~~~~~~~~~~~~~~~~
In file included from ../lib/librte_mempool/rte_trace_mempool_fp.h:18,
                 from ../lib/librte_mempool/rte_mempool.h:54,
                 from ../examples/eventdev_pipeline/pipeline_common.h:10,
                 from ../examples/eventdev_pipeline/pipeline_worker_generic.c:7:
../lib/librte_eal/common/include/rte_trace.h:534:6: note: declared here
  534 | void __rte_trace_mem_per_thread_alloc(void);
      |      ^~~~~~~~~~~~~~~~~~~~~~~~~~~~~~~~
cc1: all warnings being treated as errors
[2058/2258] Compiling C object 'examples/c590b3c@@dpdk-fips_validation at exe/fips_validation_fips_validation_tdes.c.o'.
[2059/2258] Compiling C object 'examples/c590b3c@@dpdk-bbdev_app at exe/bbdev_app_main.c.o'.
[2060/2258] Compiling C object 'examples/c590b3c@@dpdk-eventdev_pipeline at exe/eventdev_pipeline_main.c.o'.
FAILED: examples/c590b3c@@dpdk-eventdev_pipeline at exe/eventdev_pipeline_main.c.o 
gcc -Iexamples/c590b3c@@dpdk-eventdev_pipeline at exe -Iexamples -I../examples -Iexamples/eventdev_pipeline -I../examples/eventdev_pipeline -I. -I../ -Iconfig -I../config -Ilib/librte_eal/common/include -I../lib/librte_eal/common/include -I../lib/librte_eal/linux/eal/include -Ilib/librte_eal/common -I../lib/librte_eal/common -Ilib/librte_eal/common/include/arch/x86 -I../lib/librte_eal/common/include/arch/x86 -Ilib/librte_eal -I../lib/librte_eal -Ilib/librte_kvargs -I../lib/librte_kvargs -Ilib/librte_mempool -I../lib/librte_mempool -Ilib/librte_ring -I../lib/librte_ring -Ilib/librte_net -I../lib/librte_net -Ilib/librte_mbuf -I../lib/librte_mbuf -Ilib/librte_ethdev -I../lib/librte_ethdev -Ilib/librte_meter -I../lib/librte_meter -Ilib/librte_cmdline -I../lib/librte_cmdline -Ilib/librte_eventdev -I../lib/librte_eventdev -Ilib/librte_hash -I../lib/librte_hash -Ilib/librte_timer -I../lib/librte_timer -Ilib/librte_cryptodev -I../lib/librte_cryptodev -fdiagnostics-color=always -pipe -D_FILE_OFFSET_BITS=64 -Wall -Winvalid-pch -Werror -O2 -g -include rte_config.h -Wextra -Wcast-qual -Wdeprecated -Wformat-nonliteral -Wformat-security -Wmissing-declarations -Wmissing-prototypes -Wnested-externs -Wold-style-definition -Wpointer-arith -Wsign-compare -Wstrict-prototypes -Wundef -Wwrite-strings -Wno-address-of-packed-member -Wno-packed-not-aligned -Wno-missing-field-initializers -D_GNU_SOURCE -march=native -Wno-format-truncation -MD -MQ 'examples/c590b3c@@dpdk-eventdev_pipeline at exe/eventdev_pipeline_main.c.o' -MF 'examples/c590b3c@@dpdk-eventdev_pipeline at exe/eventdev_pipeline_main.c.o.d' -o 'examples/c590b3c@@dpdk-eventdev_pipeline at exe/eventdev_pipeline_main.c.o' -c ../examples/eventdev_pipeline/main.c
In file included from ../lib/librte_eal/common/include/rte_trace.h:580,
                 from ../lib/librte_mempool/rte_trace_mempool_fp.h:18,
                 from ../lib/librte_mempool/rte_mempool.h:54,
                 from ../examples/eventdev_pipeline/pipeline_common.h:10,
                 from ../examples/eventdev_pipeline/main.c:11:
../lib/librte_eal/common/include/rte_trace_provider.h: In function ‘__rte_trace_mem_get’:
../lib/librte_eal/common/include/rte_trace_provider.h:54:3: error: ‘__rte_trace_mem_per_thread_alloc’ is deprecated: Symbol is not yet part of stable ABI [-Werror=deprecated-declarations]
   54 |   __rte_trace_mem_per_thread_alloc();
      |   ^~~~~~~~~~~~~~~~~~~~~~~~~~~~~~~~
In file included from ../lib/librte_mempool/rte_trace_mempool_fp.h:18,
                 from ../lib/librte_mempool/rte_mempool.h:54,
                 from ../examples/eventdev_pipeline/pipeline_common.h:10,
                 from ../examples/eventdev_pipeline/main.c:11:
../lib/librte_eal/common/include/rte_trace.h:534:6: note: declared here
  534 | void __rte_trace_mem_per_thread_alloc(void);
      |      ^~~~~~~~~~~~~~~~~~~~~~~~~~~~~~~~
cc1: all warnings being treated as errors
[2061/2258] Compiling C object 'examples/c590b3c@@dpdk-bond at exe/bond_main.c.o'.
[2062/2258] Compiling C object 'app/test/3062f5d@@dpdk-test at exe/test_compressdev.c.o'.
[2063/2258] Compiling C object 'examples/c590b3c@@dpdk-distributor at exe/distributor_main.c.o'.
[2064/2258] Compiling C object 'app/test/3062f5d@@dpdk-test at exe/test_memcpy_perf.c.o'.
[2065/2258] Compiling C object 'app/test/3062f5d@@dpdk-test at exe/test_trace_perf.c.o'.
[2066/2258] Compiling C object 'app/test/3062f5d@@dpdk-test at exe/test_ring.c.o'.
[2067/2258] Compiling C object 'drivers/a715181@@tmp_rte_pmd_octeontx2_event at sta/event_octeontx2_otx2_worker.c.o'.
[2068/2258] Compiling C object 'drivers/a715181@@tmp_rte_pmd_octeontx2_event at sta/event_octeontx2_otx2_worker_dual.c.o'.
ninja: build stopped: subcommand failed




*Meson Build Failed #4:
OS: UB1804-64
Target:./build-gcc-static
FAILED: examples/c590b3c@@dpdk-eventdev_pipeline at exe/eventdev_pipeline_main.c.o 
gcc -Iexamples/c590b3c@@dpdk-eventdev_pipeline at exe -Iexamples -I../examples -Iexamples/eventdev_pipeline -I../examples/eventdev_pipeline -I. -I../ -Iconfig -I../config -Ilib/librte_eal/common/include -I../lib/librte_eal/common/include -I../lib/librte_eal/linux/eal/include -Ilib/librte_eal/common -I../lib/librte_eal/common -Ilib/librte_eal/common/include/arch/x86 -I../lib/librte_eal/common/include/arch/x86 -Ilib/librte_eal -I../lib/librte_eal -Ilib/librte_kvargs -I../lib/librte_kvargs -Ilib/librte_mempool -I../lib/librte_mempool -Ilib/librte_ring -I../lib/librte_ring -Ilib/librte_net -I../lib/librte_net -Ilib/librte_mbuf -I../lib/librte_mbuf -Ilib/librte_ethdev -I../lib/librte_ethdev -Ilib/librte_meter -I../lib/librte_meter -Ilib/librte_cmdline -I../lib/librte_cmdline -Ilib/librte_eventdev -I../lib/librte_eventdev -Ilib/librte_hash -I../lib/librte_hash -Ilib/librte_timer -I../lib/librte_timer -Ilib/librte_cryptodev -I../lib/librte_cryptodev -fdiagnostics-color=always -pipe -D_FILE_OFFSET_BITS=64 -Wall -Winvalid-pch -Werror -O2 -g -include rte_config.h -Wextra -Wcast-qual -Wdeprecated -Wformat-nonliteral -Wformat-security -Wmissing-declarations -Wmissing-prototypes -Wnested-externs -Wold-style-definition -Wpointer-arith -Wsign-compare -Wstrict-prototypes -Wundef -Wwrite-strings -Wno-missing-field-initializers -D_GNU_SOURCE -march=native -mno-avx512f -Wno-format-truncation -MD -MQ 'examples/c590b3c@@dpdk-eventdev_pipeline at exe/eventdev_pipeline_main.c.o' -MF 'examples/c590b3c@@dpdk-eventdev_pipeline at exe/eventdev_pipeline_main.c.o.d' -o 'examples/c590b3c@@dpdk-eventdev_pipeline at exe/eventdev_pipeline_main.c.o' -c ../examples/eventdev_pipeline/main.c
In file included from ../lib/librte_eal/common/include/rte_trace.h:580:0,
                 from ../lib/librte_mempool/rte_trace_mempool_fp.h:18,
                 from ../lib/librte_mempool/rte_mempool.h:54,
                 from ../examples/eventdev_pipeline/pipeline_common.h:10,
                 from ../examples/eventdev_pipeline/main.c:11:
../lib/librte_eal/common/include/rte_trace_provider.h: In function ‘__rte_trace_mem_get’:
../lib/librte_eal/common/include/rte_trace_provider.h:54:3: error: ‘__rte_trace_mem_per_thread_alloc’ is deprecated: Symbol is not yet part of stable ABI [-Werror=deprecated-declarations]
   __rte_trace_mem_per_thread_alloc();
   ^~~~~~~~~~~~~~~~~~~~~~~~~~~~~~~~
In file included from ../lib/librte_mempool/rte_trace_mempool_fp.h:18:0,
                 from ../lib/librte_mempool/rte_mempool.h:54,
                 from ../examples/eventdev_pipeline/pipeline_common.h:10,
                 from ../examples/eventdev_pipeline/main.c:11:
../lib/librte_eal/common/include/rte_trace.h:534:6: note: declared here
 void __rte_trace_mem_per_thread_alloc(void);
      ^~~~~~~~~~~~~~~~~~~~~~~~~~~~~~~~
cc1: all warnings being treated as errors
[1967/2171] Compiling C object 'examples/c590b3c@@dpdk-bond at exe/bond_main.c.o'.
[1968/2171] Compiling C object 'app/test/3062f5d@@dpdk-test at exe/test_compressdev.c.o'.
[1969/2171] Compiling C object 'examples/c590b3c@@dpdk-bbdev_app at exe/bbdev_app_main.c.o'.
[1970/2171] Compiling C object 'app/test/3062f5d@@dpdk-test at exe/test_link_bonding_mode4.c.o'.
[1971/2171] Compiling C object 'app/test/3062f5d@@dpdk-test at exe/test_memcpy_perf.c.o'.
[1972/2171] Compiling C object 'app/test/3062f5d@@dpdk-test at exe/test_trace_perf.c.o'.
[1973/2171] Compiling C object 'drivers/a715181@@tmp_rte_pmd_octeontx2_event at sta/event_octeontx2_otx2_worker.c.o'.
[1974/2171] Compiling C object 'drivers/a715181@@tmp_rte_pmd_octeontx2_event at sta/event_octeontx2_otx2_worker_dual.c.o'.
[1975/2171] Compiling C object 'app/test/3062f5d@@dpdk-test at exe/test_ring.c.o'.
ninja: build stopped: subcommand failed




*Meson Build Failed #5:
OS: FreeBSD1201-64
Target:./build-gcc-static
FAILED: examples/c590b3c@@dpdk-eventdev_pipeline at exe/eventdev_pipeline_main.c.o 
gcc -Iexamples/c590b3c@@dpdk-eventdev_pipeline at exe -Iexamples -I../examples -Iexamples/eventdev_pipeline -I../examples/eventdev_pipeline -I. -I../ -Iconfig -I../config -Ilib/librte_eal/common/include -I../lib/librte_eal/common/include -I../lib/librte_eal/freebsd/eal/include -Ilib/librte_eal/common -I../lib/librte_eal/common -Ilib/librte_eal/common/include/arch/x86 -I../lib/librte_eal/common/include/arch/x86 -Ilib/librte_eal -I../lib/librte_eal -Ilib/librte_kvargs -I../lib/librte_kvargs -Ilib/librte_mempool -I../lib/librte_mempool -Ilib/librte_ring -I../lib/librte_ring -Ilib/librte_net -I../lib/librte_net -Ilib/librte_mbuf -I../lib/librte_mbuf -Ilib/librte_ethdev -I../lib/librte_ethdev -Ilib/librte_meter -I../lib/librte_meter -Ilib/librte_cmdline -I../lib/librte_cmdline -Ilib/librte_eventdev -I../lib/librte_eventdev -Ilib/librte_hash -I../lib/librte_hash -Ilib/librte_timer -I../lib/librte_timer -Ilib/librte_cryptodev -I../lib/librte_cryptodev -fdiagnostics-color=always -pipe -D_FILE_OFFSET_BITS=64 -Wall -Winvalid-pch -Werror -O2 -g -include rte_config.h -Wextra -Wcast-qual -Wdeprecated -Wformat-nonliteral -Wformat-security -Wmissing-declarations -Wmissing-prototypes -Wnested-externs -Wold-style-definition -Wpointer-arith -Wsign-compare -Wstrict-prototypes -Wundef -Wwrite-strings -Wno-address-of-packed-member -Wno-packed-not-aligned -Wno-missing-field-initializers -D_GNU_SOURCE -D__BSD_VISIBLE -march=native -Wno-format-truncation -MD -MQ 'examples/c590b3c@@dpdk-eventdev_pipeline at exe/eventdev_pipeline_main.c.o' -MF 'examples/c590b3c@@dpdk-eventdev_pipeline at exe/eventdev_pipeline_main.c.o.d' -o 'examples/c590b3c@@dpdk-eventdev_pipeline at exe/eventdev_pipeline_main.c.o' -c ../examples/eventdev_pipeline/main.c
In file included from ../lib/librte_eal/common/include/rte_trace.h:580,
                 from ../lib/librte_mempool/rte_trace_mempool_fp.h:18,
                 from ../lib/librte_mempool/rte_mempool.h:54,
                 from ../examples/eventdev_pipeline/pipeline_common.h:10,
                 from ../examples/eventdev_pipeline/main.c:11:
../lib/librte_eal/common/include/rte_trace_provider.h: In function '__rte_trace_mem_get':
../lib/librte_eal/common/include/rte_trace_provider.h:54:3: error: '__rte_trace_mem_per_thread_alloc' is deprecated: Symbol is not yet part of stable ABI [-Werror=deprecated-declarations]
   54 |   __rte_trace_mem_per_thread_alloc();
      |   ^~~~~~~~~~~~~~~~~~~~~~~~~~~~~~~~
In file included from ../lib/librte_mempool/rte_trace_mempool_fp.h:18,
                 from ../lib/librte_mempool/rte_mempool.h:54,
                 from ../examples/eventdev_pipeline/pipeline_common.h:10,
                 from ../examples/eventdev_pipeline/main.c:11:
../lib/librte_eal/common/include/rte_trace.h:534:6: note: declared here
  534 | void __rte_trace_mem_per_thread_alloc(void);
      |      ^~~~~~~~~~~~~~~~~~~~~~~~~~~~~~~~
cc1: all warnings being treated as errors
[1508/1650] Compiling C object 'examples/c590b3c@@dpdk-bond at exe/bond_main.c.o'.
[1509/1650] Compiling C object 'examples/c590b3c@@dpdk-eventdev_pipeline at exe/eventdev_pipeline_pipeline_worker_generic.c.o'.
FAILED: examples/c590b3c@@dpdk-eventdev_pipeline at exe/eventdev_pipeline_pipeline_worker_generic.c.o 
gcc -Iexamples/c590b3c@@dpdk-eventdev_pipeline at exe -Iexamples -I../examples -Iexamples/eventdev_pipeline -I../examples/eventdev_pipeline -I. -I../ -Iconfig -I../config -Ilib/librte_eal/common/include -I../lib/librte_eal/common/include -I../lib/librte_eal/freebsd/eal/include -Ilib/librte_eal/common -I../lib/librte_eal/common -Ilib/librte_eal/common/include/arch/x86 -I../lib/librte_eal/common/include/arch/x86 -Ilib/librte_eal -I../lib/librte_eal -Ilib/librte_kvargs -I../lib/librte_kvargs -Ilib/librte_mempool -I../lib/librte_mempool -Ilib/librte_ring -I../lib/librte_ring -Ilib/librte_net -I../lib/librte_net -Ilib/librte_mbuf -I../lib/librte_mbuf -Ilib/librte_ethdev -I../lib/librte_ethdev -Ilib/librte_meter -I../lib/librte_meter -Ilib/librte_cmdline -I../lib/librte_cmdline -Ilib/librte_eventdev -I../lib/librte_eventdev -Ilib/librte_hash -I../lib/librte_hash -Ilib/librte_timer -I../lib/librte_timer -Ilib/librte_cryptodev -I../lib/librte_cryptodev -fdiagnostics-color=always -pipe -D_FILE_OFFSET_BITS=64 -Wall -Winvalid-pch -Werror -O2 -g -include rte_config.h -Wextra -Wcast-qual -Wdeprecated -Wformat-nonliteral -Wformat-security -Wmissing-declarations -Wmissing-prototypes -Wnested-externs -Wold-style-definition -Wpointer-arith -Wsign-compare -Wstrict-prototypes -Wundef -Wwrite-strings -Wno-address-of-packed-member -Wno-packed-not-aligned -Wno-missing-field-initializers -D_GNU_SOURCE -D__BSD_VISIBLE -march=native -Wno-format-truncation -MD -MQ 'examples/c590b3c@@dpdk-eventdev_pipeline at exe/eventdev_pipeline_pipeline_worker_generic.c.o' -MF 'examples/c590b3c@@dpdk-eventdev_pipeline at exe/eventdev_pipeline_pipeline_worker_generic.c.o.d' -o 'examples/c590b3c@@dpdk-eventdev_pipeline at exe/eventdev_pipeline_pipeline_worker_generic.c.o' -c ../examples/eventdev_pipeline/pipeline_worker_generic.c
In file included from ../lib/librte_eal/common/include/rte_trace.h:580,
                 from ../lib/librte_mempool/rte_trace_mempool_fp.h:18,
                 from ../lib/librte_mempool/rte_mempool.h:54,
                 from ../examples/eventdev_pipeline/pipeline_common.h:10,
                 from ../examples/eventdev_pipeline/pipeline_worker_generic.c:7:
../lib/librte_eal/common/include/rte_trace_provider.h: In function '__rte_trace_mem_get':
../lib/librte_eal/common/include/rte_trace_provider.h:54:3: error: '__rte_trace_mem_per_thread_alloc' is deprecated: Symbol is not yet part of stable ABI [-Werror=deprecated-declarations]
   54 |   __rte_trace_mem_per_thread_alloc();
      |   ^~~~~~~~~~~~~~~~~~~~~~~~~~~~~~~~
In file included from ../lib/librte_mempool/rte_trace_mempool_fp.h:18,
                 from ../lib/librte_mempool/rte_mempool.h:54,
                 from ../examples/eventdev_pipeline/pipeline_common.h:10,
                 from ../examples/eventdev_pipeline/pipeline_worker_generic.c:7:
../lib/librte_eal/common/include/rte_trace.h:534:6: note: declared here
  534 | void __rte_trace_mem_per_thread_alloc(void);
      |      ^~~~~~~~~~~~~~~~~~~~~~~~~~~~~~~~
cc1: all warnings being treated as errors
[1510/1650] Compiling C object 'examples/c590b3c@@dpdk-bbdev_app at exe/bbdev_app_main.c.o'.
[1511/1650] Compiling C object 'examples/c590b3c@@dpdk-eventdev_pipeline at exe/eventdev_pipeline_pipeline_worker_tx.c.o'.
FAILED: examples/c590b3c@@dpdk-eventdev_pipeline at exe/eventdev_pipeline_pipeline_worker_tx.c.o 
gcc -Iexamples/c590b3c@@dpdk-eventdev_pipeline at exe -Iexamples -I../examples -Iexamples/eventdev_pipeline -I../examples/eventdev_pipeline -I. -I../ -Iconfig -I../config -Ilib/librte_eal/common/include -I../lib/librte_eal/common/include -I../lib/librte_eal/freebsd/eal/include -Ilib/librte_eal/common -I../lib/librte_eal/common -Ilib/librte_eal/common/include/arch/x86 -I../lib/librte_eal/common/include/arch/x86 -Ilib/librte_eal -I../lib/librte_eal -Ilib/librte_kvargs -I../lib/librte_kvargs -Ilib/librte_mempool -I../lib/librte_mempool -Ilib/librte_ring -I../lib/librte_ring -Ilib/librte_net -I../lib/librte_net -Ilib/librte_mbuf -I../lib/librte_mbuf -Ilib/librte_ethdev -I../lib/librte_ethdev -Ilib/librte_meter -I../lib/librte_meter -Ilib/librte_cmdline -I../lib/librte_cmdline -Ilib/librte_eventdev -I../lib/librte_eventdev -Ilib/librte_hash -I../lib/librte_hash -Ilib/librte_timer -I../lib/librte_timer -Ilib/librte_cryptodev -I../lib/librte_cryptodev -fdiagnostics-color=always -pipe -D_FILE_OFFSET_BITS=64 -Wall -Winvalid-pch -Werror -O2 -g -include rte_config.h -Wextra -Wcast-qual -Wdeprecated -Wformat-nonliteral -Wformat-security -Wmissing-declarations -Wmissing-prototypes -Wnested-externs -Wold-style-definition -Wpointer-arith -Wsign-compare -Wstrict-prototypes -Wundef -Wwrite-strings -Wno-address-of-packed-member -Wno-packed-not-aligned -Wno-missing-field-initializers -D_GNU_SOURCE -D__BSD_VISIBLE -march=native -Wno-format-truncation -MD -MQ 'examples/c590b3c@@dpdk-eventdev_pipeline at exe/eventdev_pipeline_pipeline_worker_tx.c.o' -MF 'examples/c590b3c@@dpdk-eventdev_pipeline at exe/eventdev_pipeline_pipeline_worker_tx.c.o.d' -o 'examples/c590b3c@@dpdk-eventdev_pipeline at exe/eventdev_pipeline_pipeline_worker_tx.c.o' -c ../examples/eventdev_pipeline/pipeline_worker_tx.c
In file included from ../lib/librte_eal/common/include/rte_trace.h:580,
                 from ../lib/librte_mempool/rte_trace_mempool_fp.h:18,
                 from ../lib/librte_mempool/rte_mempool.h:54,
                 from ../examples/eventdev_pipeline/pipeline_common.h:10,
                 from ../examples/eventdev_pipeline/pipeline_worker_tx.c:7:
../lib/librte_eal/common/include/rte_trace_provider.h: In function '__rte_trace_mem_get':
../lib/librte_eal/common/include/rte_trace_provider.h:54:3: error: '__rte_trace_mem_per_thread_alloc' is deprecated: Symbol is not yet part of stable ABI [-Werror=deprecated-declarations]
   54 |   __rte_trace_mem_per_thread_alloc();
      |   ^~~~~~~~~~~~~~~~~~~~~~~~~~~~~~~~
In file included from ../lib/librte_mempool/rte_trace_mempool_fp.h:18,
                 from ../lib/librte_mempool/rte_mempool.h:54,
                 from ../examples/eventdev_pipeline/pipeline_common.h:10,
                 from ../examples/eventdev_pipeline/pipeline_worker_tx.c:7:
../lib/librte_eal/common/include/rte_trace.h:534:6: note: declared here
  534 | void __rte_trace_mem_per_thread_alloc(void);
      |      ^~~~~~~~~~~~~~~~~~~~~~~~~~~~~~~~
cc1: all warnings being treated as errors
[1512/1650] Compiling C object 'app/test/3062f5d@@dpdk-test at exe/test_compressdev.c.o'.
[1513/1650] Linking target examples/dpdk-cmdline.
[1514/1650] Compiling C object 'app/test/3062f5d@@dpdk-test at exe/test_memcpy_perf.c.o'.
[1515/1650] Compiling C object 'app/test/3062f5d@@dpdk-test at exe/test_trace_perf.c.o'.
[1516/1650] Compiling C object 'app/test/3062f5d@@dpdk-test at exe/test_ring.c.o'.
ninja: build stopped: subcommand failed




*Meson Build Failed #6:
OS: SUSE15-64
Target:./build-gcc-static
FAILED: examples/c590b3c@@dpdk-eventdev_pipeline at exe/eventdev_pipeline_pipeline_worker_generic.c.o 
gcc -Iexamples/c590b3c@@dpdk-eventdev_pipeline at exe -Iexamples -I../examples -Iexamples/eventdev_pipeline -I../examples/eventdev_pipeline -I. -I../ -Iconfig -I../config -Ilib/librte_eal/common/include -I../lib/librte_eal/common/include -I../lib/librte_eal/linux/eal/include -Ilib/librte_eal/common -I../lib/librte_eal/common -Ilib/librte_eal/common/include/arch/x86 -I../lib/librte_eal/common/include/arch/x86 -Ilib/librte_eal -I../lib/librte_eal -Ilib/librte_kvargs -I../lib/librte_kvargs -Ilib/librte_mempool -I../lib/librte_mempool -Ilib/librte_ring -I../lib/librte_ring -Ilib/librte_net -I../lib/librte_net -Ilib/librte_mbuf -I../lib/librte_mbuf -Ilib/librte_ethdev -I../lib/librte_ethdev -Ilib/librte_meter -I../lib/librte_meter -Ilib/librte_cmdline -I../lib/librte_cmdline -Ilib/librte_eventdev -I../lib/librte_eventdev -Ilib/librte_hash -I../lib/librte_hash -Ilib/librte_timer -I../lib/librte_timer -Ilib/librte_cryptodev -I../lib/librte_cryptodev -fdiagnostics-color=always -pipe -D_FILE_OFFSET_BITS=64 -Wall -Winvalid-pch -Werror -O2 -g -include rte_config.h -Wextra -Wcast-qual -Wdeprecated -Wformat-nonliteral -Wformat-security -Wmissing-declarations -Wmissing-prototypes -Wnested-externs -Wold-style-definition -Wpointer-arith -Wsign-compare -Wstrict-prototypes -Wundef -Wwrite-strings -Wno-missing-field-initializers -D_GNU_SOURCE -march=native -Wno-format-truncation -MD -MQ 'examples/c590b3c@@dpdk-eventdev_pipeline at exe/eventdev_pipeline_pipeline_worker_generic.c.o' -MF 'examples/c590b3c@@dpdk-eventdev_pipeline at exe/eventdev_pipeline_pipeline_worker_generic.c.o.d' -o 'examples/c590b3c@@dpdk-eventdev_pipeline at exe/eventdev_pipeline_pipeline_worker_generic.c.o' -c ../examples/eventdev_pipeline/pipeline_worker_generic.c
In file included from ../lib/librte_eal/common/include/rte_trace.h:580:0,
                 from ../lib/librte_mempool/rte_trace_mempool_fp.h:18,
                 from ../lib/librte_mempool/rte_mempool.h:54,
                 from ../examples/eventdev_pipeline/pipeline_common.h:10,
                 from ../examples/eventdev_pipeline/pipeline_worker_generic.c:7:
../lib/librte_eal/common/include/rte_trace_provider.h: In function ‘__rte_trace_mem_get’:
../lib/librte_eal/common/include/rte_trace_provider.h:54:3: error: ‘__rte_trace_mem_per_thread_alloc’ is deprecated: Symbol is not yet part of stable ABI [-Werror=deprecated-declarations]
   __rte_trace_mem_per_thread_alloc();
   ^~~~~~~~~~~~~~~~~~~~~~~~~~~~~~~~
In file included from ../lib/librte_mempool/rte_trace_mempool_fp.h:18:0,
                 from ../lib/librte_mempool/rte_mempool.h:54,
                 from ../examples/eventdev_pipeline/pipeline_common.h:10,
                 from ../examples/eventdev_pipeline/pipeline_worker_generic.c:7:
../lib/librte_eal/common/include/rte_trace.h:534:6: note: declared here
 void __rte_trace_mem_per_thread_alloc(void);
      ^~~~~~~~~~~~~~~~~~~~~~~~~~~~~~~~
cc1: all warnings being treated as errors
[1962/2161] Compiling C object 'examples/c590b3c@@dpdk-eventdev_pipeline at exe/eventdev_pipeline_pipeline_worker_tx.c.o'.
FAILED: examples/c590b3c@@dpdk-eventdev_pipeline at exe/eventdev_pipeline_pipeline_worker_tx.c.o 
gcc -Iexamples/c590b3c@@dpdk-eventdev_pipeline at exe -Iexamples -I../examples -Iexamples/eventdev_pipeline -I../examples/eventdev_pipeline -I. -I../ -Iconfig -I../config -Ilib/librte_eal/common/include -I../lib/librte_eal/common/include -I../lib/librte_eal/linux/eal/include -Ilib/librte_eal/common -I../lib/librte_eal/common -Ilib/librte_eal/common/include/arch/x86 -I../lib/librte_eal/common/include/arch/x86 -Ilib/librte_eal -I../lib/librte_eal -Ilib/librte_kvargs -I../lib/librte_kvargs -Ilib/librte_mempool -I../lib/librte_mempool -Ilib/librte_ring -I../lib/librte_ring -Ilib/librte_net -I../lib/librte_net -Ilib/librte_mbuf -I../lib/librte_mbuf -Ilib/librte_ethdev -I../lib/librte_ethdev -Ilib/librte_meter -I../lib/librte_meter -Ilib/librte_cmdline -I../lib/librte_cmdline -Ilib/librte_eventdev -I../lib/librte_eventdev -Ilib/librte_hash -I../lib/librte_hash -Ilib/librte_timer -I../lib/librte_timer -Ilib/librte_cryptodev -I../lib/librte_cryptodev -fdiagnostics-color=always -pipe -D_FILE_OFFSET_BITS=64 -Wall -Winvalid-pch -Werror -O2 -g -include rte_config.h -Wextra -Wcast-qual -Wdeprecated -Wformat-nonliteral -Wformat-security -Wmissing-declarations -Wmissing-prototypes -Wnested-externs -Wold-style-definition -Wpointer-arith -Wsign-compare -Wstrict-prototypes -Wundef -Wwrite-strings -Wno-missing-field-initializers -D_GNU_SOURCE -march=native -Wno-format-truncation -MD -MQ 'examples/c590b3c@@dpdk-eventdev_pipeline at exe/eventdev_pipeline_pipeline_worker_tx.c.o' -MF 'examples/c590b3c@@dpdk-eventdev_pipeline at exe/eventdev_pipeline_pipeline_worker_tx.c.o.d' -o 'examples/c590b3c@@dpdk-eventdev_pipeline at exe/eventdev_pipeline_pipeline_worker_tx.c.o' -c ../examples/eventdev_pipeline/pipeline_worker_tx.c
In file included from ../lib/librte_eal/common/include/rte_trace.h:580:0,
                 from ../lib/librte_mempool/rte_trace_mempool_fp.h:18,
                 from ../lib/librte_mempool/rte_mempool.h:54,
                 from ../examples/eventdev_pipeline/pipeline_common.h:10,
                 from ../examples/eventdev_pipeline/pipeline_worker_tx.c:7:
../lib/librte_eal/common/include/rte_trace_provider.h: In function ‘__rte_trace_mem_get’:
../lib/librte_eal/common/include/rte_trace_provider.h:54:3: error: ‘__rte_trace_mem_per_thread_alloc’ is deprecated: Symbol is not yet part of stable ABI [-Werror=deprecated-declarations]
   __rte_trace_mem_per_thread_alloc();
   ^~~~~~~~~~~~~~~~~~~~~~~~~~~~~~~~
In file included from ../lib/librte_mempool/rte_trace_mempool_fp.h:18:0,
                 from ../lib/librte_mempool/rte_mempool.h:54,
                 from ../examples/eventdev_pipeline/pipeline_common.h:10,
                 from ../examples/eventdev_pipeline/pipeline_worker_tx.c:7:
../lib/librte_eal/common/include/rte_trace.h:534:6: note: declared here
 void __rte_trace_mem_per_thread_alloc(void);
      ^~~~~~~~~~~~~~~~~~~~~~~~~~~~~~~~
cc1: all warnings being treated as errors
[1963/2161] Compiling C object 'examples/c590b3c@@dpdk-bond at exe/bond_main.c.o'.
[1964/2161] Compiling C object 'app/test/3062f5d@@dpdk-test at exe/test_compressdev.c.o'.
[1965/2161] Compiling C object 'examples/c590b3c@@dpdk-bbdev_app at exe/bbdev_app_main.c.o'.
[1966/2161] Compiling C object 'app/test/3062f5d@@dpdk-test at exe/test_link_bonding_mode4.c.o'.
[1967/2161] Compiling C object 'app/test/3062f5d@@dpdk-test at exe/test_memcpy_perf.c.o'.
[1968/2161] Compiling C object 'drivers/a715181@@tmp_rte_pmd_octeontx2_event at sta/event_octeontx2_otx2_worker.c.o'.
[1969/2161] Compiling C object 'app/test/3062f5d@@dpdk-test at exe/test_ring.c.o'.
[1970/2161] Compiling C object 'drivers/a715181@@tmp_rte_pmd_octeontx2_event at sta/event_octeontx2_otx2_worker_dual.c.o'.
ninja: build stopped: subcommand failed



DPDK STV team


More information about the test-report mailing list